{
  "$schema": "http://json-schema.org/draft-07/schema",
  "$id": "https://raw.githubusercontent.com/./master/nextflow_schema.json",
  "title": ". pipeline parameters",
  "description": "",
  "type": "object",
  "definitions": {
    "bids_params": {
      "title": "bids-params",
      "type": "object",
      "description": "BIDS input parameters",
      "default": "",
      "properties": {
        "bids": {
          "type": "string",
          "description": "Path to BIDS dataset",
          "format": "directory-path",
          "exists": true
        },
        "sub": {
          "type": "string",
          "description": "Comma-separated list of subjects",
          "pattern": "^([a-zA-Z0-9]+)(,[a-zA-Z0-9]+)*$"
        },
        "ses": {
          "type": "string",
          "description": "Comma-separated list of sessions",
          "pattern": "^([a-zA-Z0-9]+)(,[a-zA-Z0-9]+)*$"
        }
      },
      "required": ["bids"]
    }
  },
  "allOf": [
    {
      "$ref": "#/definitions/bids_params"
    }
  ]
}
