"","gene_slope","CL_slope","noise_vars","offset_mean","offset_sd"
"143B_BONE",1.48740595897105,0.833570555190699,0.261859923601151,1.15798634759804,0.0134418692401002
"22RV1_PROSTATE",0.709336152814666,1.46725645310749,0.481900125741959,1.52485447218691,0.0257180427164862
"2313287_STOMACH",1.1404916455856,1.17039216704464,0.206059992313385,1.79557375470011,0.00617421172296457
"697_HAEMATOPOIETIC_AND_LYMPHOID_TISSUE",0.752650497556446,1.46873667566354,0.473439604043961,1.97636026638817,0.00529814704592942
"769P_KIDNEY",0.918365284610378,1.11345522913567,0.287067294120789,1.2182420761898,0.00572835605880752
"786O_KIDNEY",1.08289623203583,0.720863139235523,0.227598890662193,1.08192945091099,0.017417100072319
"A1207_CENTRAL_NERVOUS_SYSTEM",0.620731605772041,1.05548154640625,0.610623180866241,1.01856980178706,0.0127900118361347
"A172_CENTRAL_NERVOUS_SYSTEM",0.666561611848055,1.37044927033801,0.456488639116287,1.70542839559764,0.0291474231662234
"A204_SOFT_TISSUE",0.544332347358125,1.27511435969573,0.407563239336014,1.5156972888016,0.00402559489666464
"A2058_SKIN",1.23658944454286,1.01100936098567,0.231036111712456,1.50764209489931,0.0252345159225636
"A375_SKIN",0.87348803764921,1.29905193045776,0.401972383260727,1.68248416130985,0.0053304020537488
"A3KAW_HAEMATOPOIETIC_AND_LYMPHOID_TISSUE",0.266322647560404,1.41953447485017,0.846841752529144,1.6017170600191,0.020734594413642
"A427_LUNG",1.31377759711884,0.575773996261947,0.222790479660034,0.724584791555553,0.0319852633833236
"A4FUK_HAEMATOPOIETIC_AND_LYMPHOID_TISSUE",0.613507087559353,1.20239375653474,0.437044620513916,1.66198691694714,0.016900622581545
"A549_LUNG",0.866413109729439,1.09565301482176,0.311827152967453,1.401437289159,0.00805604100013973
"A673_BONE",0.698056651712778,1.64678615423839,0.4705690741539,2.17869656327701,0.00661444943647961
"A704_KIDNEY",0.615690873694129,1.19217929158345,0.610866546630859,0.9930442404245,0.00650814842757158
"ABC1_LUNG",1.11010966541373,0.999621105483573,0.230145007371902,1.49389940758224,0.0158138561055614
"ACHN_KIDNEY",0.583036521346419,1.42894499295156,0.431428581476212,1.73619538636015,0.0129789007286231
"AGS_STOMACH",2.1087923897112,0.566266455847086,0.316213935613632,0.856827806450083,0.00312516349799964
"AM38_CENTRAL_NERVOUS_SYSTEM",0.895846928311955,0.897237334346316,0.302953988313675,1.08375085636293,0.00735331101824881
"AML193_HAEMATOPOIETIC_AND_LYMPHOID_TISSUE",1.30344156058748,0.670030582540858,0.227712601423264,1.05497666203465,0.0321152237285992
"AMO1_HAEMATOPOIETIC_AND_LYMPHOID_TISSUE",1.35989039397211,0.698756909603316,0.276317268610001,0.861903102429812,0.00236210385875371
"ASPC1_PANCREAS",0.798339476543091,1.44287723427974,0.44061690568924,1.81444048553549,0.00728184338369752
"AU565_BREAST",0.785245987395515,0.914320658927477,0.431614369153976,0.999105417806739,0.0226008917054739
"BFTC909_KIDNEY",0.893098731730965,1.05221384312456,0.285874009132385,1.29467971272557,0.00476746205116956
"BHY_UPPER_AERODIGESTIVE_TRACT",1.14545331407775,0.800291645531071,0.2622971534729,0.951950857244403,0.00404454273658512
"BICR22_UPPER_AERODIGESTIVE_TRACT",0.916293868498937,1.1892998188402,0.665768921375275,0.932948914094978,0.00592339593642205
"BICR56_UPPER_AERODIGESTIVE_TRACT",0.784859156666931,1.05610431345187,0.552475214004517,0.905430225662798,0.00747955265951725
"BICR6_UPPER_AERODIGESTIVE_TRACT",1.12289243818772,0.977674877513397,0.358246505260468,1.12789742458779,0.0119243745833295
"BT12_SOFT_TISSUE",1.04401442755429,1.10287786651164,0.271292746067047,1.34687558502578,0.0175512468396666
"BT16_SOFT_TISSUE",0.581470330082387,1.57967514625584,0.514503479003906,1.69403831409244,0.00556420750046735
"BT20_BREAST",1.16336377266158,0.904422691611487,0.266642838716507,1.36226090775383,0.0167857923561442
"BT474_BREAST",1.90931458716361,0.444402758032486,0.16647781431675,0.812633090011391,0.0170682255189994
"BXPC3_PANCREAS",0.980789208529418,1.12768280239738,0.295684307813644,1.52754229885156,0.0388806264113205
"C2BBE1_LARGE_INTESTINE",1.19448350607196,1.03668100274768,0.410647988319397,1.39559933715586,0.00505705265903979
"C32_SKIN",0.771131601619714,1.09060154477782,0.405159771442413,1.36049389579501,0.0107666781464722
"C8166_HAEMATOPOIETIC_AND_LYMPHOID_TISSUE",0.698311795414924,1.64281169892427,0.589901089668274,2.1774344929229,0.00652030953489538
"CACO2_LARGE_INTESTINE",0.895843160774402,1.09668634226869,0.70564466714859,0.604952135228373,0.0156353440286128
"CADOES1_BONE",0.700351709073662,1.47494516628428,0.664339184761047,1.69414018478538,0.00702733891627938
"CAKI2_KIDNEY",0.789848487022319,0.954785367982004,0.251583486795425,1.04969100891128,0.00781141981773846
"CAL120_BREAST",0.794769541423268,0.773241588810448,0.271888792514801,1.0515957941421,0.00763023028427993
"CAL12T_LUNG",1.07330461162349,1.04233532122194,0.303096622228622,1.25628457280177,0.00933734733823951
"CAL27_UPPER_AERODIGESTIVE_TRACT",0.678044384169909,1.57986456269479,0.381951808929443,2.02467546375055,0.0191656547784224
"CAL33_UPPER_AERODIGESTIVE_TRACT",0.897631994566716,1.35908827238001,0.305083155632019,1.86806670967483,0.0126263011562465
"CAL51_BREAST",0.911745809058992,1.17932382276825,0.898668766021729,1.04321108473597,0.0186947175501902
"CAL54_KIDNEY",0.829153749419206,1.0255294607642,0.577264308929443,0.674718363335558,0.00730456911083126
"CALU1_LUNG",0.754487889465697,1.02297492478428,0.403634756803513,1.35937268403163,0.006623023974997
"CALU3_LUNG",1.40484685259115,0.485271238005261,0.159189268946648,0.697689460906432,0.00806234225319504
"CALU6_LUNG",1.04380486653501,0.943557508791488,0.421186745166779,0.949139833861125,0.011445451077005
"CAOV3_OVARY",0.846378710873178,1.0322039620974,0.352535963058472,1.35865234786813,0.0103975978609493
"CAOV4_OVARY",0.862970825373278,0.781231005411751,0.292286396026611,1.02417969429674,0.0126892432897224
"CAS1_CENTRAL_NERVOUS_SYSTEM",0.633926956597786,1.00985464214461,0.882515609264374,0.461789804782921,0.0234379621051226
"CFPAC1_PANCREAS",1.37296303927238,0.606532200743221,0.244519352912903,0.909796747775378,0.0108826548082111
"CH157MN_CENTRAL_NERVOUS_SYSTEM",1.24770585460872,0.946698341692505,0.341522723436356,1.16961950634568,0.013765774489477
"CHAGOK1_LUNG",1.70888438543192,0.804484532996922,0.214427024126053,1.18606710064491,0.00808279754600355
"CJM_SKIN",1.08726828763372,1.16330412227363,0.20534560084343,1.627155363191,0.00602415459075334
"COLO205_LARGE_INTESTINE",1.28489775366359,0.770015627372446,0.239032953977585,1.19902175440113,0.00484191437768832
"COLO679_SKIN",0.558650807391766,1.68064359391781,0.652069985866547,1.73383966858299,0.00614051807681111
"COLO680N_OESOPHAGUS",1.34885087112219,0.853843650312237,0.191600620746613,1.11416123765513,0.00911632444013582
"COLO684_ENDOMETRIUM",1.21006339916807,0.889114112194778,0.37143212556839,0.914003291519785,0.015074409074261
"COLO699_LUNG",0.509740467455742,1.18431911398247,0.417283028364182,1.13125649929268,0.0315198518377271
"COLO704_OVARY",1.15996810597139,1.02603906445156,0.393318861722946,1.2599417766762,0.0195292330226724
"COLO741_SKIN",0.846852573127412,1.32413631051292,0.321641266345978,1.82727588966995,0.0125792346451647
"COLO783_SKIN",0.750567903727164,0.810275450385231,0.21495221555233,1.37705683652393,0.015337547733361
"COLO800_SKIN",0.727464799460627,1.39217546241292,0.614800631999969,1.45282917461219,0.0139294497732401
"COLO829_SKIN",0.787852474137677,1.35732644202747,0.429888606071472,1.63774826445962,0.00649681159899573
"CORL105_LUNG",0.649775292177968,1.05490966032455,0.273800522089005,1.31717654600628,0.0321901684438087
"CORL23_LUNG",1.32971519552006,0.733439422606232,0.344662696123123,0.945071639438498,0.00953862179325311
"CORL279_LUNG",0.762228060679296,1.26123216468459,0.610560536384583,1.01478827188931,0.0177278514552625
"CORL88_LUNG",1.09624850527436,0.601761089917859,0.159605801105499,0.896701325463656,0.0059249652114127
"COV362_OVARY",1.68042879732353,0.658714943360953,0.311320900917053,0.89979198767011,0.00632422595651847
"COV434_OVARY",0.935329526790787,1.1135354159379,0.3579421043396,1.34258067980223,0.00807665538765246
"COV504_OVARY",0.879914332254556,0.921005719654846,0.323570162057877,1.07758064092019,0.0175771217427932
"COV644_OVARY",0.843713667135239,1.27904362322624,0.496599107980728,1.38095063453692,0.00910982799588666
"CW9019_SOFT_TISSUE",0.665553131194659,1.2005325166972,0.365446597337723,1.28948705513171,0.00530794953086199
"D283MED_CENTRAL_NERVOUS_SYSTEM",0.751149370952074,1.06092309329274,0.503091156482697,0.950659244313345,0.00914866796397292
"D341MED_CENTRAL_NERVOUS_SYSTEM",0.631786704633396,1.17744781412961,0.706497848033905,0.651929093597538,0.00550562045079392
"D384_CENTRAL_NERVOUS_SYSTEM",0.79832425120265,0.9977040224682,0.829688608646393,0.129546879191787,0.00809883545424735
"D425_CENTRAL_NERVOUS_SYSTEM",1.07095105453459,0.79146827917013,0.413152277469635,0.688484920162039,0.00637674702551361
"D458_CENTRAL_NERVOUS_SYSTEM",0.832027735788229,1.14944107468024,0.429577857255936,1.12598644012808,0.0285201318817398
"D556_CENTRAL_NERVOUS_SYSTEM",0.683854303201411,1.33094827227601,0.667794585227966,1.26001541550823,0.0131827598070733
"DBTRG05MG_CENTRAL_NERVOUS_SYSTEM",0.674601417624587,1.27850189662707,0.424694180488586,1.29445183956491,0.00845887595184027
"DB_HAEMATOPOIETIC_AND_LYMPHOID_TISSUE",0.591173874623503,0.583981345968874,0.278339445590973,0.850853136410791,0.0166322790945792
"DKMG_CENTRAL_NERVOUS_SYSTEM",0.827432011142685,1.03549176001716,0.429905235767365,1.10008505701364,0.0245008297899048
"DLD1_LARGE_INTESTINE",1.84716922854847,0.3359708248132,0.146642431616783,0.678975019901972,0.0153290890275587
"DMS114_LUNG",0.769771448838435,0.84758417129699,0.438330322504044,0.77780196601841,0.0134785156682287
"DMS273_LUNG",1.1070945497775,1.0449023491296,0.284618943929672,1.29819694106467,0.00722711856250302
"DMS53_LUNG",0.669410752167661,1.80474162839212,0.79506903886795,2.28850082875164,0.0164890647574
"DND41_HAEMATOPOIETIC_AND_LYMPHOID_TISSUE",1.02893697661227,0.68453581393945,0.22289702296257,0.921812673476256,0.0213423960796165
"DU145_PROSTATE",0.886616538222726,1.10478471871027,0.278422087430954,1.29198680659376,0.014775461278351
"EBC1_LUNG",0.744832124151414,1.53892526186066,0.459489703178406,1.95387686619352,0.00787383214450104
"ECC10_STOMACH",1.9430489062624,0.297248717987445,0.155999422073364,0.503290738575676,0.0135421930164462
"ECGI10_OESOPHAGUS",0.721117119890935,0.789568352341053,0.316871047019958,0.928097217744046,0.0171748661629797
"EFE184_ENDOMETRIUM",1.54651625426967,0.781184270196244,0.252987265586853,1.19665851652309,0.013761698060955
"EFM19_BREAST",1.68276808278723,0.619984630237791,0.302439123392105,0.95867289236071,0.00346820979983077
"EFO21_OVARY",3.65435585452387,0.281900987379835,0.279623001813888,0.524382424352538,0.0297193202071034
"EFO27_OVARY",0.93812728087918,1.08347095190349,0.232472777366638,1.53284548700287,0.0229956596930469
"EKVX_LUNG",0.816206553126798,1.08434464489682,0.339307278394699,1.01288156632977,0.00247727578935154
"EN_ENDOMETRIUM",0.44101221548996,0.570307555089718,0.227728083729744,0.792049557972207,0.00885677727990692
"EPLC272H_LUNG",0.664460063176155,1.43146087027607,0.530385076999664,1.56079261006708,0.0159990497769302
"ES2_OVARY",0.830759149925526,1.24940475577217,0.318995147943497,1.53918431329542,0.0042120349089231
"ESS1_ENDOMETRIUM",0.931486333361103,1.14595667530661,0.341440618038177,1.31119540472038,0.00997729618818052
"EW8_BONE",0.669026622642962,1.1953026518108,0.260933041572571,1.61192541079666,0.0079807401519536
"EWS502_BONE",1.18456241568659,0.770853773614348,0.378221929073334,0.885818369576581,0.00586125668136638
"F36P_HAEMATOPOIETIC_AND_LYMPHOID_TISSUE",1.17862400269344,0.912264406720969,0.462381571531296,0.965784731790309,0.0209486932173577
"FADU_UPPER_AERODIGESTIVE_TRACT",0.849882310302845,1.33026494560894,0.359850227832794,1.79136288564055,0.0274769139399428
"FU97_STOMACH",0.655368233455381,0.509578731974857,0.325153410434723,0.656148619511814,0.00307898121982308
"G361_SKIN",0.627091040033068,1.34138894253253,0.704011201858521,0.985302429662424,0.00459362971871082
"G401_SOFT_TISSUE",0.758521923591242,1.32738237196295,0.633212804794312,1.15570924811949,0.0229715086904659
"G402_SOFT_TISSUE",0.599718700802176,1.44557644066653,0.556046307086945,1.31492737428089,0.0219725161269518
"GB1_CENTRAL_NERVOUS_SYSTEM",0.824420124451285,0.996118759052864,0.243242636322975,1.51995334994014,0.00802268317790176
"GP2D_LARGE_INTESTINE",1.48268032347496,0.886023864945798,0.250937163829804,1.49655762589346,0.00857301432755818
"GSS_STOMACH",1.0080786248433,0.968357056123042,0.246073618531227,1.31254243356355,0.00657053251322195
"GSU_STOMACH",0.894266970213253,1.27690667159393,0.492355406284332,1.24846923933066,0.0166165549861324
"HCC1143_BREAST",0.703369875714556,1.16592275759738,0.543095946311951,1.18289267838956,0.0121750103930331
"HCC1187_BREAST",1.30982628519493,0.629047562760606,0.308283478021622,1.04827554444278,0.0338330187073938
"HCC1359_LUNG",1.58218669865794,0.52031477951273,0.16129869222641,0.750832417516302,0.0168652921223543
"HCC1395_BREAST",1.12764729402518,0.805025293177357,0.291112065315247,1.01846066601762,0.0101288201555375
"HCC1428_BREAST",1.30055074324092,0.873724019069407,0.293913006782532,1.30622499210414,0.00697606591992517
"HCC1500_BREAST",1.00917871070283,0.974586179898647,0.313078254461288,1.23902783861975,0.019025769764211
"HCC1569_BREAST",0.987731917549813,0.303317802790733,0.127683997154236,0.482122515094124,0.00328133350379431
"HCC15_LUNG",0.847630513555732,1.06712853648719,0.327985316514969,1.22281397756112,0.0071067458785125
"HCC1806_BREAST",1.21160115482347,1.09677319144533,0.229212403297424,1.61715142571774,0.0224977945213673
"HCC1937_BREAST",1.4591363542456,0.763862359561203,0.382712244987488,0.781811681292851,0.0172540034727262
"HCC1954_BREAST",3.03871302175751,0.343526404267907,0.267994284629822,0.609349964990454,0.0149343357478934
"HCC202_BREAST",1.10170090041716,0.823272197566272,0.238722085952759,1.18504918327465,0.00917934162071685
"HCC2218_BREAST",1.8990777436804,0.434251374902717,0.200140476226807,0.800120335400851,0.00637022035568727
"HCC2429_LUNG",0.621288335037359,1.42398254423767,0.450356096029282,1.66939339802606,0.0216791961024753
"HCC2450_LUNG",1.11957050556256,0.809553098154697,0.285231858491898,0.982702359000912,0.00208463218897304
"HCC2814_LUNG",1.70958772222113,0.560606863683044,0.298364907503128,0.787162549095366,0.00372193520922949
"HCC33_LUNG",1.19122972053372,1.00655365737028,0.380003541707993,1.24427250336174,0.0104195675941388
"HCC364_LUNG",1.22508454055738,0.564225720294061,0.189529120922089,0.867982233934762,0.0104908643439445
"HCC366_LUNG",0.899418302197265,0.755576342947126,0.349567890167236,0.812662109094015,0.00784119879935405
"HCC38_BREAST",0.805403834940163,0.775812317502371,0.213557988405228,1.00622885028967,0.0198060344212026
"HCC44_LUNG",1.15910358822844,0.737360436644214,0.404097080230713,0.685262919944168,0.0114316909950709
"HCC461_LUNG",0.751012382729992,1.09767599573158,0.334670752286911,1.22106941554055,0.00364537724805393
"HCC515_LUNG",2.38661464303156,0.376038903926771,0.146115943789482,0.616648870557286,0.0170851969654279
"HCC70_BREAST",1.78500941359918,0.635947696899677,0.23117308318615,1.05603403854103,0.00414055600944219
"HCC827GR5_LUNG",1.03738209824859,0.924224636190524,0.272515118122101,1.23248691156017,0.0363079003492115
"HCC827_LUNG",0.972733920744237,1.01248104065844,0.656869411468506,0.827453417286634,0.0058669328044901
"HCC95_LUNG",0.695231316018743,0.770664464801257,0.307738155126572,0.896212977359014,0.0118704886909417
"HCT116_LARGE_INTESTINE",1.2052012415658,0.911292661989923,0.333327502012253,1.35032042095152,0.00788882754539498
"HEC1A_ENDOMETRIUM",0.706650875352423,1.58847519871779,0.489946722984314,1.95341874921558,0.00801526076877722
"HEC251_ENDOMETRIUM",1.07798454411128,1.23422758687181,0.277492225170135,1.75674146508337,0.0103904967290694
"HEC50B_ENDOMETRIUM",1.20205302731526,1.0302536779608,0.258670091629028,1.43585442879902,0.0129182004799087
"HEC59_ENDOMETRIUM",0.940653458845187,0.544398977540709,0.197040513157845,0.837677480841085,0.01607985043566
"HEKTE_KIDNEY",0.781640433547589,0.821180404253187,0.400613754987717,0.780064040233199,0.0212259567127466
"HELA_CERVIX",0.728718324283819,1.48358911253242,0.533824563026428,1.51404804311143,0.0308496686553502
"HEL_HAEMATOPOIETIC_AND_LYMPHOID_TISSUE",0.992677177358212,0.996286838147023,0.28680008649826,1.32192237938791,0.0177602822605574
"HEP3B217_LIVER",1.03229201264819,0.973295455892445,0.350901186466217,1.16075464905052,0.00429153406114892
"HEYA8_OVARY",1.00335426189316,1.08855501875978,0.303777694702148,1.43151543409137,0.0116563370992423
"HGC27_STOMACH",0.548253210902578,0.766605785830975,0.279981374740601,1.05556541252937,0.00610523086925961
"HK2_KIDNEY",1.04616030999936,0.515962838524829,0.179840996861458,0.712601981328767,0.00686191670931891
"HL60_HAEMATOPOIETIC_AND_LYMPHOID_TISSUE",1.01342198645946,0.677823046377013,0.700529217720032,0.0889410301682942,0.0190931978237228
"HLC1_LUNG",0.972440452950158,0.847701228412406,0.205314099788666,0.872204357124873,0.0433465284420866
"HLF_LIVER",0.663857859768831,1.54829910151764,0.323683083057404,2.07154536296377,0.00749715834374817
"HNT34_HAEMATOPOIETIC_AND_LYMPHOID_TISSUE",0.813687730717468,1.01320270398037,0.615411102771759,0.850154220464086,0.0396815507564083
"HOP62_LUNG",1.10647995709858,0.82634213152507,0.258692741394043,0.888257596982406,0.00442234149282686
"HPAC_PANCREAS",1.12021730928701,0.868240972283872,0.183288022875786,1.29528912246248,0.00325818544662186
"HPAFII_PANCREAS",1.17350635208679,0.967425382419089,0.425375789403915,1.03880240820713,0.0270896821103438
"HS294T_SKIN",0.752367765442274,1.22726574914492,0.4417884349823,1.11353482757887,0.0208476595588207
"HS578T_BREAST",0.919806719208005,0.755675892225716,0.482081383466721,0.717424969452372,0.00538479728167116
"HS683_CENTRAL_NERVOUS_SYSTEM",0.69183740842566,0.913646486606986,0.544088304042816,0.816874226390296,0.0528837827455806
"HS766T_PANCREAS",0.730212777857713,1.24775700327143,0.520982623100281,1.2882462158327,0.0150360986768157
"HS944T_SKIN",0.94084460432699,1.18857020712029,0.357142418622971,1.49704390011417,0.00668333694646359
"HSC2_UPPER_AERODIGESTIVE_TRACT",0.862121509943556,1.00555465512979,0.363157123327255,1.20772738721943,0.0208206597494174
"HSC3_UPPER_AERODIGESTIVE_TRACT",1.13209112269261,1.00835659252896,0.305161476135254,1.19091827020326,0.00509300496162368
"HT1080_SOFT_TISSUE",0.757040351214818,1.23685401853609,0.801020503044128,0.921455341397818,0.0132181189547665
"HT1197_URINARY_TRACT",1.28752106138614,0.818190102886968,0.460927724838257,0.876261758747126,0.0159912905859585
"HT144_SKIN",0.752920681604361,1.17357958831845,0.222404062747955,1.50914013122095,0.0291425961665062
"HT29_LARGE_INTESTINE",1.70256322844215,0.736118407527122,0.248539134860039,1.22752679369317,0.0102904161470968
"HT55_LARGE_INTESTINE",2.12491643248413,0.484053918278954,0.298927396535873,0.771666365845821,0.0209758090066167
"HUG1N_STOMACH",0.964484934427489,1.07610693830782,0.472162008285523,1.23285008251675,0.0103322846312257
"HUH1_LIVER",0.981120680657805,0.854868029577703,0.315312564373016,0.91784173498516,0.0240788769221426
"HUPT3_PANCREAS",1.59180677186544,0.783569148703832,0.235362127423286,1.01927856503535,0.00231903854928986
"HUTU80_SMALL_INTESTINE",0.919317635891103,1.10993111218524,0.503854691982269,1.10695428013172,0.0188155877298698
"IALM_LUNG",0.89626735960774,1.22963609563933,0.554497301578522,1.27266509880907,0.031721583117536
"IGR1_SKIN",0.56017742999758,1.5728086759524,0.582189321517944,1.73233098850041,0.0295868185459963
"IGR39_SKIN",0.726075129456999,0.86567853844037,0.295931726694107,0.9227898947349,0.00751927847954327
"IGROV1_OVARY",1.86834674571886,0.562098829334364,0.401334553956985,0.682891808486189,0.00825807843075771
"IM95_STOMACH",0.732447036458086,1.48687053588014,0.525703191757202,1.62684104789026,0.00594812232091137
"INA6_HAEMATOPOIETIC_AND_LYMPHOID_TISSUE",0.890481985325691,1.26860288536057,0.681635677814484,1.49328932180245,0.0109740954686184
"IOMMLEE_CENTRAL_NERVOUS_SYSTEM",0.694195320308532,1.54242746726501,0.40069916844368,1.9145545994526,0.0200287512221335
"IPC298_SKIN",0.986008353079015,0.881843435410265,0.408543795347214,0.81671795739707,0.00463947687083204
"JHESOAD1_OESOPHAGUS",1.15622516880163,1.07363225064648,0.309452027082443,1.44882812026979,0.0192704678480036
"JHH1_LIVER",1.05336352064956,0.915832137567412,0.244424596428871,1.21091024425875,0.00867253030528206
"JHH5_LIVER",1.15859114531583,0.887887663739809,0.267068684101105,0.962217564024218,0.0200617880613618
"JHOC5_OVARY",1.19653150496201,1.03364165579852,0.241621449589729,1.4325312008226,0.00630145902882996
"JHOM1_OVARY",1.29446463310501,0.390220167745969,0.301837563514709,0.612880296070276,0.010969200412585
"JHOS2_OVARY",1.32180391820929,0.608107238722633,0.283048570156097,0.733599605835493,0.0212527543863215
"JHUEM2_ENDOMETRIUM",0.75140060722264,1.32304239698123,0.665066301822662,1.26641024384829,0.0071417861525239
"JJN3_HAEMATOPOIETIC_AND_LYMPHOID_TISSUE",0.837443155078948,1.30398483840411,0.607251286506653,1.30154569730177,0.00458577130154294
"JR_SOFT_TISSUE",0.650985104014321,1.64209119162057,0.623121201992035,1.94476451836888,0.012571235532824
"K029AX_SKIN",0.633739535591608,1.63345450512384,0.510861039161682,2.02221488579991,0.0180532987262657
"K562_HAEMATOPOIETIC_AND_LYMPHOID_TISSUE",1.38971207221897,0.72471516740179,0.285748720169067,1.14792147784738,0.00980904607665381
"KALS1_CENTRAL_NERVOUS_SYSTEM",0.703044496919998,1.05135195888792,0.664659559726715,0.659403808722045,0.0302246467671317
"KARPAS422_HAEMATOPOIETIC_AND_LYMPHOID_TISSUE",0.636242642820266,0.999143703990087,0.5809206366539,1.11821061092686,0.00562241041031582
"KASUMI1_HAEMATOPOIETIC_AND_LYMPHOID_TISSUE",1.50277156388417,0.376078983565538,0.371173679828644,0.392956462897658,0.00440503338248138
"KATOIII_STOMACH",1.04219776764477,1.14690636208004,0.410284101963043,1.46814543984619,0.0128886628005746
"KD_SOFT_TISSUE",0.591739999519005,1.25714343240542,0.653519809246063,0.710425385493652,0.0333968594479929
"KE39_STOMACH",1.35073602014894,0.613218862418097,0.114234164357185,0.94356923992463,0.0113710807122719
"KM12_LARGE_INTESTINE",1.13279586375221,1.06163740523579,0.263265579938888,1.65302277336482,0.0343584483829629
"KMM1_HAEMATOPOIETIC_AND_LYMPHOID_TISSUE",0.600129385929129,1.53496518900983,0.59854930639267,1.86369920337619,0.0138265287500665
"KMRC1_KIDNEY",0.555532537954901,1.12037434063699,0.59874427318573,0.607389792970777,0.0312621602371466
"KMRC2_KIDNEY",0.536989997310933,0.496339952081175,0.194441512227058,0.711291125982239,0.00919099180572906
"KMS12BM_HAEMATOPOIETIC_AND_LYMPHOID_TISSUE",0.707635955896092,1.04009398385802,0.356898695230484,1.39811414176778,0.00775557667359342
"KMS18_HAEMATOPOIETIC_AND_LYMPHOID_TISSUE",0.802033562949927,1.26105669081206,0.467009246349335,1.75677954877321,0.00924949515843515
"KNS60_CENTRAL_NERVOUS_SYSTEM",1.03884905756259,0.863879830058602,0.351729601621628,1.04004099377885,0.00904055437510032
"KNS62_LUNG",0.989395663108172,1.1978658487719,0.368705362081528,1.57159105439397,0.030504218748283
"KNS81_CENTRAL_NERVOUS_SYSTEM",0.843449153354799,0.805018105320785,0.328512042760849,0.973974612471435,0.00473986363992014
"KP1NL_PANCREAS",1.07903509949871,0.929154523593163,0.238942593336105,1.38168512976693,0.0357959222236617
"KP2_PANCREAS",0.631093737807076,0.919387813178836,0.836843430995941,0.399769448946976,0.00698729700501281
"KP4_PANCREAS",1.04394856751065,0.726194323407215,0.15583373606205,1.13496370092653,0.0212405072432168
"KPL1_BREAST",1.12465945256483,0.863639303993234,0.328125804662705,1.0344676278485,0.00472638633417649
"KURAMOCHI_OVARY",1.62919600954939,0.762128625244462,0.29662561416626,1.04108247603556,0.0307470363479935
"KYSE140_OESOPHAGUS",1.11205291117855,1.03060885986209,0.175985649228096,1.35110205207492,0.00290019014047619
"KYSE150_OESOPHAGUS",0.739038465834097,1.3059114722801,0.236139908432961,1.79377684177491,0.0111388216385056
"KYSE180_OESOPHAGUS",0.940162504926452,0.922226476848754,0.148691952228546,1.2529963208818,0.00369947153910996
"KYSE30_OESOPHAGUS",1.272174690925,1.01276090318641,0.401615470647812,1.33578857379381,0.00665080682218816
"KYSE450_OESOPHAGUS",1.07195719383025,0.951628362863865,0.234577536582947,1.50267804067839,0.0119964748299801
"KYSE510_OESOPHAGUS",0.981618831337965,1.0522614897829,0.201595470309258,1.52054271845122,0.0109220992669561
"KYSE520_OESOPHAGUS",1.06643837868598,0.955568435133854,0.244527831673622,1.29132313126103,0.0181526225469408
"KYSE70_OESOPHAGUS",0.926153206367278,1.33616266562562,0.257203668355942,1.84027921664612,0.00217747651457194
"L33_PANCREAS",1.49453968114653,0.66725971777121,0.255309611558914,0.939141819374303,0.0261755960329658
"L363_HAEMATOPOIETIC_AND_LYMPHOID_TISSUE",0.740145010530666,1.45272101078758,0.495627105236054,1.94786748635941,0.0142119310128135
"LAMA84_HAEMATOPOIETIC_AND_LYMPHOID_TISSUE",1.77684987141936,0.698701910976331,0.38281923532486,1.0073249678543,0.0166862070251921
"LC1SQSF_LUNG",0.628408720591406,0.823606456298545,0.306798428297043,1.08633783616703,0.022230273801483
"LCLC103H_LUNG",0.922532779961647,0.909793405893316,0.432933747768402,0.588604295129596,0.0161897589935826
"LCLC97TM1_LUNG",1.04570556068535,0.947479840108013,0.315420031547546,1.02689265005162,0.0220301179817382
"LK2_LUNG",1.10901393899206,0.986892544721775,0.29605495929718,1.25458910492317,0.0210137488576256
"LN18_CENTRAL_NERVOUS_SYSTEM",0.713780153301864,1.37514371384912,0.407631099224091,1.7262953030856,0.0192825942748917
"LN215_CENTRAL_NERVOUS_SYSTEM",0.930214091818954,1.06689594937355,0.351620763540268,1.3399951661748,0.0125465658614172
"LN229_CENTRAL_NERVOUS_SYSTEM",0.743209526391693,1.4470057009522,0.280555665493011,1.95974686783451,0.0214796011908897
"LN235_CENTRAL_NERVOUS_SYSTEM",1.17395206103644,0.542799521790043,0.586135447025299,0.300194888690996,0.00872724408596623
"LN319_CENTRAL_NERVOUS_SYSTEM",1.93372378509402,0.299482000560418,0.375269293785095,0.548478665216945,0.0220060647827469
"LN340_CENTRAL_NERVOUS_SYSTEM",0.749938779647343,1.12660831872022,0.342002093791962,1.53879466124484,0.0300346407762365
"LN382_CENTRAL_NERVOUS_SYSTEM",1.05537331093693,0.80286735643806,0.245539799332619,1.24981793390587,0.00524074105565838
"LN428_CENTRAL_NERVOUS_SYSTEM",1.18849816335599,0.985281870568985,0.258174180984497,1.28613253257874,0.00384481527107503
"LN443_CENTRAL_NERVOUS_SYSTEM",0.629764645896131,0.940933634633997,0.400752902030945,1.25231546915483,0.0168911811045261
"LN464_CENTRAL_NERVOUS_SYSTEM",1.10170630624131,0.935495332801232,0.341165274381638,1.33324320602771,0.0159392589107152
"LNCAPCLONEFGC_PROSTATE",0.766496413007275,1.36739790838272,0.667472064495087,1.42641948761634,0.00755694239842647
"LNZ308_CENTRAL_NERVOUS_SYSTEM",1.06134700300137,0.59402481243973,0.302113175392151,0.953122018107256,0.00826100730558385
"LOUNH91_LUNG",0.480468634672826,1.44824200215253,0.789279699325562,1.23670955507088,0.00541687085255411
"LOVO_LARGE_INTESTINE",1.07036747013651,0.947499609540767,0.312688440084457,1.22316378401424,0.00858651929147677
"LOXIMVI_SKIN",1.09025646880961,0.807834948896727,0.440572291612625,0.890267917052618,0.0167411445007287
"LS180_LARGE_INTESTINE",0.724057835236879,1.53278637379997,0.443001627922058,1.87957707834684,0.0127100253711018
"LS411N_LARGE_INTESTINE",1.45592646871935,0.526463205618501,0.259595066308975,0.828146918482526,0.0249454401163513
"LS513_LARGE_INTESTINE",0.904181542377839,1.21010468673319,0.37565615773201,1.40786717062338,0.0145901422571565
"LU65_LUNG",0.853659763573594,1.3506177394701,0.336350619792938,1.81503072364771,0.0148363148020783
"LU99_LUNG",0.751257976994202,1.66765074747972,0.500307023525238,2.06599536415055,0.0102764153584857
"LUDLU1_LUNG",1.42736772360103,0.644752898888653,0.175697937607765,0.900099178373502,0.0108313170443005
"LXF289_LUNG",1.05778787260456,0.978964428391708,0.262709081172943,1.12493598801319,0.0218519906098992
"M059K_CENTRAL_NERVOUS_SYSTEM",0.747927227676042,1.16227660848944,0.713397443294525,0.733393904606004,0.0129734799939811
"MCF7_BREAST",1.77808475635449,0.478256522135908,0.276151806116104,0.681071592956588,0.00259271483873954
"MDAMB157_BREAST",0.494621124596263,0.671021535709212,0.280781090259552,0.786374197376802,0.00471463520791622
"MDAMB175VII_BREAST",0.862048706643151,0.799110880816648,0.220749914646149,1.19168218020074,0.00200493501934586
"MDAMB231_BREAST",0.850466555522021,1.43142335403762,0.578610360622406,1.43467731584321,0.0180280159597652
"MDAMB361_BREAST",1.04843731505755,0.715356773935606,0.188759565353394,0.98693694556017,0.0158061427636825
"MDAMB415_BREAST",0.830105856613264,0.712586450549144,0.158421322703362,1.07220282791418,0.032621526675441
"MDAMB435S_SKIN",0.817956294738877,1.22136569803511,0.395802527666092,1.46439324318462,0.0200347336388544
"MDAMB436_BREAST",0.901151154688779,1.36472417094853,0.403761237859726,1.55747076261341,0.0171783517769462
"MDAMB453_BREAST",2.89854304279371,0.297307167363423,0.224285081028938,0.640896843140347,0.0280735516936843
"MDAMB468_BREAST",1.18520379383015,0.993220179928942,0.296924442052841,1.28689739883477,0.00791966721260152
"MDAPCA2B_PROSTATE",1.03057107301347,1.05246209825146,0.35892790555954,1.31334889953085,0.0185071608547417
"MELHO_SKIN",0.590661496638363,1.55227634122816,0.480772167444229,1.81682928817745,0.00306401721079306
"MELJUSO_SKIN",0.827237780372016,1.4098170425216,0.233567699790001,1.9611935699472,0.0150409467154064
"MEWO_SKIN",0.779084574355689,1.35020906519555,0.317602843046188,1.73016887754718,0.0189019242098446
"MFE280_ENDOMETRIUM",1.13875325377893,0.625845560641481,0.284723252058029,0.754128885778859,0.0177188119302772
"MHHES1_BONE",0.619386885746908,1.24250586274304,0.238819047808647,1.52247935465216,0.0075358582004235
"MIAPACA2_PANCREAS",1.02648626610856,1.18362582672477,0.327220171689987,1.49737023372777,0.00734886045998015
"MKL1_SKIN",0.828078998564808,1.0727486391864,0.320263266563416,1.36472308973815,0.00609658757668176
"MKL2_SKIN",0.691980255760965,0.671733577717719,0.250038295984268,0.876001510757633,0.00521704939700615
"MKN1_STOMACH",1.16227608005309,0.981399978816105,0.297848761081696,1.1784496031244,0.00572762192760403
"MKN45_STOMACH",0.942751063991379,1.11972890451682,0.237285166978836,1.50163634962513,0.0199750252913963
"MKN7_STOMACH",1.16087843067979,0.85606957272347,0.30396631360054,1.10413786041799,0.0165934635517889
"MM1S_HAEMATOPOIETIC_AND_LYMPHOID_TISSUE",0.588498530247315,0.83162611631726,0.496706396341324,1.17621937137708,0.00968108663822083
"MOLM13_HAEMATOPOIETIC_AND_LYMPHOID_TISSUE",0.820687590330604,1.30776964333447,0.731190323829651,1.16688033282074,0.0231726879400147
"MONOMAC1_HAEMATOPOIETIC_AND_LYMPHOID_TISSUE",0.969102343636721,0.937770453834814,0.632815480232239,0.773918575042258,0.00498110948505147
"MONOMAC6_HAEMATOPOIETIC_AND_LYMPHOID_TISSUE",2.03489507545633,0.403444445841476,0.213843002915382,0.705429974070575,0.0114556400200905
"MORCPR_LUNG",1.67130359429792,0.676152890038234,0.154242977499962,1.0776550619647,0.0289642490497254
"MV411_HAEMATOPOIETIC_AND_LYMPHOID_TISSUE",0.745486992370133,1.08461627308823,0.661164879798889,0.881564568036796,0.0143786473296667
"NALM6_HAEMATOPOIETIC_AND_LYMPHOID_TISSUE",0.616772689357052,1.24221846042688,0.331759810447693,1.79844636235632,0.00800984957186707
"NB4_HAEMATOPOIETIC_AND_LYMPHOID_TISSUE",0.738500332412008,1.41654204637161,0.421874165534973,1.82949702896217,0.029094897864143
"NCCSTCK140_STOMACH",0.944262692694919,0.625459760002393,0.171737089753151,0.87518009371068,0.0201633566317872
"NCIH1048_LUNG",0.773543144333695,1.42501657890314,0.442133009433746,1.89603238713816,0.00915097688611573
"NCIH1105_LUNG",1.1477589751142,0.696853872522269,0.250016629695892,0.948307890331774,0.0153187452035475
"NCIH1155_LUNG",0.713129388702853,1.4228751595459,0.506561875343323,1.6913019543063,0.00341755023952988
"NCIH1299_LUNG",2.31251696438118,0.434181602291913,0.180856764316559,0.780362232002628,0.00674217301592209
"NCIH1339_LUNG",1.09998597391855,0.965801626563839,0.675315320491791,0.840684912864713,0.00331375758427856
"NCIH1355_LUNG",1.63081735279851,0.407359779854372,0.117823116481304,0.726866673635417,0.0100328021089943
"NCIH1373_LUNG",1.03299578655007,0.969577939917292,0.285256147384644,1.25320497963132,0.0250199343081651
"NCIH1395_LUNG",0.690645012271125,1.57135950218158,0.517957270145416,1.74988785419359,0.00577880295644272
"NCIH1437_LUNG",1.25848607678082,0.87859443274589,0.273959636688232,1.11847177000928,0.0128963244905565
"NCIH146_LUNG",0.714306196167269,1.12925851356326,0.486393719911575,1.46049433400047,0.00336336326194587
"NCIH1568_LUNG",2.05263408244811,0.570376891591121,0.242991909384728,0.804753003260608,0.00772822061400639
"NCIH1581_LUNG",1.48965379348494,0.502622381772676,0.287526696920395,0.370017732970069,0.025086163483598
"NCIH1623_LUNG",1.01549205580751,1.06036580451607,0.31122949719429,1.28655263271792,0.00703140761871746
"NCIH1648_LUNG",0.580081898445633,0.399630331708755,0.290114909410477,0.456384074156117,0.00615030289301302
"NCIH1650_LUNG",1.47079993810466,0.674906307986549,0.275376468896866,1.01023288548062,0.0279724364655101
"NCIH1666_LUNG",0.866746244497643,1.20110050485973,0.525648474693298,1.23621059776234,0.00316736035262289
"NCIH1693_LUNG",0.812389941819377,1.37648690514468,0.324133336544037,1.72929267053259,0.00563200728138747
"NCIH1694_LUNG",0.874421038694143,1.01140715512962,0.320358008146286,1.19512937553063,0.0149424535481555
"NCIH1703_LUNG",0.953462302079945,1.0614776518984,0.401363521814346,1.19219422832433,0.00695375766114242
"NCIH1792_LUNG",1.00327519160678,1.00280811225282,0.248778581619263,1.40383363224902,0.0107879621021394
"NCIH1836_LUNG",0.910182959425758,0.787371232802458,0.324616372585297,0.908783619647723,0.0459637181086447
"NCIH1876_LUNG",0.720909141291724,1.11188816176493,0.325868189334869,1.42354611382009,0.0128183782452703
"NCIH1915_LUNG",0.552235068278223,1.27096291716105,0.656975924968719,0.961275034972477,0.00313584314953846
"NCIH1944_LUNG",1.0704925530602,1.20773926089201,0.2942074239254,1.51534564395286,0.0120967909176536
"NCIH196_LUNG",1.36464134800383,0.606862337370045,0.254429817199707,0.934966825976663,0.0126140696907145
"NCIH1975_LUNG",0.657062807744932,1.16040595260529,0.359458327293396,1.34445062846655,0.0231088116841185
"NCIH2004RT_SOFT_TISSUE",0.470198831113576,1.32800589755172,0.798051238059998,1.05134209220804,0.0144300740587817
"NCIH2009_LUNG",0.927659506099711,0.99338254249527,0.324781388044357,1.0610355518117,0.00397831766553509
"NCIH2023_LUNG",0.794376810748386,1.22332300588961,0.251688897609711,1.51368466401777,0.00949746183859936
"NCIH2030_LUNG",1.36575374786816,0.614536283619698,0.278301239013672,0.563431952175464,0.00282729139703691
"NCIH2052_PLEURA",0.963986551144151,0.876188684623307,0.412674486637115,0.988007138134832,0.00644535693481884
"NCIH2066_LUNG",1.34414022342912,0.532586147573538,0.223781928420067,0.608759320528612,0.00590690396037557
"NCIH2087_LUNG",1.18572225589953,0.96272722092703,0.327645808458328,0.971889125365989,0.00478799235958386
"NCIH209_LUNG",0.589390468638675,1.33207070228592,0.410830467939377,1.91741712285548,0.01119793343814
"NCIH2110_LUNG",1.25166907208156,1.02256830361295,0.194626718759537,1.44817086508589,0.0215887335442908
"NCIH211_LUNG",1.35747681334828,0.671335002474359,0.202880933880806,1.06491477832621,0.00359735735375313
"NCIH2122_LUNG",0.824575737353017,1.34126446519809,0.49439001083374,1.40679794561901,0.00413411555234414
"NCIH2126_LUNG",1.18295422711623,0.696197280158936,0.19382843375206,0.704333005720389,0.00568342993613023
"NCIH2170_LUNG",0.741368708175141,1.2916287568554,0.318047434091568,1.60826184588026,0.0197851984020143
"NCIH2171_LUNG",0.706164517103682,1.21353105323204,0.361931502819061,1.57508722041132,0.0086416406290706
"NCIH2286_LUNG",0.771892250365309,1.24896851348625,0.667357444763184,0.94975681972094,0.0383316848220475
"NCIH2291_LUNG",0.985331175100072,1.02239728009019,0.393381923437118,0.924497181134612,0.00855212340320448
"NCIH23_LUNG",1.65861439111837,0.626922996643727,0.196805998682976,1.05430263713717,0.0107399371735758
"NCIH2405_LUNG",0.925564035165194,1.14165739703836,0.505345940589905,1.10922511904105,0.00987703474991271
"NCIH2452_PLEURA",0.671922690083201,1.2524039579785,0.534361839294434,1.15292974841292,0.0246676709776609
"NCIH2882_LUNG",0.905084678444908,0.4920115543843,0.28812313079834,0.483435164804754,0.0337526336569922
"NCIH2887_LUNG",0.660834978027748,1.4743491290463,0.674247443675995,1.54417784546876,0.0310489600493214
"NCIH292_LUNG",1.00838112757387,1.14507282684119,0.509617269039154,1.18627913196405,0.01328431187278
"NCIH3122_LUNG",1.07454683278858,0.941555480000949,0.264995127916336,1.10523045587521,0.00944283178749488
"NCIH322_LUNG",1.38661667515217,0.938635300742724,0.251207262277603,1.26531640971366,0.0200717359016522
"NCIH3255_LUNG",1.45089302205899,0.446781123216809,0.201780691742897,0.555985469298714,0.00489546540980881
"NCIH358_LUNG",1.32939784003559,0.930805439593545,0.222753614187241,1.2203043228333,0.0162715033692059
"NCIH441_LUNG",1.37565350168006,0.51617418633924,0.332665055990219,0.701352678957503,0.0118804815466982
"NCIH460_LUNG",0.837852118203135,1.47608031725876,0.332158207893372,1.84030693066314,0.0130781394070459
"NCIH508_LARGE_INTESTINE",1.30849999321551,0.684238833969612,0.293404459953308,0.887148159791677,0.0192346207879728
"NCIH520_LUNG",0.685762891538356,1.23370589871633,0.494946777820587,1.49987189477478,0.0124000053812816
"NCIH522_LUNG",0.715975921367946,0.633686896258261,0.255876779556274,0.838347196443927,0.032416879920695
"NCIH526_LUNG",0.909873188819413,0.258409568324061,0.14838020503521,0.388463802178991,0.0105629136126414
"NCIH647_LUNG",1.03580209356826,1.02933324771562,0.519042730331421,0.749134394754539,0.00509833578886621
"NCIH650_LUNG",1.00292124639078,0.726664251056794,0.190421804785728,0.971510937046566,0.0187092773366368
"NCIH660_PROSTATE",2.80048279212593,0.158716216716926,0.254258692264557,0.3215579874459,0.00459228279472003
"NCIH661_LUNG",1.65865493810146,0.518404586582363,0.223594203591347,0.812007323972036,0.0091062997156387
"NCIH716_LARGE_INTESTINE",0.931405252464004,1.11060096626234,0.457899004220963,1.04329828294278,0.0258281904217076
"NCIH727_LUNG",0.88281471477911,1.0995862138361,0.25828018784523,1.35092306328382,0.0116647343054145
"NCIH838_LUNG",0.990828376849914,1.23038244272873,0.542345404624939,1.39436410403778,0.0095658592011746
"NCIH841_LUNG",0.84305260565682,1.09102913316747,0.258738577365875,1.18884119892805,0.00943607396029956
"NCIH854_LUNG",2.10843998097079,0.330298702165043,0.401681154966354,0.34275146058937,0.00349767284816842
"NCIN87_STOMACH",0.993218792888543,1.05876259851891,0.364996731281281,1.1807562713207,0.0107236060248049
"NIHOVCAR3_OVARY",0.992241592567398,1.18292378506496,0.362505108118057,1.63978330578445,0.0120601895735025
"NOMO1_HAEMATOPOIETIC_AND_LYMPHOID_TISSUE",0.993120380255998,0.800011799716631,0.772428393363953,0.372829262825907,0.00842993194642961
"NUGC3_STOMACH",0.948515181511477,1.23551024503037,0.213857099413872,1.7226595416935,0.0118843255003962
"OAW42_OVARY",1.44657895982631,0.775687956626733,0.272694230079651,1.09510157616954,0.0061224614795811
"OC314_OVARY",0.83472968460203,1.16365563618668,0.293685585260391,1.39961430203635,0.0224731487377129
"OCIAML2_HAEMATOPOIETIC_AND_LYMPHOID_TISSUE",0.840702787040162,1.33493751565669,0.512973487377167,1.55080305202618,0.00739018630891128
"OCIAML3_HAEMATOPOIETIC_AND_LYMPHOID_TISSUE",0.927663324606461,1.02368770630936,0.496796816587448,1.22621407431738,0.0125156883819441
"OCIAML5_HAEMATOPOIETIC_AND_LYMPHOID_TISSUE",0.849748040336849,1.29330390394212,0.491517752408981,1.46509558098829,0.00811298420668739
"OCIMY7_HAEMATOPOIETIC_AND_LYMPHOID_TISSUE",0.608466728489696,1.15256744464513,0.599027216434479,1.27774675537714,0.00710934769409089
"OE33_OESOPHAGUS",0.907826285426101,1.21163902429471,0.336427956819534,1.65855534633027,0.0190956361654946
"OELE_OVARY",1.0169841800994,0.820497787093981,0.7085080742836,0.158507714028774,0.00875097699123512
"OPM1_HAEMATOPOIETIC_AND_LYMPHOID_TISSUE",0.596611438026599,1.5530322515474,0.596645176410675,2.04662129228435,0.0126573062435698
"OPM2_HAEMATOPOIETIC_AND_LYMPHOID_TISSUE",0.676406505059362,1.38310494115132,0.571757197380066,1.60682165726956,0.0156127688402817
"OSRC2_KIDNEY",0.488192397895584,1.45681749331337,0.45194599032402,1.6299710412657,0.0109978480153518
"OV7_OVARY",0.691308913484071,0.648168229659167,0.550784766674042,0.338804998652492,0.00660618909527661
"OV90_OVARY",0.699639851600077,1.28245428540578,0.517164826393127,1.17183970704374,0.0124452093346923
"OVCAR4_OVARY",0.953370567173289,1.16492908811986,0.447847336530685,1.21949581458636,0.0183477654004387
"OVCAR8_OVARY",0.917398140588147,1.33868781466974,0.474223524332047,1.76266947367013,0.0280956927085392
"OVISE_OVARY",1.57503098618647,0.789003353530308,0.287489771842956,1.20069227384083,0.00589928738480343
"OVTOKO_OVARY",0.704217624076482,0.787833754682713,0.451186239719391,0.442505745887612,0.00247515595441826
"PANC0327_PANCREAS",1.28786683728715,0.860150784195736,0.439031720161438,0.86335253074268,0.00495203270961107
"PANC0813_PANCREAS",1.20671579397339,1.0865878602786,0.447916746139526,1.26035539969855,0.0129102089224778
"PANC1005_PANCREAS",0.715518203705893,1.32281474344806,0.689866721630096,1.44506706967658,0.0160984049661601
"PC14_LUNG",0.869144286226411,1.00755861829155,0.219047263264656,1.29608040280647,0.00514269973441468
"PC3_PROSTATE",1.00207015388257,0.849578068702052,0.273709774017334,1.08712555106116,0.00560897313420193
"PECAPJ34CLONEC12_UPPER_AERODIGESTIVE_TRACT",0.786210033072024,1.5367342809232,0.408539772033691,1.76565250434342,0.0189798835181214
"PECAPJ49_UPPER_AERODIGESTIVE_TRACT",0.9080489379043,1.28636300392037,0.324742496013641,1.37359308647124,0.00657484931006686
"PETA_SKIN",0.532314531119313,0.805524352623212,0.280149340629578,1.35190064657299,0.0141880478401552
"PLB985_HAEMATOPOIETIC_AND_LYMPHOID_TISSUE",0.971317241174559,1.11546822504683,0.495816588401794,1.31642212903209,0.0135129178626222
"PLCPRF5_LIVER",0.715182573748967,1.08171252974685,0.310224592685699,1.27300912132902,0.00586999711557616
"PRECLH_PROSTATE",0.780911383054414,0.950852941735515,0.438915282487869,0.637441716222477,0.0165293629100084
"PSN1_PANCREAS",0.922324362844106,1.19522290297042,0.324955552816391,1.54153697427158,0.0103080288406454
"QGP1_PANCREAS",0.749458740092788,0.86498363695012,0.297633290290833,1.14354529366149,0.0112979170075935
"RDES_BONE",0.660012490231595,0.90236645091823,0.298668652772903,0.912421404619624,0.0268970033055664
"RD_SOFT_TISSUE",0.975034357091676,0.911555689467011,0.365763038396835,1.02880149013346,0.00943132052152544
"REH_HAEMATOPOIETIC_AND_LYMPHOID_TISSUE",0.969537779467774,1.02963367603216,0.270663619041443,1.54847147233745,0.00653830177748411
"RERFLCAD2_LUNG",1.23124320216492,0.862300409935294,0.336339116096497,0.748304458760297,0.020271607378131
"RERFLCAI_LUNG",0.641759015207702,1.38376036776489,0.329515874385834,1.73800085845941,0.0104067506214738
"RH30_SOFT_TISSUE",1.1789452499814,0.586659454967567,0.233131989836693,0.633019130707959,0.0288987723995674
"RH41_SOFT_TISSUE",0.51520490519461,1.38683759289934,0.464900881052017,1.55966531909724,0.0229650174673075
"RKN_SOFT_TISSUE",1.61542248292135,0.403675973413846,0.118384338915348,0.757680286635383,0.023390126898529
"RKO_LARGE_INTESTINE",1.61790766905037,0.854266616766137,0.346567094326019,1.25482456369933,0.00556260094754225
"RL952_ENDOMETRIUM",0.681939839838508,1.16785835074207,0.417579501867294,1.48963597429626,0.00572829760160795
"RMGI_OVARY",0.791880769836943,1.42659111079965,0.483630031347275,1.28034711067948,0.0238150543921822
"RMUGS_OVARY",1.45741656802272,0.44260226625479,0.155045360326767,0.785332617506911,0.0216420156014951
"RS411_HAEMATOPOIETIC_AND_LYMPHOID_TISSUE",1.38459552183009,0.834986080543552,0.320480048656464,1.30321859348603,0.00609130596863468
"RT112_URINARY_TRACT",0.88703412693549,1.2660825695045,0.317413210868835,1.71112791777535,0.0198881719934017
"RVH421_SKIN",0.659248641276906,1.21861731808333,0.455412149429321,1.25009513637503,0.0080299847944828
"SAOS2_BONE",0.878323588702677,0.422135403851481,0.204644039273262,0.422812868806089,0.00875209379889853
"SCC4_UPPER_AERODIGESTIVE_TRACT",1.27529642603673,0.445437392847982,0.230012789368629,0.567922746148146,0.0244133874692356
"SEM_HAEMATOPOIETIC_AND_LYMPHOID_TISSUE",0.66841484831353,1.43380251674704,0.335860848426819,2.06239847109244,0.0137649196313386
"SF126_CENTRAL_NERVOUS_SYSTEM",0.746738835265869,1.05725392990031,0.253728777170181,1.47214547911734,0.0128359442959083
"SF172_CENTRAL_NERVOUS_SYSTEM",2.0036419513966,0.621795110748086,0.175785288214684,1.02953847402102,0.00686836200597887
"SF295_CENTRAL_NERVOUS_SYSTEM",0.608934694768589,0.766201053753052,0.398318976163864,0.760132761646949,0.00614737380203147
"SF767_CENTRAL_NERVOUS_SYSTEM",0.989318192274619,1.12382811970067,0.237486734986305,1.61150252903079,0.028185866091935
"SH4_SKIN",0.637246726942574,1.52937914258231,0.667610824108124,1.47645131745102,0.00621690408954946
"SHP77_LUNG",0.728912902390326,1.5208057944509,0.788904428482056,1.80350223966082,0.0113193798570943
"SIHA_CERVIX",0.692523948751994,0.952529941509683,0.244568094611168,1.17234710133856,0.00630037671657524
"SJSA1_BONE",0.869728671140914,0.993531696729438,0.382577359676361,1.23280902359079,0.010130180761259
"SKCO1_LARGE_INTESTINE",2.41885647845269,0.529444010260989,0.406368255615234,0.770679044198683,0.0170133954845212
"SKES1_BONE",0.708893175024785,1.04193435697278,0.425780475139618,1.07036465966243,0.00468622717886794
"SKHEP1_LIVER",0.714104937116319,0.727245838903045,0.301938831806183,0.75047975783036,0.0113762518375614
"SKMEL2_SKIN",0.96695387521933,0.958210103790674,0.470568090677261,1.1505037066743,0.00595421891532161
"SKMEL3_SKIN",0.621435182855845,1.36784424256745,0.524739623069763,1.13385105603038,0.0337300660178412
"SKMEL5_SKIN",0.619712167823248,1.3346756067012,0.549185156822205,1.44963738045915,0.00478910115204067
"SKMES1_LUNG",0.856889832483879,1.37719054812356,0.461116522550583,1.42625008539095,0.0360246665235808
"SKMM2_HAEMATOPOIETIC_AND_LYMPHOID_TISSUE",0.750739262162263,1.06413006538323,0.491135835647583,1.3441998359213,0.00396190832728991
"SKNEP1_BONE",0.678213301989452,1.49939484518051,0.328092873096466,1.92327594788355,0.0216328703380395
"SKNO1_HAEMATOPOIETIC_AND_LYMPHOID_TISSUE",1.04915813432057,0.684150054921282,0.321598380804062,1.01727376829222,0.0114573313813134
"SKOV3_OVARY",1.48103650663627,0.499617105635907,0.172827064990997,0.81986471071077,0.00306015443445975
"SKRC20_KIDNEY",1.18326904257415,0.912360671944642,0.389314264059067,1.18151179591139,0.00540006486281288
"SLR20_KIDNEY",0.838539022549473,1.1630752782816,0.2935671210289,1.66230299653711,0.00757722658311566
"SLR21_KIDNEY",1.00552882628741,0.94405543376526,0.373093545436859,1.08583220738196,0.0224837036967549
"SLR23_KIDNEY",0.964693739617332,1.05597157333911,0.387994110584259,1.02637725007848,0.014141662803643
"SLR24_KIDNEY",0.697606406423777,1.6641928059029,0.44800591468811,1.98924158210495,0.0215092469690041
"SLR25_KIDNEY",0.94189487141427,1.04131717797187,0.483362942934036,1.15978721015825,0.00949700919198548
"SLR26_KIDNEY",0.738428679915302,1.33362119009862,0.458555608987808,1.12627971424949,0.00867044379661701
"SMSCTR_SOFT_TISSUE",0.82780988650066,1.17190584426651,0.383735001087189,1.41920080460196,0.00353075861550313
"SNU1076_UPPER_AERODIGESTIVE_TRACT",0.957608043868682,0.880240776701763,0.173529043793678,1.16235483382292,0.0213627622162239
"SNU1105_CENTRAL_NERVOUS_SYSTEM",0.72395174610516,0.815563013804464,0.419329285621643,0.759447541761204,0.00339608211258245
"SNU216_STOMACH",1.42612302129874,0.509248462389102,0.168237626552582,0.753895809748654,0.0151123816420059
"SNU349_KIDNEY",0.62884566004286,0.952006387676033,0.318343162536621,1.10457847192883,0.0065006796084604
"SNU5_STOMACH",0.774805830049047,0.885158456085065,0.298359990119934,1.11039944628976,0.0205702701823373
"SNU601_STOMACH",1.51215834208526,0.892188860405919,0.220033809542656,1.30822165000696,0.00694090679433221
"SNU685_ENDOMETRIUM",1.06822627861817,0.842087019046563,0.354473054409027,0.870457316737251,0.0249008741949699
"SNU719_STOMACH",0.995146517435974,0.989625043631295,0.246117353439331,1.36199032548433,0.00517824202465265
"SNU840_OVARY",1.51618177475328,0.656796111449788,0.200089797377586,0.967340032244375,0.0143995291767726
"SNU8_OVARY",0.699874234438607,1.4275373726254,0.396744400262833,1.67772293188752,0.0153550935087661
"SNUC1_LARGE_INTESTINE",1.18521525764218,0.909501089513807,0.668161809444427,0.703575754043542,0.00861737744076051
"SNUC2A_LARGE_INTESTINE",0.93217360080513,1.02004912554879,0.292270332574844,1.33793351692581,0.0187914888266863
"SU8686_PANCREAS",1.33869509292481,0.903428962957993,0.21370056271553,1.28881553879158,0.0184340050256879
"SUDHL10_HAEMATOPOIETIC_AND_LYMPHOID_TISSUE",0.570925347834782,1.39654065852109,0.687176406383514,1.65097563487038,0.0214791831590032
"SUDHL4_HAEMATOPOIETIC_AND_LYMPHOID_TISSUE",0.618354330990957,1.36591137606696,0.514891147613525,1.82188585642653,0.00999718422732183
"SUMB002_CENTRAL_NERVOUS_SYSTEM",0.911975195099179,1.09401645014016,0.414018422365189,1.17163851381588,0.0328360752046898
"SUPT1_HAEMATOPOIETIC_AND_LYMPHOID_TISSUE",1.07582751481028,1.10224424688985,0.237321436405182,1.54590985135057,0.00553751634807118
"SW1271_LUNG",0.970438212287924,0.324989849333374,0.143383249640465,0.484911653681372,0.0129800644684547
"SW1417_LARGE_INTESTINE",1.46815297138729,0.568963741014997,0.439293116331101,0.48880817495668,0.00543710122230839
"SW1573_LUNG",1.44092869966265,0.488889110905731,0.243353828787804,0.594910852392618,0.0225476564370213
"SW1783_CENTRAL_NERVOUS_SYSTEM",1.10066321099908,0.711744351731868,0.401902407407761,0.616351185855163,0.00656504758433495
"SW480_LARGE_INTESTINE",0.769961284124743,0.95458369051551,0.359112620353699,1.2190354432265,0.00786977295031843
"SW48_LARGE_INTESTINE",0.77642651681358,1.25611488690626,0.206585541367531,1.77214738517611,0.00385237766111523
"SW620_LARGE_INTESTINE",0.830164577713788,0.939895128853248,0.396303504705429,1.1047142047211,0.0209343583667939
"SW837_LARGE_INTESTINE",1.07746658138455,0.841708590072766,0.359838783740997,0.752184984658718,0.00644406967582066
"T47D_BREAST",0.724622910013087,1.49192085447869,0.584616482257843,1.80336394959072,0.00766008622517167
"T98G_CENTRAL_NERVOUS_SYSTEM",0.880734749523978,0.592305778941559,0.225601479411125,0.953076753452206,0.0134157351782107
"TC71_BONE",0.830961300570486,0.813576143276589,0.278065979480743,1.18211677045916,0.0165095114892184
"TCCSUP_URINARY_TRACT",0.705999707252923,1.28611823560775,0.514161944389343,1.25256208318927,0.01213534152807
"TE10_OESOPHAGUS",1.29705240257747,0.951160716361728,0.182887315750122,1.50681681880666,0.0100193209935111
"TE11_OESOPHAGUS",1.23932753003597,0.91097491526565,0.230236858129501,1.10034358661885,0.00614795541962689
"TE15_OESOPHAGUS",0.984681987727572,0.846489778485089,0.239521443843842,1.10862949427401,0.0157101902810549
"TE1_OESOPHAGUS",1.08236141895577,0.641811436282756,0.137979358434677,0.917434601231743,0.0221053095451157
"TE4_OESOPHAGUS",0.867171116425932,1.45376151514432,0.460449606180191,2.1073176132218,0.0140976390089635
"TE6_OESOPHAGUS",1.39773546824895,0.724485881067255,0.13754940032959,1.07294823889772,0.0101574541536422
"TE8_OESOPHAGUS",0.915738056616494,1.07240470673933,0.43515819311142,1.02141481304113,0.014466359231504
"TE9_OESOPHAGUS",0.800887580311171,1.19567417867683,0.4130539894104,1.59386286983634,0.0284644510141822
"THP1_HAEMATOPOIETIC_AND_LYMPHOID_TISSUE",1.12229760272431,0.953110604685181,0.35183772444725,1.34816205794347,0.00949359574273574
"TM87_SOFT_TISSUE",0.761938358438988,1.15662094097463,0.493358433246613,0.986239737771559,0.0047199519567588
"TOV112D_OVARY",0.897926213148211,0.872878227597292,0.304305553436279,0.990417152071592,0.00581087161531629
"TOV21G_OVARY",1.11764193168884,1.18079580706861,0.288256704807281,1.53119434657698,0.0147399252505251
"TTC549_SOFT_TISSUE",0.726128122904832,1.49091345061968,0.383276045322418,1.62521428779565,0.00548192164369203
"TTC709_SOFT_TISSUE",0.573968116506924,1.4418577375286,0.511087715625763,1.41985262023882,0.0361807578563426
"TT_OESOPHAGUS",0.900797359787348,0.872711413136135,0.214994713664055,1.41113113237653,0.0266635921891023
"TUHR10TKB_KIDNEY",0.85166422271236,1.19555563785279,0.39907506108284,1.04005710299432,0.00932174602338376
"TUHR14TKB_KIDNEY",0.537404013245417,1.11926675141058,0.58888453245163,0.718139748286621,0.0116772455018764
"TUHR4TKB_KIDNEY",0.617565447220442,1.1122576039698,0.52559369802475,0.841231399009895,0.00279509333005793
"TYKNU_OVARY",1.03453168254871,0.750321384605,0.266694873571396,1.09101151852123,0.0194583885527787
"U118MG_CENTRAL_NERVOUS_SYSTEM",0.765576832783645,1.10446389228846,0.351993680000305,1.33116683418912,0.0225542050354833
"U178_CENTRAL_NERVOUS_SYSTEM",0.648250028531431,1.62724632429228,0.572785258293152,1.88793180393936,0.0206567975934751
"U251MG_CENTRAL_NERVOUS_SYSTEM",1.01964615107772,1.06121746676966,0.260340660810471,1.5185231026554,0.0375407328028034
"U2OS_BONE",1.05585243259423,0.695302604138854,0.234302893280983,0.968004782327399,0.00953217220476543
"U343_CENTRAL_NERVOUS_SYSTEM",0.488599012515159,1.12295775311276,0.567346155643463,1.0998489759499,0.00968744163871017
"U87MG_CENTRAL_NERVOUS_SYSTEM",0.773711621319181,1.08566258829939,0.410010486841202,1.27324876245755,0.01454416211536
"U937_HAEMATOPOIETIC_AND_LYMPHOID_TISSUE",0.748981594449812,1.04226646061891,0.366801381111145,1.31731317421399,0.00504401980949426
"UACC257_SKIN",0.89476820053841,1.34529483578455,0.513445556163788,1.47508160368656,0.0203750862647673
"UACC812_BREAST",1.37432349898086,0.718342354503037,0.229570508003235,0.999822253403596,0.0247904059659944
"UOK101_KIDNEY",0.65927071740954,0.799313801507398,0.601137578487396,0.783649997393706,0.00771404791366921
"VCAP_PROSTATE",1.50869026967364,0.564477966396063,0.464503049850464,0.741941851175231,0.0207235594188887
"WM115_SKIN",0.701534483338809,1.15525183053145,0.326407343149185,1.24523445586918,0.0158020988568024
"WM1799_SKIN",0.880384817985411,1.10043847100436,0.363103985786438,1.19544304282835,0.00292742144699679
"WM2664_SKIN",0.767309507388529,1.0583837551254,0.234408512711525,1.28891544022817,0.0114356861731461
"WM793_SKIN",0.859516440537058,1.43070067658401,0.321684122085571,1.91260185084426,0.0259933443500974
"WM88_SKIN",0.548539739632225,1.71143263672877,0.649458646774292,2.24365535821866,0.0070207624574474
"WM983B_SKIN",0.98044687660186,1.0649670713364,0.325931400060654,1.26491344308312,0.0180285153633898
"YD38_UPPER_AERODIGESTIVE_TRACT",1.01280012480053,1.22769954023793,0.379912137985229,1.41953808419969,0.0194520491324917
"YD8_UPPER_AERODIGESTIVE_TRACT",0.659054191190805,1.14831170296491,0.502409100532532,0.538365637281803,0.0135829639183445
"YKG1_CENTRAL_NERVOUS_SYSTEM",1.13832295662383,0.721789654500345,0.21138159930706,1.04874287593294,0.0111014910047734
"ZR751_BREAST",1.00247561177543,1.11654285177005,0.396903246641159,1.29288493266482,0.00611576164190179
"ZR7530_BREAST",1.85714730008976,0.454170161055781,0.203738063573837,0.727967254329067,0.0295739659389357
