"Gene_Symbol","Gene_ID"
"ALYREF",10189
"AQR",9716
"ARCN1",372
"BRIX1",55299
"C12orf66",144577
"CCT3",7203
"CCT4",10575
"CCT6A",908
"CCT7",10574
"CCT8",10694
"CDC40",51362
"CDC5L",988
"CDK17",5128
"CHD4",1108
"CHMP2A",27243
"CLTC",1213
"COPA",1314
"COPB1",1315
"COPS2",9318
"COPS4",51138
"COPS6",10980
"COPS8",10920
"COPZ1",22818
"CSE1L",1434
"CTDNEP1",23399
"DDB1",1642
"DDX18",8886
"DDX46",9879
"DDX49",54555
"DDX51",317781
"DNM2",1785
"DYNC1H1",1778
"DYNC1I2",1781
"EEF2",1938
"EFTUD2",9343
"EIF1AX",1964
"EIF2B4",8890
"EIF2S2",8894
"EIF3A",8661
"EIF3B",8662
"EIF3C",8663
"EIF3D",8664
"EIF3F",8665
"EIF3G",8666
"EIF3I",8668
"EIF4A3",9775
"EIF5B",9669
"ERH",2079
"ETF1",2107
"EXOSC10",5394
"FTSJ3",117246
"GAR1",54433
"GNL3",26354
"GTF3C4",9329
"HAUS7",55559
"HEATR1",55127
"HNRNPC",3183
"HNRNPK",3190
"HNRNPM",4670
"HNRNPU",3192
"HSPA9",3313
"HSPE1",3336
"INTS9",55756
"KARS",3735
"KPNB1",3837
"LIAS",11019
"LSM4",25804
"LSM6",11157
"MRPS31",10240
"MSANTD3",91283
"NACA",4666
"NAPA",8775
"NAPG",8774
"NEDD8",4738
"SNU13",4809
"NUDT21",11051
"NUP133",55746
"NUP205",23165
"NUP54",53371
"NUP93",9688
"NUP98",4928
"NXF1",10482
"PABPN1",8106
"PAPOLA",10914
"PFDN2",5202
"PHB",5245
"PHB2",11331
"PHF5A",84844
"POLR2D",5433
"POLR2F",5435
"POLR2I",5438
"PPP2R1A",5518
"PRKAB2",5565
"PRPF18",8559
"PRPF19",27339
"PRPF3",9129
"PRPF31",26121
"PRPF38A",84950
"PRPF8",10594
"PRUNE1",58497
"PSMA1",5682
"PSMA2",5683
"PSMA3",5684
"PSMA6",5687
"PSMB2",5690
"PSMB3",5691
"PSMC1",5700
"PSMC2",5701
"PSMC4",5704
"PSMD1",5707
"PSMD11",5717
"PSMD7",5713
"QARS",5859
"RAN",5901
"RBM17",84991
"RILPL2",196383
"RPA1",6117
"RPA2",6118
"RPL10",6134
"RPL10A",4736
"RPL11",6135
"RPL12",6136
"RPL13",6137
"RPL13A",23521
"RPL14",9045
"RPL18",6141
"RPL18A",6142
"RPL19",6143
"RPL23A",6147
"RPL24",6152
"RPL26",6154
"RPL27",6155
"RPL3",6122
"RPL30",6156
"RPL31",6160
"RPL32",6161
"RPL34",6164
"RPL35",11224
"RPL35A",6165
"RPL36",25873
"RPL37",6167
"RPL37A",6168
"RPL38",6169
"RPL4",6124
"RPL5",6125
"RPL6",6128
"RPL7",6129
"RPL7A",6130
"RPLP0",6175
"RPLP2",6181
"RPN2",6185
"RPS11",6205
"RPS13",6207
"RPS14",6208
"RPS15",6209
"RPS15A",6210
"RPS17",6218
"RPS18",6222
"RPS19",6223
"RPS20",6224
"RPS24",6229
"RPS26",6231
"RPS27A",6233
"RPS3",6188
"RPS3A",6189
"RPS4X",6191
"RPS5",6193
"RPS6",6194
"RPS7",6201
"RPS8",6202
"RPS9",6203
"RPSA",3921
"RRM1",6240
"RUVBL1",8607
"RUVBL2",10856
"SDAD1",55153
"SF3A1",10291
"SF3A2",8175
"SF3B1",23451
"SF3B2",10992
"SF3B3",23450
"SF3B4",10262
"SF3B5",83443
"SFPQ",6421
"SEM1",7979
"SMC3",9126
"SNRNP200",23020
"SNRNP27",11017
"SNRPD1",6632
"SNRPD2",6633
"SRCAP",10847
"SRFBP1",153443
"SRSF1",6426
"SRSF3",6428
"SUPT5H",6829
"SUPT6H",6830
"SUPV3L1",6832
"TFIP11",24144
"THOP1",7064
"TIMM10",26519
"TSTA3",7264
"TUBA1B",10376
"TUBGCP2",10844
"U2AF1",7307
"U2AF2",11338
"UBA1",7317
"USP39",10713
"VCP",7415
"WDR12",55759
"WDR60",55112
"WDR61",80349
"XAB2",56949
"XPO1",7514
"YY1",7528
"ZBTB48",3104
"ZC3H13",23091
"ZNF207",7756
