"","gene_slope","CL_slope","noise_vars","offset_mean","offset_sd"
"127399_SOFT_TISSUE",0.743841693043,1.0673978229,0.141250446439,0.861577313586,0.0171032205273
"1321N1_CENTRAL_NERVOUS_SYSTEM",0.748559153173,0.918195239872,0.097622461617,0.733632098536,0.010481401172
"143B_BONE",1.60938269785,1.35415482295,0.236121118069,0.831881225035,0.0147697127994
"184A1_BREAST",1.00968807183,1.1863066098,0.362057060003,0.290594043355,0.00645233191376
"184B5_BREAST",0.728456742731,1.24255780828,1.30191552639,0.272853138811,0.0153517470102
"22RV1_PROSTATE",0.664872586732,2.46983414533,0.435746371746,1.25801192861,0.0267079513318
"2313287_STOMACH",1.18187105644,1.01746152547,0.190497864038,0.788286422318,0.0200805048436
"600MPE_BREAST",1.0688540031,1.509022034,0.566178560257,0.516202180519,0.0202615310581
"697_HAEMATOPOIETIC_AND_LYMPHOID_TISSUE",0.656714381875,1.35500038184,0.318888667971,1.06309248865,0.0158262865347
"769P_KIDNEY",0.943123476525,1.30474858979,0.208846595138,0.889444086133,0.0123248480955
"786O_KIDNEY",0.947050589194,0.836272026018,0.16410182789,0.673422938381,0.0117303799632
"8305C_THYROID",0.741025809965,0.734950562883,0.142020297547,0.571402256227,0.0112795598872
"8505C_THYROID",1.18224778326,0.909278538154,0.149893393119,0.719127486366,0.0122250170638
"921_UVEA",0.94869352157,0.959590207481,0.789074281851,0.503217503712,0.0171974886342
"A101D_SKIN",0.548224855219,1.08875286005,0.137505188584,0.901053327986,0.0125212635433
"A1207_CENTRAL_NERVOUS_SYSTEM",0.601929953455,1.81228230587,0.50577300787,0.663912067444,0.0051852237162
"A172_CENTRAL_NERVOUS_SYSTEM",0.607231493129,1.4553786929,0.284995116293,0.898810908373,0.00930038199218
"A204_SOFT_TISSUE",0.465148447661,1.44439639515,0.344337085883,0.932627460078,0.0138029526074
"A2058_SKIN",1.15083211023,1.09750111031,0.169098339975,0.781136817455,0.0113519026
"A253_SALIVARY_GLAND",1.27664310194,0.782053025377,0.0895042493939,0.700863841969,0.006882328281
"A2780_OVARY",0.78582922821,0.92243486151,0.115512438118,0.772282381941,0.0150364921749
"A375_SKIN",0.887393185775,1.59391895217,0.295856997371,1.18806096751,0.0126592392314
"A3KAW_HAEMATOPOIETIC_AND_LYMPHOID_TISSUE",0.316524269554,2.33069217312,0.746123611927,1.30423896756,0.0137343233177
"A427_LUNG",1.42584185402,0.959930959106,0.192821621895,0.443806286457,0.0435356429231
"A498_KIDNEY",0.873872386337,0.963123007482,0.11069115748,0.765194372065,0.0192612633086
"A4FUK_HAEMATOPOIETIC_AND_LYMPHOID_TISSUE",0.736976997645,1.9382718626,0.390750527382,1.5030942018,0.00588470955621
"A549_LUNG",0.805694489432,1.15177048654,0.178409423679,0.738661327865,0.0168243062184
"A673_BONE",0.670684390271,1.98612806561,0.579545877874,1.45857533375,0.0142727818395
"A704_KIDNEY",0.623415980887,1.51143518015,0.474387481809,0.666395664984,0.0201355721824
"ABC1_LUNG",1.18746565723,0.905821028431,0.173422534019,0.753388047729,0.0108056929829
"ACCMESO1_PLEURA",0.756165635396,0.689115575159,0.0791131754716,0.533826059281,0.0122507189217
"ACHN_KIDNEY",0.47489703451,1.57135211252,0.401466831565,0.956410072397,0.020507804009
"AGS_STOMACH",1.81725893309,0.688870328433,0.174147434533,0.517736769238,0.0216621813121
"AM38_CENTRAL_NERVOUS_SYSTEM",0.83315993277,1.53295296063,0.247257992625,0.696551362008,0.0158566877463
"AML193_HAEMATOPOIETIC_AND_LYMPHOID_TISSUE",1.22926433773,1.14181933992,0.176920160651,0.787669304475,0.0099272534148
"AMO1_HAEMATOPOIETIC_AND_LYMPHOID_TISSUE",1.49875524303,1.13879176886,0.238834127784,0.572560145853,0.0288220988463
"AN3CA_ENDOMETRIUM",0.715492075099,0.978887504221,0.114530697465,0.872303872473,0.00470470444436
"ASPC1_PANCREAS",0.747906275228,2.44606638525,0.388682723045,1.57061241361,0.0297344082857
"AU565_BREAST",0.80057970748,1.360602555,0.496685341001,0.41679116939,0.0226524117328
"AZ521_STOMACH",1.24269749351,0.695888517577,0.113033463558,0.545970916707,0.0124285063166
"BC3C_URINARY_TRACT",0.812239438827,1.02152639843,0.140427048008,0.675404531739,0.0133434585289
"BCPAP_THYROID",0.525904580797,1.10685902922,0.200202032924,0.84955488639,0.00835731220454
"BFTC909_KIDNEY",0.939842842588,0.91414736877,0.143079448491,0.625007523108,0.0163639702284
"BHT101_THYROID",1.00568499307,0.709724246886,0.356581300497,0.405904837584,0.0105718247054
"BHY_UPPER_AERODIGESTIVE_TRACT",1.21160712784,1.33477562874,0.233100175858,0.608465758654,0.00432553114452
"BICR22_UPPER_AERODIGESTIVE_TRACT",0.925327460322,1.998434232,0.619230926037,0.585030340965,0.0149127533248
"BICR56_UPPER_AERODIGESTIVE_TRACT",0.81365806182,1.76797807887,0.5033852458,0.569611389908,0.00647835711679
"BICR6_UPPER_AERODIGESTIVE_TRACT",1.21716553426,0.762433349991,0.157339189202,0.480611904906,0.0108399176576
"BT12_SOFT_TISSUE",1.06792691009,1.83752623867,0.243603289127,0.954213774464,0.0238804431713
"BT16_SOFT_TISSUE",0.617466907358,1.66699567088,0.314603999257,1.14866287822,0.0118082777048
"BT20_BREAST",1.14878884787,0.919181319067,0.310852667317,0.57727537065,0.00683985213658
"BT474_BREAST",1.89116568635,0.836654169308,0.286547258496,0.388004191271,0.027364797771
"BT483_BREAST",1.58272081557,1.0228669741,0.47467905283,0.290851441892,0.0100839223223
"BT549_BREAST",1.3565025289,0.585717437672,0.207365110517,0.308822968477,0.0118048683819
"BXPC3_PANCREAS",0.895649590935,1.09262417466,0.18491839245,0.871314218056,0.0206041907388
"C2BBE1_LARGE_INTESTINE",1.10923902477,1.78047478748,0.34162145853,0.990402791314,0.00501579517315
"C32_SKIN",0.662079711445,0.603659953843,0.137756722048,0.407629649344,0.0134634327306
"C8166_HAEMATOPOIETIC_AND_LYMPHOID_TISSUE",0.738243175346,2.68283461031,0.551344811916,1.9469472736,0.00562511576897
"CACO2_LARGE_INTESTINE",0.91880445484,1.84119980251,0.649055063725,0.203981800163,0.00860503236185
"CADOES1_BONE",0.657848925843,2.47059073819,0.588484406471,1.47871573321,0.0252623954845
"CAKI1_KIDNEY",0.692874592634,0.418633531611,0.0683536355694,0.316689683571,0.00960900827442
"CAKI2_KIDNEY",0.787868876273,0.725677569374,0.124966392294,0.397877290894,0.00943356725833
"CAL120_BREAST",0.602799869862,0.819237057325,0.254310055077,0.44425470689,0.0126740929152
"CAL12T_LUNG",1.10054764254,1.74485742639,0.272441148758,0.862322105984,0.00967853183609
"CAL148_BREAST",1.30667540168,1.02496853157,0.518264234066,0.216547396063,0.00612991967402
"CAL27_UPPER_AERODIGESTIVE_TRACT",0.710415624147,1.56457532665,0.299159634858,1.15958527374,0.0135295904007
"CAL29_URINARY_TRACT",0.700233625692,1.31167463468,0.220301533739,1.07352733885,0.0204089120749
"CAL33_UPPER_AERODIGESTIVE_TRACT",0.937174630883,1.5436629799,0.390367381275,1.19955305144,0.0132192162133
"CAL51_BREAST",1.17037763018,1.07420184832,0.452046940103,0.423208325783,0.00606494140898
"CAL54_KIDNEY",0.764845578965,1.01651821037,0.326190657914,0.451494905957,0.015868296946
"CAL851_BREAST",1.15738999682,0.8394547873,0.352843787521,0.462398396422,0.00886301016817
"CALU1_LUNG",0.683906536481,1.76625911232,0.332490205765,0.963827623913,0.0299719826576
"CALU3_LUNG",1.46979296245,0.818950981256,0.138748899102,0.461783797914,0.0168352591928
"CALU6_LUNG",1.06038005113,0.982682387046,0.285272061825,0.590626574388,0.010107278388
"CAMA1_BREAST",1.05701143469,0.54626667219,0.201351886615,0.32073785099,0.0178554217651
"CAOV3_OVARY",0.752697001287,1.01877945075,0.209688737988,0.682116657634,0.0114592054107
"CAOV4_OVARY",0.826368345697,1.34287599178,0.232211232185,0.721132153455,0.0156486041354
"CAS1_CENTRAL_NERVOUS_SYSTEM",0.544143960635,0.640796575632,0.24466800876,0.195302516817,0.0179077717368
"CCK81_LARGE_INTESTINE",0.176286044646,0.409832063238,0.116623704632,0.314301474383,0.00700326811557
"CFPAC1_PANCREAS",1.23257732662,0.495422035022,0.0995786879212,0.341722870202,0.0121722185711
"CH157MN_CENTRAL_NERVOUS_SYSTEM",1.13653075258,1.62501820281,0.282498151064,0.787181574682,0.010866519353
"CHAGOK1_LUNG",1.75848016676,0.618371320504,0.101971402764,0.446681676177,0.0139693571977
"CJM_SKIN",1.09458138789,1.94487814894,0.186444029212,1.27252396604,0.0326921629866
"CL11_LARGE_INTESTINE",1.00652575312,1.05136052578,0.213364183903,0.826513318954,0.0152473328258
"CL34_LARGE_INTESTINE",1.75136855425,0.573451630805,0.123943616947,0.544075469477,0.0161537348404
"CMK115_HAEMATOPOIETIC_AND_LYMPHOID_TISSUE",0.650659533185,0.590897601252,0.175423289339,0.463066927466,0.00504915443146
"CMK_HAEMATOPOIETIC_AND_LYMPHOID_TISSUE",0.610859255046,0.784392213926,0.296895007292,0.58460323631,0.0153898027634
"COLO201_LARGE_INTESTINE",0.665657183329,0.27308623221,0.0553568551938,0.245469895445,0.0126428423606
"COLO205_LARGE_INTESTINE",1.10963955669,0.738637806871,0.144067449495,0.612588566539,0.0194986836563
"COLO320_LARGE_INTESTINE",1.2298260399,0.431218416553,0.0592894181609,0.334184359004,0.0161137904115
"COLO678_LARGE_INTESTINE",1.00689750599,0.126511671782,0.04504008467,0.115160731551,0.017022143553
"COLO679_SKIN",0.530187801168,1.63171669142,0.40359159559,1.01803798284,0.0106090164879
"COLO680N_OESOPHAGUS",1.40198399361,1.42278031252,0.171856179833,0.765543950495,0.00793284138046
"COLO684_ENDOMETRIUM",1.27736301327,1.46791638833,0.336048066616,0.615263814389,0.0161268401807
"COLO699_LUNG",0.553243092442,1.97453847731,0.369477123022,0.767743453079,0.00544664853262
"COLO704_OVARY",1.05757039105,1.75585267945,0.331621915102,1.02985381529,0.0225322847642
"COLO741_SKIN",0.795861041596,0.972218635743,0.148133859038,0.724874902583,0.0162405698591
"COLO783_SKIN",0.672724637269,1.39267911311,0.170950636268,1.08851187083,0.0240637363348
"COLO800_SKIN",0.803481927066,2.27160223185,0.582617759705,1.17925785512,0.00588061672219
"COLO829_SKIN",0.835554861684,1.26783542907,0.322790138423,0.924556297266,0.0125245823564
"CORL105_LUNG",0.659877685373,0.809139944258,0.130327107385,0.525473485889,0.00920069369885
"CORL23_LUNG",1.24108517024,0.854155734036,0.213780663908,0.661268021227,0.0138034367428
"CORL279_LUNG",0.815995684687,2.0783184504,0.573953151703,0.725646336545,0.0251234570522
"CORL88_LUNG",1.18612287186,1.00247122055,0.133052170277,0.628364605723,0.0162218349578
"COV318_OVARY",0.513983952186,0.318795549698,0.0573987973233,0.247677760383,0.00790072583429
"COV362_OVARY",1.55561392592,0.693480947068,0.183370087296,0.47805082761,0.026668752001
"COV434_OVARY",0.873776629361,1.8804369981,0.306350916624,1.04397489557,0.00868160550411
"COV504_OVARY",0.835609238252,1.57798683309,0.263952076435,0.720177533019,0.0144362340425
"COV644_OVARY",0.812363084906,2.165452613,0.44391694665,1.1694701802,0.0173036902722
"CW2_LARGE_INTESTINE",1.12799307581,0.156754558768,0.0726054683328,0.148440147146,0.00692565100049
"CW9019_SOFT_TISSUE",0.712706912422,2.00886875802,0.32277327776,0.866869699511,0.0130550887216
"D283MED_CENTRAL_NERVOUS_SYSTEM",0.798824365639,1.76241691144,0.459091514349,0.60508482386,0.00710309953524
"D341MED_CENTRAL_NERVOUS_SYSTEM",0.689123964389,1.94793216988,0.643885016441,0.268833611113,0.0313081060392
"D384_CENTRAL_NERVOUS_SYSTEM",0.806029394522,1.65764880183,0.744921326637,-0.254189147607,0.0315337579243
"D425_CENTRAL_NERVOUS_SYSTEM",1.12644109365,1.31425182909,0.364818423986,0.362337748544,0.0116400581119
"D458_CENTRAL_NERVOUS_SYSTEM",0.838714128331,1.92818470756,0.395604282618,0.763781014294,0.00514998014884
"D556_CENTRAL_NERVOUS_SYSTEM",0.728977754921,2.18346631248,0.614719748497,1.01940168639,0.0133974153762
"DANG_PANCREAS",0.883586981041,1.07905898605,0.151906003555,0.88000312494,0.0159271666295
"DAOY_CENTRAL_NERVOUS_SYSTEM",1.28694212907,0.630365036986,0.129366919398,0.479141051573,0.0408950212097
"DBTRG05MG_CENTRAL_NERVOUS_SYSTEM",0.640651177535,2.16571787926,0.366649448872,0.920698138543,0.00704375713701
"DB_HAEMATOPOIETIC_AND_LYMPHOID_TISSUE",0.714795528565,0.963110117167,0.228248000145,0.70819005734,0.0034903046765
"DETROIT562_UPPER_AERODIGESTIVE_TRACT",1.32116461723,0.43717678384,0.0548670999706,0.371444709018,0.0249042129931
"DKMG_CENTRAL_NERVOUS_SYSTEM",0.799380125773,1.75498971887,0.368015736341,0.829206369952,0.0115387005648
"DLD1_LARGE_INTESTINE",1.63675436409,0.342440624169,0.106962844729,0.289951881353,0.00692344789476
"DMS114_LUNG",0.773781595961,0.863271515369,0.294022288173,0.573391255081,0.014325641527
"DMS273_LUNG",1.09005777245,0.932627907878,0.206207327545,0.625764733541,0.0100479447154
"DMS53_LUNG",0.716401018474,2.94139525242,0.748367190361,2.12099103475,0.00572960057892
"DND41_HAEMATOPOIETIC_AND_LYMPHOID_TISSUE",1.15734839655,1.13203816,0.193356320262,0.602374083604,0.0235018382682
"DU145_PROSTATE",0.925780312922,1.11213003974,0.338093034923,0.66073395669,0.0209466288996
"DU4475_BREAST",1.57491426342,0.775141007051,0.332740664482,0.0543050091676,0.00348505140296
"EBC1_LUNG",0.763256524202,1.50219049477,0.343428224325,1.11726432751,0.0197439772999
"ECC10_STOMACH",2.32716799203,0.479922297046,0.119684308767,0.364788398776,0.0126539964487
"ECGI10_OESOPHAGUS",0.783733137747,1.34168250898,0.270482480526,0.56141080721,0.0142660787452
"EFE184_ENDOMETRIUM",1.42033410308,1.35002603621,0.208608865738,0.910796247252,0.0205579870383
"EFM192A_BREAST",1.04771651293,0.607406165578,0.219391383231,0.360904362007,0.00902448070182
"EFM19_BREAST",1.75927190041,0.926816794651,0.433373734355,0.473508701278,0.0260575941116
"EFO21_OVARY",3.68654324979,0.46141001615,0.217678651214,0.395692870508,0.0203464675257
"EFO27_OVARY",0.80978122302,1.88273352364,0.197511300445,1.16165076611,0.00837121522883
"EKVX_LUNG",0.829609771339,1.82870225264,0.308277219534,0.569954065586,0.0159400843904
"EN_ENDOMETRIUM",0.563248420986,0.950599766003,0.188312888145,0.580588371517,0.0043476882182
"EPLC272H_LUNG",0.7087122462,2.38074747902,0.493107885122,1.10903458601,0.00395939219073
"ES2_OVARY",0.857954634009,2.07989539908,0.292398512363,1.15262787515,0.0230837465752
"ESS1_ENDOMETRIUM",0.914742412588,1.92864196965,0.313103526831,0.920739370772,0.00517815502838
"EVSAT_BREAST",0.757127782366,1.02031227494,0.302588641644,0.187291006527,0.0183397733258
"EW8_BONE",0.62361742853,2.04579400088,0.217678576708,1.288265539,0.0119854285032
"EWS502_BONE",1.10108586756,1.32240592043,0.313774496317,0.614634848651,0.0188578014253
"F36P_HAEMATOPOIETIC_AND_LYMPHOID_TISSUE",1.0403596732,1.57121007772,0.387457728386,0.725479588766,0.0186451381622
"FADU_UPPER_AERODIGESTIVE_TRACT",0.837285351608,1.17648692423,0.219683863223,0.839373540615,0.0162827988011
"FU97_STOMACH",0.758897677003,0.863990795951,0.267652899027,0.431686227635,0.012333118811
"FUJI_SOFT_TISSUE",0.458871540444,0.774743165605,0.158072893818,0.647738820173,0.0097357407181
"FUOV1_OVARY",2.188958571,0.321462570896,0.137824468315,0.295888506835,0.0170413858081
"G361_SKIN",0.685786950473,2.19396647084,0.651378571987,0.655275863453,0.0112647707525
"G401_SOFT_TISSUE",0.757550331691,1.93175436628,0.735158592463,0.959656807149,0.00687049268721
"G402_SOFT_TISSUE",0.623499224506,1.49454351544,0.351744681597,0.966395901444,0.0216816667397
"GAMG_CENTRAL_NERVOUS_SYSTEM",0.410416752284,0.974120904108,0.17265984416,0.652746038934,0.0176419240374
"GB1_CENTRAL_NERVOUS_SYSTEM",0.752700628591,0.840190727151,0.119071815163,0.68464105302,0.00993548316144
"GI1_CENTRAL_NERVOUS_SYSTEM",0.699980337141,0.719218990828,0.162159442902,0.470714304237,0.00811895331809
"GISTT1_GASTROINTESTINAL_TRACT",1.30405379226,0.53990915251,0.106085054576,0.489732851371,0.0136443656334
"GP2D_LARGE_INTESTINE",1.37177267402,0.781616130243,0.131509626905,0.636312765838,0.0118291441331
"GSS_STOMACH",0.993798468794,1.63958623854,0.219341903925,0.978270029893,0.0235242664803
"GSU_STOMACH",0.9304232211,2.11505794973,0.455277085304,0.819476629904,0.0118502347368
"HBL100_BREAST",0.803563675668,1.30665066421,0.447212100029,0.345894001481,0.0139657089338
"HCC1008_BREAST",2.04127615649,0.522206177817,0.6532304883,-0.163907257868,0.01122722062
"HCC1143_BREAST",0.740198930235,1.78442321654,0.727628648281,0.68495971505,0.0101321745994
"HCC1187_BREAST",1.078799991,1.0086169401,0.510776385665,0.491745363691,0.0355577059982
"HCC1359_LUNG",1.87134776752,0.53957235132,0.142119929194,0.400890015739,0.0153903183038
"HCC1395_BREAST",0.915093463845,1.26844014358,0.561060920358,0.467582407087,0.00814070109491
"HCC1419_BREAST",3.98387250889,0.443158441392,0.446803212166,-0.0684948430201,0.0243165527078
"HCC1428_BREAST",1.4301713709,1.42563875751,0.263626515865,1.06297264008,0.0184385881974
"HCC1500_BREAST",1.18513115705,0.593114782696,0.246697121859,0.3149694113,0.0158134547422
"HCC1569_BREAST",0.997996685568,0.613978753089,0.716623425484,0.0633648486023,0.0113672634462
"HCC1599_BREAST",1.40578518359,0.744201020034,0.685815632343,-0.0827475706092,0.0250923220262
"HCC15_LUNG",0.865902451666,0.863182602875,0.179728373885,0.513790379499,0.0105042949417
"HCC1806_BREAST",1.29949762476,1.13843115837,0.456858330965,0.76992684705,0.0147343941723
"HCC1833_LUNG",0.422053114548,0.359909983599,0.0550150610507,0.293449422906,0.0150166061946
"HCC1937_BREAST",1.73436772895,1.02151238961,0.584135636687,0.254205897221,0.0106653870634
"HCC1954_BREAST",1.91976134345,0.511560504123,0.197515329719,0.280010983552,0.0129986902553
"HCC202_BREAST",1.0274654717,1.23859855483,0.837444290519,0.506208531003,0.0058175716501
"HCC2185_BREAST",0.629431824098,0.38136423091,0.495441615582,-0.360970909127,0.0102074708932
"HCC2218_BREAST",1.36000338847,0.818412489708,0.637111350894,0.304773267112,0.00545781701416
"HCC2429_LUNG",0.668087026647,2.34567004792,0.416475325823,1.32098077915,0.0215427041276
"HCC2450_LUNG",1.17218841745,1.35760921214,0.254275232553,0.617367062386,0.00812502911548
"HCC2688_BREAST",0.69917209998,1.11717123296,0.515577971935,0.180344934115,0.0186788240204
"HCC2814_LUNG",1.50525615337,0.98806441317,0.240266516805,0.562851625925,0.00892076460205
"HCC3153_BREAST",1.438852607,1.20336687788,0.640730023384,0.382028363126,0.0237911649192
"HCC33_LUNG",1.22819403052,1.67867150454,0.342866957188,0.955446674066,0.0105270999372
"HCC364_LUNG",1.21589168632,0.954443631107,0.146512210369,0.606210670028,0.010079530456
"HCC366_LUNG",1.00960979267,1.25324998621,0.301720708609,0.527816345613,0.0276067287999
"HCC38_BREAST",0.674889054089,0.771995986161,0.215049158037,0.420390683333,0.0234522845483
"HCC4006_LUNG",0.77223783106,0.878124746293,0.122603389124,0.66667510918,0.0168789905372
"HCC44_LUNG",0.915111207125,0.661613671035,0.150289420038,0.324756358367,0.00761224808791
"HCC461_LUNG",0.788135003904,1.83936812214,0.301842153072,0.82942609423,0.00940073521321
"HCC515_LUNG",2.74519765912,0.595856369233,0.126049801707,0.408199943678,0.0174116766699
"HCC70_BREAST",1.70623522836,0.945477689906,0.435526877642,0.426243275551,0.0151396272925
"HCC827GR5_LUNG",0.978076059619,1.57912222996,0.22561852634,0.896561523613,0.0215836141683
"HCC827GR_LUNG",0.959393083408,0.470305614826,0.0488696855803,0.388671842352,0.0129482014922
"HCC827_LUNG",0.90550264501,1.00690486667,0.281014986336,0.563354204618,0.0104815086706
"HCC95_LUNG",0.731370525906,0.641019925736,0.155176887289,0.355451075662,0.0118455437675
"HCT116_LARGE_INTESTINE",1.16729694909,1.02130131659,0.204439617693,0.80840620821,0.0119155773367
"HCT15_LARGE_INTESTINE",1.56473267564,0.291016103909,0.108595545093,0.228451509936,0.014374733699
"HDQP1_BREAST",3.52368124357,0.387335277895,0.353918224573,-0.25141258996,0.0149629323765
"HEC1A_ENDOMETRIUM",0.683829850145,1.49279219842,0.302185501903,0.970408737555,0.0106070474561
"HEC251_ENDOMETRIUM",1.10349048939,2.03871349734,0.258802741766,1.40238922611,0.0113300371724
"HEC265_ENDOMETRIUM",0.976966812098,1.35384575928,0.297229687373,1.11489423768,0.0108741617507
"HEC50B_ENDOMETRIUM",1.20797305372,1.08901136143,0.302404205004,0.767056454775,0.0115178514973
"HEC59_ENDOMETRIUM",1.07227763996,0.903944277458,0.169287979603,0.638247919175,0.00393685427457
"HEC6_ENDOMETRIUM",1.06052081256,0.357867308778,0.0450574681163,0.331675103702,0.014084939913
"HEKTE_KIDNEY",0.897265495172,1.35553697886,0.339573949575,0.42624763654,0.0112695297388
"HEL9217_HAEMATOPOIETIC_AND_LYMPHOID_TISSUE",1.02639979985,0.620541567207,0.10742957145,0.527555064114,0.0110250270546
"HELA_CERVIX",0.771453724923,2.44800705717,0.496650576591,1.10463544742,0.00461700641077
"HEL_HAEMATOPOIETIC_AND_LYMPHOID_TISSUE",1.00560249869,1.05481849868,0.83357218653,0.550141172027,0.0154785326667
"HEP3B217_LIVER",1.10770626909,0.822417587856,0.226859658957,0.532532433435,0.0108289559423
"HEPG2_LIVER",0.650938204637,1.16373410329,0.315352817376,0.913676715304,0.00976809386218
"HEYA8_OVARY",0.918718749025,1.26437933375,0.238671179861,0.838575380787,0.0119131773247
"HGC27_STOMACH",0.592525783311,0.859470082383,0.220269013196,0.61992886989,0.0112836578005
"HK2_KIDNEY",1.24732466783,0.844373822702,0.152936339378,0.461744731112,0.0107864131564
"HL60_HAEMATOPOIETIC_AND_LYMPHOID_TISSUE",0.943615103213,1.15185979928,0.536093115807,-0.15282577958,0.0067936780172
"HLC1_LUNG",0.978582584811,1.43738780429,0.186553612351,0.511604489766,0.00386103505692
"HLE_LIVER",0.853250624795,0.663211099641,0.14475702246,0.484825000843,0.0172593715249
"HLF_LIVER",0.606412464212,1.86495528584,0.314040012658,1.3946070115,0.0214938456444
"HMC18_BREAST",0.949545410217,0.735312159089,0.0880767305692,0.554008371224,0.0316791138026
"HNT34_HAEMATOPOIETIC_AND_LYMPHOID_TISSUE",0.83418097773,1.68074136518,0.520650684834,0.593144242191,0.00679283779134
"HOP62_LUNG",1.16343928174,1.3760858612,0.230560794473,0.510585717461,0.0317321877727
"HPAC_PANCREAS",1.0413400475,1.4908377755,0.147656902671,0.987570017401,0.0246564129994
"HPAFII_PANCREAS",1.07046969611,1.66304084352,0.355900943279,0.732849343239,0.00475020097679
"HRT18_LARGE_INTESTINE",1.42481031964,0.439490944643,0.122178827723,0.353012389715,0.0139940628893
"HS294T_SKIN",0.721955598801,1.13568446599,0.214083630592,0.601245881084,0.00902141765825
"HS578T_BREAST",1.0453909433,0.605139401865,0.259457325935,0.250676003579,0.0132416964424
"HS683_CENTRAL_NERVOUS_SYSTEM",0.591950106095,1.57836637025,0.457581281662,0.507427097406,0.00948645124845
"HS695T_SKIN",0.457502038027,0.847297506114,0.118837956339,0.71925097598,0.00639652528083
"HS729_SOFT_TISSUE",0.960533524176,0.309078852054,0.12094326069,0.24555857127,0.00579202863827
"HS766T_PANCREAS",0.676049672247,2.11049268836,0.461706548929,1.07765128573,0.0151650621481
"HS852T_SKIN",0.239758912705,0.497623069977,0.0878008877238,0.428254372087,0.00705323802217
"HS939T_SKIN",0.652980456634,0.686570863199,0.132129502793,0.565816341987,0.0152368412031
"HS944T_SKIN",0.893949576303,1.27160954232,0.260785236955,0.884011077783,0.0142599353294
"HSC2_UPPER_AERODIGESTIVE_TRACT",0.89553181198,1.69242702234,0.324521124363,0.808854306901,0.00899569407605
"HSC3_UPPER_AERODIGESTIVE_TRACT",1.21937238689,0.980113384939,0.289619982243,0.617893004314,0.0148474987487
"HSSYII_LUNG",0.746734933916,0.684792748452,0.124826475978,0.642008591329,0.0103266478626
"HT1080_SOFT_TISSUE",0.703476197989,1.79992233749,0.633483268321,0.956368575203,0.0199680426277
"HT115_LARGE_INTESTINE",0.986081219143,0.726602151467,0.0831406737367,0.633853389309,0.0138383937129
"HT1197_URINARY_TRACT",1.29881188271,0.726823045763,0.276789415628,0.447344764092,0.0161153127481
"HT1376_URINARY_TRACT",1.7989444191,0.240703164325,0.0598615830143,0.198905457552,0.00756891646473
"HT144_SKIN",0.82285200535,1.92489451651,0.207974582911,1.16783757211,0.0225056548641
"HT29_LARGE_INTESTINE",1.67157669473,0.891782425509,0.18839880079,0.697455500837,0.013982744421
"HT55_LARGE_INTESTINE",2.07668776043,0.385586026148,0.118383112364,0.297205879515,0.0193214173732
"HUG1N_STOMACH",0.871181329224,0.5964071765,0.165444301441,0.410504850272,0.0114824783326
"HUH1_LIVER",1.03080945807,0.679704070536,0.16583849676,0.373135041807,0.00910760602561
"HUH6_LIVER",2.73229942617,0.247168969149,0.170079988738,0.208454537077,0.0164708963088
"HUH7_LIVER",0.825081081952,0.437574572559,0.0502625443041,0.361333301185,0.0182923386087
"HUPT3_PANCREAS",1.55284790754,0.782205617727,0.16451850906,0.541399829933,0.0155994471988
"HUPT4_PANCREAS",2.17632142984,0.574234700636,0.204288184643,0.512297848906,0.0260747224191
"HUTU80_SMALL_INTESTINE",0.853625517852,1.89049300055,0.440073877573,0.761416154246,0.019335993006
"IALM_LUNG",0.953099301396,2.02174506069,0.515338718891,0.905206459759,0.00974137944277
"IGR1_SKIN",0.626641934608,1.2421981228,0.284924939275,0.861334754807,0.0111071535443
"IGR37_SKIN",0.816720285418,1.20014545372,0.211913431684,1.00912679296,0.0142425863967
"IGR39_SKIN",0.566107723721,0.665448180004,0.120546875522,0.352979048874,0.00811990557352
"IGROV1_OVARY",1.67263705287,0.661484566215,0.322712644935,0.330576719225,0.00893712490243
"IM95_STOMACH",0.775695376023,1.41815500304,0.396426647902,0.922767853987,0.015416799604
"INA6_HAEMATOPOIETIC_AND_LYMPHOID_TISSUE",0.954622695559,2.06355431868,0.627328813076,1.26593566606,0.0065811233281
"IOMMLEE_CENTRAL_NERVOUS_SYSTEM",0.680844900185,2.58175716872,0.358110755682,1.65028396535,0.0179542685171
"IPC298_SKIN",1.00325804708,0.993308870679,0.293233271688,0.599574624272,0.02617006093
"ISHIKAWAHERAKLIO02ER_ENDOMETRIUM",0.851714348394,0.848614701903,0.119479830066,0.728184994145,0.0245476796444
"JHESOAD1_OESOPHAGUS",1.0919814879,1.83426026701,0.250211596489,1.05722060881,0.0181127609779
"JHH1_LIVER",1.13301549109,1.50847987412,0.218330383301,0.877161294686,0.00790937617806
"JHH5_LIVER",1.15752549314,1.50159590523,0.235465958714,0.564039261391,0.00630873343726
"JHH6_LIVER",0.884617977542,1.04581490014,0.106581012408,0.812849086269,0.0158593981395
"JHH7_LIVER",0.854760000336,1.06232030725,0.139662072062,0.843950065781,0.014494733349
"JHOC5_OVARY",1.09149278715,1.77189257835,0.199485227466,1.05468031381,0.0240671265958
"JHOM1_OVARY",1.18885616438,0.675131954023,0.231146946549,0.423494096309,0.0183609363836
"JHOS2_OVARY",1.45206275141,0.656526303643,0.17098981142,0.462817204056,0.00593445845089
"JHUEM2_ENDOMETRIUM",0.79084874202,1.34829175894,0.388626627624,0.690267884265,0.00901282756853
"JIMT1_BREAST",1.44484430249,0.801725787385,0.151060769334,0.577891154774,0.00610555562761
"JJN3_HAEMATOPOIETIC_AND_LYMPHOID_TISSUE",0.828321251099,2.14902124403,0.529299080372,1.12653373817,0.00729083095525
"JL1_PLEURA",1.04965472702,0.622899934884,0.10849305739,0.458601064863,0.00454650187941
"JMSU1_URINARY_TRACT",0.907060226755,0.588661924972,0.125508760413,0.483181557779,0.0126926977158
"JR_SOFT_TISSUE",0.68673134411,2.69617155104,0.581343114376,1.60498025777,0.0331027599122
"K029AX_SKIN",0.644214549558,1.84979923141,0.420439705253,1.40177153769,0.0335318442187
"K562_HAEMATOPOIETIC_AND_LYMPHOID_TISSUE",1.35055578755,1.21727984729,0.228499546647,0.870414767627,0.0149159099076
"KALS1_CENTRAL_NERVOUS_SYSTEM",0.648153606432,1.79478039325,0.569268286228,0.307663039486,0.0182773188255
"KARPAS422_HAEMATOPOIETIC_AND_LYMPHOID_TISSUE",0.690242964422,1.65556538211,0.510602355003,0.852133499565,0.0043503688853
"KASUMI1_HAEMATOPOIETIC_AND_LYMPHOID_TISSUE",1.16726026916,0.559708830319,0.213894307613,0.496419543519,0.0142046123268
"KASUMI2_HAEMATOPOIETIC_AND_LYMPHOID_TISSUE",0.320281811651,0.418764869975,0.0726587250829,0.378148758828,0.0181272254528
"KATOIII_STOMACH",1.09758029409,1.89844120527,0.377858251333,1.16470435167,0.0339976871851
"KD_SOFT_TISSUE",0.642682106428,2.05999122684,0.594517230988,0.347003960233,0.0159291002527
"KE39_STOMACH",1.5185894499,1.00046933301,0.0990973040462,0.680657745673,0.0362948120192
"KELLY_AUTONOMIC_GANGLIA",0.451185772438,0.565724760639,0.0939255580306,0.37767483392,0.0135208512686
"KM12_LARGE_INTESTINE",1.08931451156,0.98252245395,0.188671059906,0.776772919104,0.00889956738535
"KMM1_HAEMATOPOIETIC_AND_LYMPHOID_TISSUE",0.628077094641,2.54179168122,0.549820184708,1.50524489842,0.0103199745317
"KMRC1_KIDNEY",0.615643400621,1.18307097474,0.357889518142,0.293949567133,0.00791841504493
"KMRC20_KIDNEY",0.73989494763,0.794865800494,0.0844362601638,0.63801598813,0.0167496995681
"KMRC2_KIDNEY",0.669021306604,0.805336874329,0.158522605896,0.532890121628,0.00564546497166
"KMS12BM_HAEMATOPOIETIC_AND_LYMPHOID_TISSUE",0.690488921773,1.7672143136,0.289505153894,1.12627910476,0.00449652017922
"KMS18_HAEMATOPOIETIC_AND_LYMPHOID_TISSUE",0.833115289878,2.06485522148,0.430897474289,1.51376226125,0.0209571708721
"KMS27_HAEMATOPOIETIC_AND_LYMPHOID_TISSUE",0.534285804806,0.98429283194,0.196371043722,0.981679529845,0.0147501825167
"KMS28BM_HAEMATOPOIETIC_AND_LYMPHOID_TISSUE",0.648371044777,1.08229410305,0.28020854791,1.03342441932,0.0205521744257
"KMS34_HAEMATOPOIETIC_AND_LYMPHOID_TISSUE",0.573124654204,1.39697453554,0.298441956441,1.34947620531,0.0170836799892
"KNS42_CENTRAL_NERVOUS_SYSTEM",0.435522425063,0.603841208685,0.0782849142949,0.491727655863,0.0181850781473
"KNS60_CENTRAL_NERVOUS_SYSTEM",0.945579277234,1.49638438157,0.283395439386,0.697872957574,0.00431161350609
"KNS62_LUNG",0.977341415751,1.45794605786,0.406286530197,1.08765249707,0.0179157155378
"KNS81_CENTRAL_NERVOUS_SYSTEM",0.66231921083,0.622743804409,0.151651168242,0.399216061365,0.0169419065124
"KP1NL_PANCREAS",1.06355927974,1.56706207543,0.198987588286,1.07072279702,0.0282674120342
"KP1N_PANCREAS",0.971967425527,0.679363908409,0.0655393364529,0.591912181275,0.0168867489545
"KP2_PANCREAS",0.567061376695,1.59669665793,0.683351993561,0.0492117999298,0.0206063446641
"KP3_PANCREAS",0.750723626759,0.817767610535,0.0798487166564,0.646412024738,0.0202981869117
"KP4_PANCREAS",0.869636576728,0.762324181182,0.0874228244647,0.547530581511,0.00773263485121
"KPL1_BREAST",1.27417524206,0.658769105423,0.212366954982,0.338555700868,0.0104807019633
"KPNSI9S_AUTONOMIC_GANGLIA",0.614064316275,1.80207011308,0.578872601191,1.20985442437,0.0067808441071
"KPNYN_AUTONOMIC_GANGLIA",0.387604763898,0.686228126788,0.0990085154772,0.570281650419,0.0125745125549
"KS1_CENTRAL_NERVOUS_SYSTEM",0.749866432738,0.841116857858,0.126625671983,0.610782007748,0.0270653566191
"KU1919_URINARY_TRACT",0.614746105915,1.37969768101,0.367050786813,1.1033548,0.0146328649339
"KURAMOCHI_OVARY",1.51340279176,1.31115887546,0.235355198383,0.746745326643,0.0074678131439
"KYM1_SOFT_TISSUE",0.318435158454,1.51724249478,0.30891418457,1.09067349155,0.0123061103614
"KYSE140_OESOPHAGUS",1.15457379489,1.71257807622,0.15649689734,0.97465257127,0.0456599110249
"KYSE150_OESOPHAGUS",0.717781105294,1.22759738765,0.171744849533,0.890254130257,0.0101583694123
"KYSE180_OESOPHAGUS",0.933334515717,0.95299964169,0.115312734619,0.684661130924,0.0120792415485
"KYSE30_OESOPHAGUS",1.18044640256,1.13196024267,0.239988565445,0.759561982396,0.0140318235269
"KYSE410_OESOPHAGUS",1.33283154663,0.796280175158,0.074556902051,0.662787016316,0.0362875317972
"KYSE450_OESOPHAGUS",0.955564803441,0.855382283114,0.128766648471,0.65085976987,0.0149903295261
"KYSE510_OESOPHAGUS",0.836998210416,1.03456646731,0.110364753753,0.719828520508,0.0109600699341
"KYSE520_OESOPHAGUS",1.08388016548,1.60734176343,0.2188616395,0.934829857244,0.034749050328
"KYSE70_OESOPHAGUS",0.938677358796,1.37370040537,0.196524951607,1.09672312155,0.0123522370884
"L33_PANCREAS",1.35936881684,0.756543556093,0.149962419644,0.546821466628,0.0272911005668
"L363_HAEMATOPOIETIC_AND_LYMPHOID_TISSUE",0.732077636644,2.40996434119,0.428316652775,1.80594437712,0.00667866979888
"LAMA84_HAEMATOPOIETIC_AND_LYMPHOID_TISSUE",1.78038855958,1.14845227899,0.305013775826,0.721716849625,0.013556084149
"LC1SQSF_LUNG",0.700619935962,1.38154325902,0.26945245266,0.785400769089,0.00355074574223
"LCLC103H_LUNG",0.961990219873,0.932928387422,0.227680385113,0.462932535756,0.0141464875582
"LCLC97TM1_LUNG",1.07178520343,1.59791582051,0.282146006823,0.641858318724,0.0117008375947
"LI7_LIVER",0.581209505146,1.0308829545,0.143645375967,0.739408858156,0.0168074205561
"LK2_LUNG",1.04655104537,0.911289367184,0.190832879394,0.592506418469,0.0155254866113
"LMSU_STOMACH",0.954717077806,0.542795106722,0.110033936799,0.41298906299,0.0110671105846
"LN18_CENTRAL_NERVOUS_SYSTEM",0.752410640398,1.17586827685,0.2043043226,0.836732538415,0.0162126112684
"LN215_CENTRAL_NERVOUS_SYSTEM",0.914829916045,1.81121306848,0.287533789873,0.907554091763,0.00999840345955
"LN229_CENTRAL_NERVOUS_SYSTEM",0.682727213565,1.59576440109,0.164938725531,0.968366866756,0.0205016896556
"LN235_CENTRAL_NERVOUS_SYSTEM",1.08048608362,0.94303578216,0.457353800535,0.0716084978583,0.00486318776282
"LN319_CENTRAL_NERVOUS_SYSTEM",1.88039719048,0.512988859699,0.300074577332,0.452362472261,0.0183770445049
"LN340_CENTRAL_NERVOUS_SYSTEM",0.6396355807,1.95032167902,0.294393837452,1.20884912291,0.0133538991119
"LN382_CENTRAL_NERVOUS_SYSTEM",1.00556746832,1.37544133624,0.194229960442,0.92737055216,0.00501088181322
"LN428_CENTRAL_NERVOUS_SYSTEM",1.07699213145,1.69853875516,0.212219521403,0.901658985998,0.0265207289241
"LN443_CENTRAL_NERVOUS_SYSTEM",0.554411709031,1.62235801564,0.332952082157,0.983045425659,0.00615994002992
"LN464_CENTRAL_NERVOUS_SYSTEM",1.03407574857,1.59474511603,0.28184697032,1.05537352131,0.0155115033294
"LNCAPCLONEFGC_PROSTATE",0.828513149691,0.999253418918,0.303849507123,0.642702465842,0.00806168935633
"LNZ308_CENTRAL_NERVOUS_SYSTEM",1.11093996299,0.989611219829,0.23549054563,0.675885048672,0.00474002525285
"LOUNH91_LUNG",0.510530425956,2.40110173693,0.725824534893,0.901644396751,0.00920521139169
"LOVO_LARGE_INTESTINE",1.0121370563,0.895210579825,0.222789436579,0.607438385276,0.0132530008778
"LOXIMVI_SKIN",1.14380842842,1.18743389724,0.311407312751,0.813990505736,0.0253510627017
"LS180_LARGE_INTESTINE",0.773587077741,1.31058295146,0.281673450023,0.826817445561,0.0219071303442
"LS411N_LARGE_INTESTINE",1.06798663595,0.491858344796,0.120757548138,0.35960465434,0.0129486175124
"LS513_LARGE_INTESTINE",0.7727001457,1.16964867883,0.337613572677,0.597506704912,0.0145665032392
"LU65_LUNG",0.92169350357,2.21744505234,0.312711805105,1.48067598641,0.0195876751838
"LU99_LUNG",0.76553168104,2.75653298961,0.470295935869,1.66342592688,0.0325935571377
"LUDLU1_LUNG",1.54998521707,0.422440839413,0.100438373163,0.244532701304,0.0250436103003
"LXF289_LUNG",1.05264336354,1.65923021157,0.236020594835,0.7140188693,0.0272150417143
"LY2_BREAST",1.42574854526,0.688952961446,0.266273707151,-0.00827888240233,0.0421867244751
"M059K_CENTRAL_NERVOUS_SYSTEM",0.749932780133,1.95262197373,0.652924835682,0.36960074922,0.00955370046128
"MACLS2_BREAST",2.1387811799,0.71609779806,0.753096044064,-0.0357452598146,0.00532528346639
"MB157_BREAST",1.89573560946,0.946050673576,0.327017486095,0.156070866182,0.0102419565238
"MCF10A_BREAST",0.922396636548,1.56584746675,0.363659828901,0.475497385146,0.0153176442962
"MCF12A_BREAST",2.42589156676,0.606881189162,0.386612027884,-0.0373427236407,0.0339113291279
"MCF7_BREAST",1.51600512797,0.414579966637,0.173987663537,0.205341866936,0.0146521864992
"MDAMB134VI_BREAST",0.843647662013,1.42068610628,0.894568264484,0.486313258025,0.0142544641334
"MDAMB157_BREAST",0.503145113572,0.510502829146,0.174668246508,0.196710453813,0.0196975154313
"MDAMB175VII_BREAST",0.955867649685,1.31564056574,0.193574905396,0.936655299146,0.00882592799417
"MDAMB231_BREAST",0.966371141565,1.42205621524,0.4151612252,0.790729435626,0.0159651811441
"MDAMB330_BREAST",1.25342840379,1.29714539045,0.595258831978,0.533179659429,0.00849437095023
"MDAMB361_BREAST",1.19604498154,1.10581361646,0.400754570961,0.445060517339,0.00645672833966
"MDAMB415_BREAST",0.803426439663,0.553108170585,0.391930276155,0.2804034455,0.0157841222131
"MDAMB435S_SKIN",0.866433504459,2.01454153104,0.366496711969,1.0543520499,0.0104456802769
"MDAMB436_BREAST",1.06391526717,1.12612775359,0.285708537698,0.659307286824,0.0212132190462
"MDAMB453_BREAST",2.97039590486,0.255336860027,0.159148918092,0.16607244762,0.00695667229024
"MDAMB468_BREAST",1.35949219499,0.873271078038,0.229848532379,0.506630566563,0.00608778079929
"MDAPCA2B_PROSTATE",1.12791423633,1.71480822309,0.324219584465,1.01688382123,0.0206482174397
"MDST8_LARGE_INTESTINE",0.411921070623,1.23526716859,0.189123610655,0.95033725705,0.024575985042
"ME180_CERVIX",0.582020870613,0.517090210852,0.0802609125773,0.400329557651,0.0181447629389
"MEL285_UVEA",0.537822451205,0.290399372471,0.0786547288299,0.227273616409,0.0122721339348
"MELHO_SKIN",0.600621299075,1.20952933056,0.294274378568,0.870253762004,0.0130095962899
"MELJUSO_SKIN",0.851887286633,1.47113808741,0.167920995504,1.12014247196,0.0224707331905
"MEWO_SKIN",0.827901261491,1.06015709907,0.275499373674,0.772573807269,0.00736580743091
"MFE280_ENDOMETRIUM",1.15988477185,0.667807445056,0.154394183308,0.439648993963,0.0170110814724
"MFE296_ENDOMETRIUM",0.749150208206,0.473712031807,0.0760196497043,0.365165051895,0.00857139907169
"MFE319_ENDOMETRIUM",0.489171725564,0.32805259365,0.0431292069455,0.266463018176,0.0128136592995
"MFM223_BREAST",1.41358363584,1.07508021326,0.491630017757,0.365506540046,0.0240561852208
"MHHES1_BONE",0.652240640865,2.0767273098,0.21183796227,1.1403292197,0.00227100397591
"MIAPACA2_PANCREAS",0.983079077741,1.13676289882,0.186850488186,0.815271028511,0.0169577751482
"MKL1_SKIN",0.888151649503,1.77285999332,0.287447631359,1.04704110313,0.033523909985
"MKL2_SKIN",0.764393824672,1.11852890483,0.211106181145,0.660179852191,0.00199937527329
"MKN1_STOMACH",1.18723524862,0.830530196514,0.161410534754,0.537715434676,0.00853863130136
"MKN45_STOMACH",0.979897224902,0.96766850837,0.132214397192,0.704534042314,0.010576550439
"MKN7_STOMACH",1.10436014705,0.592669076153,0.102551501244,0.38543254303,0.0243655235921
"MM1S_HAEMATOPOIETIC_AND_LYMPHOID_TISSUE",0.580773222514,1.37281640971,0.406453222036,1.15019870432,0.038234835748
"MOLM13_HAEMATOPOIETIC_AND_LYMPHOID_TISSUE",0.76458481877,1.60837062024,0.86426885426,1.05036071826,0.0167066722606
"MOLM16_HAEMATOPOIETIC_AND_LYMPHOID_TISSUE",0.601856740971,0.426095515429,0.114187670251,0.378650658583,0.0249709802781
"MONOMAC1_HAEMATOPOIETIC_AND_LYMPHOID_TISSUE",0.919369933446,0.951266240888,0.313842028379,0.674253999515,0.0164774892591
"MONOMAC6_HAEMATOPOIETIC_AND_LYMPHOID_TISSUE",1.84823425715,0.423579548283,0.111529806629,0.375806822622,0.0119526134189
"MORCPR_LUNG",1.84316864927,1.09169757078,0.136337205768,0.806431863165,0.0301600222054
"MPP89_PLEURA",0.617096911842,0.66479454796,0.0959476108352,0.476725988153,0.0203028703315
"MV411_HAEMATOPOIETIC_AND_LYMPHOID_TISSUE",0.761488845055,1.79776151108,0.564580738544,0.679055523456,0.0157150483507
"MX1_BREAST",2.0502319977,0.884889575182,0.352897286415,0.243530337924,0.02614543892
"NALM6_HAEMATOPOIETIC_AND_LYMPHOID_TISSUE",0.575416602576,2.10083706209,0.278328299522,1.51576212937,0.009346986584
"NB1_AUTONOMIC_GANGLIA",0.582423294883,0.576702133943,0.18179188172,0.414094683528,0.012986117393
"NB4_HAEMATOPOIETIC_AND_LYMPHOID_TISSUE",0.708837977159,2.38086990032,0.366703599691,1.52773421145,0.022064642504
"NCCSTCK140_STOMACH",1.04433856053,1.04283810398,0.14261738956,0.649970862355,0.00257038187941
"NCIH1048_LUNG",0.805099876716,1.20886016832,0.372536785901,0.876035438046,0.0119015379199
"NCIH1105_LUNG",1.35506721899,1.1267880883,0.216703057289,0.650363390898,0.0219394943839
"NCIH1155_LUNG",0.751430462642,2.34451649571,0.468871712685,1.38317238793,0.0176969965278
"NCIH1299_LUNG",2.37049700217,0.434070288236,0.0814060987905,0.414820922065,0.0171423592894
"NCIH1339_LUNG",1.11203032268,1.6232361559,0.628080785275,0.476647668711,0.00449718931566
"NCIH1355_LUNG",1.59358383869,0.572880967333,0.094614258036,0.544826043255,0.0115336524381
"NCIH1373_LUNG",1.07310041357,0.816474146036,0.151963427663,0.599913716919,0.00965484684954
"NCIH1395_LUNG",0.695674394651,2.61022294276,0.487212926149,1.33061536228,0.0177473181932
"NCIH1435_LUNG",1.11818682935,0.271779442533,0.0401152558625,0.226477251221,0.00655750740746
"NCIH1437_LUNG",1.21045647907,0.914066721195,0.143009437248,0.668315655933,0.00892025479165
"NCIH146_LUNG",0.819485453476,1.84082747978,0.439678162336,1.25715682343,0.032931696352
"NCIH1568_LUNG",2.0453122569,0.590478406764,0.113451527432,0.4163371673,0.00564453849729
"NCIH1573_LUNG",0.243573478535,0.966881983506,0.165422042211,0.785754757208,0.0156556103028
"NCIH1581_LUNG",1.6148787213,0.38393443675,0.143045866862,0.164756709119,0.00804224858179
"NCIH1623_LUNG",1.06848222333,1.75678980456,0.280118048191,0.929776505212,0.0340469909066
"NCIH1648_LUNG",0.763473183241,0.676357371124,0.238655745983,0.274725909531,0.016796584682
"NCIH1650_LUNG",1.34023102476,1.17408441521,0.220628812909,0.752257090848,0.0239598399536
"NCIH1666_LUNG",0.901938780908,1.98961820556,0.477513700724,0.869494134155,0.00652525213262
"NCIH1693_LUNG",0.834458947448,1.01893864417,0.151510374621,0.665543814413,0.0178793393329
"NCIH1694_LUNG",0.90261448929,1.69854939522,0.283905565739,0.840418669551,0.00269199145201
"NCIH1703_LUNG",1.02409928315,1.09279918269,0.231058534235,0.733915294988,0.0159221080608
"NCIH1792_LUNG",0.892628966992,0.860858620927,0.117272708565,0.627012959584,0.0207070672854
"NCIH1793_LUNG",0.983272966374,0.328711494546,0.0500890028973,0.264924186985,0.00604688096632
"NCIH1836_LUNG",1.00461172666,1.31307165374,0.281505256891,0.571386836979,0.00656437670237
"NCIH1838_LUNG",1.14380359521,0.12530607624,0.0411027943095,0.102762976584,0.00427582880089
"NCIH1876_LUNG",0.746841283732,1.86097111187,0.287669062614,1.06419408072,0.00660652980565
"NCIH1915_LUNG",0.580868911446,2.12192868744,0.597644150257,0.542162387551,0.0261780487343
"NCIH1944_LUNG",1.06788152594,1.06183823432,0.179230898619,0.675065095617,0.00815165517163
"NCIH196_LUNG",1.19793896599,0.383806836285,0.0951162921265,0.304734841603,0.0150059815839
"NCIH1975_LUNG",0.524157756847,1.2668984775,0.208826219663,0.849100610356,0.0091474661976
"NCIH2004RT_SOFT_TISSUE",0.514507647849,2.1983273189,0.730097472668,0.695556295641,0.033972238664
"NCIH2009_LUNG",0.973570421995,0.952114196319,0.209124278277,0.555071877507,0.0139280434783
"NCIH2023_LUNG",0.826939719504,2.04516855353,0.229662492871,1.12564101131,0.0127991332864
"NCIH2030_LUNG",1.50018787139,0.628071481607,0.147975046188,0.345886293801,0.0136134578173
"NCIH2052_PLEURA",0.85729641105,1.03924634186,0.270438365638,0.658893316446,0.00779784997031
"NCIH2066_LUNG",1.44776534891,0.383819761216,0.0974781289697,0.192637896805,0.0219701207289
"NCIH2087_LUNG",1.14354905772,1.63538639736,0.290555983782,0.524323570674,0.020461850375
"NCIH209_LUNG",0.649714120756,2.18903605612,0.372999221087,1.6508591739,0.0162073308708
"NCIH2110_LUNG",1.31136878064,0.952605038866,0.140703998506,0.659772967625,0.0169131608739
"NCIH211_LUNG",1.41595747296,1.12281932205,0.177254751325,0.838105706819,0.0230099073895
"NCIH2122_LUNG",0.756436939961,1.39654127583,0.29285460338,0.879723698109,0.0106749843948
"NCIH2126_LUNG",1.24168053354,0.543081195029,0.102317390963,0.318829373334,0.0151927072882
"NCIH2170_LUNG",0.765505559014,1.13819636434,0.173869775608,0.826262871792,0.00825533145442
"NCIH2171_LUNG",0.650156716815,2.06516906245,0.30752402544,1.25267657812,0.0161184136404
"NCIH2172_LUNG",3.63357953756,0.225563460739,0.0696331635118,0.271811301083,0.0116861789293
"NCIH2228_LUNG",0.403270331744,0.55382631494,0.11786981672,0.3860245661,0.00696952617023
"NCIH2286_LUNG",0.799617615753,1.18211033252,0.324039176106,0.716193633148,0.0145262038594
"NCIH2291_LUNG",0.980178179985,0.62477059123,0.132099461742,0.333041092963,0.0184656392667
"NCIH23_LUNG",1.6197580273,0.697796205115,0.108821099624,0.619177858795,0.00801971080884
"NCIH2405_LUNG",0.972129691354,1.89426650045,0.47172960639,0.772505335943,0.00522761819543
"NCIH2452_PLEURA",0.595044674943,2.14409005508,0.473826646805,0.843324672838,0.0117468840903
"NCIH2882_LUNG",0.999888628899,0.83163994421,0.240432113409,0.243234595095,0.00468155290315
"NCIH2887_LUNG",0.699537467565,2.4428472289,0.632240235806,1.22559093276,0.0165188909569
"NCIH28_PLEURA",0.449754837882,0.505811562,0.104666493833,0.379690143008,0.0244402188295
"NCIH292_LUNG",1.00087330905,1.92540946666,0.470647960901,0.810261420068,0.00742938482067
"NCIH3122_LUNG",1.18023954743,1.53713349029,0.237463742495,0.732747515123,0.00688293884022
"NCIH322_LUNG",1.33391269551,1.60517556013,0.224167525768,0.933726431654,0.00803642850431
"NCIH3255_LUNG",1.69807959572,0.727815884584,0.169394537807,0.31174261988,0.0154049483844
"NCIH358_LUNG",1.35756025475,0.898973977412,0.123327950016,0.624797917213,0.0246283033345
"NCIH441_LUNG",1.10437682556,0.57043339428,0.127335908823,0.399974229663,0.0222002330907
"NCIH446_LUNG",0.823221596088,1.07313765249,0.717635403077,0.64817706103,0.0114473725562
"NCIH460_LUNG",0.83243294095,1.52862409041,0.251952715218,1.05754361184,0.0117267013149
"NCIH508_LARGE_INTESTINE",1.22321862125,0.563607632816,0.158902410418,0.381471991003,0.00932882618814
"NCIH520_LUNG",0.676563700112,2.08161968802,0.448212713003,1.14602172299,0.0153940997939
"NCIH522_LUNG",0.745580043813,0.433398928352,0.0974305355921,0.290359411915,0.0250934746892
"NCIH526_LUNG",1.20771113448,0.424442833647,0.11645244807,0.278756325265,0.0139344805621
"NCIH647_LUNG",1.10408846294,1.69809679419,0.47504851222,0.3775336008,0.00985492544193
"NCIH650_LUNG",1.07978640069,1.21879282021,0.165845677257,0.669673999723,0.0470399008816
"NCIH660_PROSTATE",4.11007275896,0.192980859948,0.222917765379,0.227097717904,0.00580821001864
"NCIH661_LUNG",1.46721796883,0.431891669315,0.102983202785,0.330038689871,0.0111922357274
"NCIH716_LARGE_INTESTINE",0.740347536973,0.833199942332,0.180178752169,0.525947030051,0.01407199322
"NCIH727_LUNG",0.892913690063,1.84698714692,0.234625890851,1.00167459516,0.0239187118518
"NCIH747_LARGE_INTESTINE",0.512558094335,0.49312635919,0.0730019062757,0.393371216439,0.00710366607487
"NCIH838_LUNG",0.95879563645,1.24411463971,0.283877965063,0.820893667547,0.0217505751601
"NCIH841_LUNG",0.917745631417,1.80885207027,0.230730816722,0.772190550515,0.0292845475458
"NCIH854_LUNG",2.72755551584,0.490876346252,0.359678566456,0.18057779763,0.0124870903601
"NCIN87_STOMACH",0.908631591823,1.1119408547,0.272361464798,0.812606150561,0.0168080568713
"NIHOVCAR3_OVARY",0.94831425088,1.18508623001,0.295457919439,0.865892252697,0.0287352152219
"NOMO1_HAEMATOPOIETIC_AND_LYMPHOID_TISSUE",0.94189309785,1.3464374948,0.653603374958,0.12556865493,0.0174387075651
"NUGC3_STOMACH",0.981882767908,1.19229469439,0.148815467954,0.923308666906,0.0156337379478
"OAW42_OVARY",1.43778253313,1.29745859303,0.21848154068,0.765775132029,0.0104236697989
"OC314_OVARY",0.849459328646,1.9469261898,0.264159351587,0.980651074272,0.0061515721148
"OCIAML2_HAEMATOPOIETIC_AND_LYMPHOID_TISSUE",0.824052782385,2.22306026233,0.445417165756,1.36564475907,0.0149576857326
"OCIAML3_HAEMATOPOIETIC_AND_LYMPHOID_TISSUE",0.919317990312,1.70244566208,0.412913918495,0.942430234421,0.0156970169777
"OCIAML5_HAEMATOPOIETIC_AND_LYMPHOID_TISSUE",0.799054999175,2.16541402184,0.421347409487,1.19740619745,0.0494378379177
"OCIMY7_HAEMATOPOIETIC_AND_LYMPHOID_TISSUE",0.748563318543,1.83904084629,0.538694739342,1.08475081125,0.00483050222295
"OCUBM_BREAST",1.16641815875,0.760305065246,0.376608252525,0.0506931784622,0.00360030183196
"OCUM1_STOMACH",1.19497231565,0.809719636496,0.158973733584,0.726076857887,0.0143082980495
"OE21_OESOPHAGUS",0.966586276151,1.04894533846,0.161584978302,0.912740972314,0.0166634175743
"OE33_OESOPHAGUS",0.837212690546,2.0733109385,0.284644335508,1.34276316076,0.0277995456646
"OELE_OVARY",0.952944889235,1.40955796156,0.605051755905,-0.118087361571,0.0257541032319
"OMM1_UVEA",0.838711739958,1.1620739413,0.177177240451,0.928163209111,0.0193923819297
"OPM1_HAEMATOPOIETIC_AND_LYMPHOID_TISSUE",0.687907739324,2.51498345129,0.547951161861,1.78109612035,0.0369904263766
"OPM2_HAEMATOPOIETIC_AND_LYMPHOID_TISSUE",0.658578498168,2.31487650279,0.498093307018,1.43006744542,0.00477548414924
"OSRC2_KIDNEY",0.467878467463,1.23373652801,0.215402565897,0.819058343642,0.00744778965857
"OUMS23_LARGE_INTESTINE",4.40794666468,0.0928289383555,0.076877164344,0.0881610962684,0.00824666156548
"OV7_OVARY",0.64273826825,1.12227099738,0.440553933382,0.0760745852071,0.0364823807752
"OV90_OVARY",0.667217577829,1.08025783273,0.240706155077,0.539985305253,0.0125768154409
"OVCAR4_OVARY",0.900172335082,1.11566201741,0.312715465824,0.632254588065,0.0104934018772
"OVCAR8_OVARY",0.890174756861,1.24730583143,0.373246330768,0.834088921588,0.0126014206714
"OVISE_OVARY",1.49801023953,1.33903838362,0.238541424274,0.908492743541,0.0117267896308
"OVSAHO_OVARY",0.588374155877,0.630813939874,0.101277947426,0.555925279127,0.0218895253109
"OVTOKO_OVARY",0.759698733004,1.31123278989,0.392709374428,0.122581478054,0.00467377983264
"PANC0203_PANCREAS",1.20021903536,0.586998439776,0.106221800049,0.479570393189,0.0220385160123
"PANC0327_PANCREAS",1.18648256511,1.47568592895,0.378079026937,0.547535159019,0.0188141008518
"PANC0403_PANCREAS",0.782829780082,0.801543270133,0.0977501447002,0.638645489705,0.0155976723273
"PANC0504_PANCREAS",0.457069561629,1.19066331879,0.210397894184,0.929782120482,0.0067100384459
"PANC0813_PANCREAS",1.09040491106,1.87000777998,0.38696461916,0.982259834038,0.0277629439086
"PANC1005_PANCREAS",0.662762712915,1.32603181179,0.383032657206,0.813613960276,0.0130944149906
"PANC1_PANCREAS",0.87698199148,0.629803248794,0.0709761405985,0.522543614784,0.0127391513974
"PATU8902_PANCREAS",1.48881171229,0.666802613049,0.0879631862044,0.556179039171,0.00773389253201
"PATU8988T_PANCREAS",1.13178183908,0.86288277477,0.118785440922,0.701811823561,0.0153219712291
"PC14_LUNG",0.907612017837,1.68510975138,0.195883974433,0.925675835252,0.00299661517359
"PC3_PROSTATE",1.08777765615,1.40485934744,0.245669111609,0.769373469371,0.00631277467995
"PECAPJ34CLONEC12_UPPER_AERODIGESTIVE_TRACT",0.83412015493,1.26718674556,0.230140142143,0.768121362038,0.0099763462091
"PECAPJ41CLONED2_UPPER_AERODIGESTIVE_TRACT",0.978980131623,1.15292882877,0.179529791077,0.955798444724,0.0191428039033
"PECAPJ49_UPPER_AERODIGESTIVE_TRACT",0.922999115235,2.14629593059,0.29813849926,0.922000483109,0.00846493453946
"PETA_SKIN",0.660120218621,1.29075620622,0.234540537,1.26072282932,0.0254266125973
"PFEIFFER_HAEMATOPOIETIC_AND_LYMPHOID_TISSUE",0.637623447441,0.532852072914,0.121221788228,0.483801726366,0.00906523690213
"PK1_PANCREAS",0.995337636848,0.698969780994,0.0886582508683,0.583676326193,0.01081152743
"PLB985_HAEMATOPOIETIC_AND_LYMPHOID_TISSUE",0.932861784878,1.87095843816,0.414235681295,1.04732759959,0.00650461548185
"PLCPRF5_LIVER",0.746498377665,1.81359314947,0.280464738607,0.876386462526,0.0047009780958
"PRECLH_PROSTATE",0.842995262491,1.59089581727,0.399396210909,0.317655086501,0.0104031713662
"PSN1_PANCREAS",0.843941008215,2.02992531198,0.281288504601,1.25388786376,0.0240677975612
"QGP1_PANCREAS",0.676629563541,1.48647008927,0.239976331592,0.880372617854,0.0193384162103
"RCC4_KIDNEY",0.557307914418,1.24145229703,0.185157363613,0.925648013377,0.0105073753249
"RCHACV_HAEMATOPOIETIC_AND_LYMPHOID_TISSUE",0.627263734066,0.753365860974,0.123397794863,0.695589633012,0.0138704444023
"RDES_BONE",0.684666756566,1.52623884135,0.25549146533,0.578934743085,0.0162320632139
"RD_SOFT_TISSUE",0.938608290687,1.10258961415,0.284817215055,0.732929446018,0.0140782797568
"REH_HAEMATOPOIETIC_AND_LYMPHOID_TISSUE",0.877777078627,0.999850929612,0.168490473181,0.902724030216,0.0143070664209
"RERFLCAD2_LUNG",1.30640112673,1.42694312521,0.301629275084,0.339410094532,0.0163779612484
"RERFLCAI_LUNG",0.690098048741,2.28820020623,0.306373178959,1.32531149259,0.00898908258429
"RERFLCMS_LUNG",0.907895600858,1.01231004966,0.100943995019,0.831193265088,0.0119153647066
"RH30_SOFT_TISSUE",1.11917703208,0.899688188212,0.320205308497,0.58883069865,0.0182010130292
"RH41_SOFT_TISSUE",0.539288033414,1.02387702382,0.228112380952,0.633659087469,0.00878460615088
"RKN_SOFT_TISSUE",1.50022070767,0.697775358422,0.0933542773128,0.56123078157,0.00268775874463
"RKO_LARGE_INTESTINE",1.8367663467,0.892568044242,0.285328261554,0.653039638629,0.00862581365821
"RL952_ENDOMETRIUM",0.724582764454,1.9488274776,0.378813683987,1.14282954333,0.0084822608887
"RL_HAEMATOPOIETIC_AND_LYMPHOID_TISSUE",0.369591461907,0.0951270863627,0.0617598940929,0.0889850745383,0.0180258145995
"RMGI_OVARY",0.740587370941,1.21092219107,0.232934462527,0.55784510232,0.0114275250474
"RMUGS_OVARY",1.08699474317,0.46842329124,0.116557460278,0.338518340181,0.00881460503121
"RPMI7951_SKIN",0.629143518752,0.628985122134,0.0829554523031,0.512580342757,0.00438118582619
"RPMI8226_HAEMATOPOIETIC_AND_LYMPHOID_TISSUE",0.632693103409,1.18288283898,0.304163018862,1.11495254387,0.0148235844197
"RS411_HAEMATOPOIETIC_AND_LYMPHOID_TISSUE",1.31855065252,1.4057977891,0.26176160574,1.04780731505,0.0407337792547
"RT112_URINARY_TRACT",0.880264660795,1.44153056258,0.299568545073,1.02016797124,0.0110532029341
"RVH421_SKIN",0.66002945472,0.920316831757,0.237427514046,0.511697220203,0.00501722144477
"SAOS2_BONE",0.990288472126,0.37646326379,0.101612612605,0.224280609857,0.0075292883808
"SBC5_LUNG",0.798883505726,0.635568622963,0.0751850381494,0.520986716241,0.0140803654425
"SCC25_UPPER_AERODIGESTIVE_TRACT",1.27255276727,0.958085032256,0.160877411564,0.779211219091,0.0110553361934
"SCC4_UPPER_AERODIGESTIVE_TRACT",1.47337614835,0.737971573049,0.196884259582,0.325370693868,0.0128980464308
"SEM_HAEMATOPOIETIC_AND_LYMPHOID_TISSUE",0.652351974495,1.74414818023,0.368589803576,1.56470894201,0.022946761068
"SF126_CENTRAL_NERVOUS_SYSTEM",0.656484115182,1.82395362362,0.208668977022,1.09914520586,0.00567473587459
"SF172_CENTRAL_NERVOUS_SYSTEM",1.89857231773,1.05766282495,0.133086949587,0.756822262359,0.00376529514469
"SF268_CENTRAL_NERVOUS_SYSTEM",1.08977484755,0.897739935156,0.107654864589,0.752694744862,0.0118586115411
"SF295_CENTRAL_NERVOUS_SYSTEM",0.502804330757,0.843391712584,0.175571456552,0.539533307076,0.00878483249104
"SF767_CENTRAL_NERVOUS_SYSTEM",0.885955560654,1.93736131616,0.200652122498,1.2876498873,0.00297817863643
"SH4_SKIN",0.669742498732,1.3083534078,0.311671562493,0.883078234929,0.0142544008876
"SHP77_LUNG",0.770651522549,0.958502845465,0.267003049143,0.626131476675,0.0196744869567
"SIHA_CERVIX",0.688772852187,1.60769447475,0.216167658567,0.814246544554,0.0286706614724
"SJRH30_SOFT_TISSUE",0.713975751023,0.233613520326,0.0773160258929,0.155156342007,0.00873925152511
"SJSA1_BONE",0.768219701693,0.981463623069,0.215498194098,0.676933583535,0.0190011967853
"SKBR3_BREAST",0.857233297874,1.44315799641,0.450467824936,0.489194561267,0.020164830887
"SKBR5_BREAST",0.988197375963,1.40553642188,0.625851988792,0.484555503883,0.00424347395997
"SKBR7_BREAST",1.15734141581,1.22035661506,0.442910760641,0.346570902958,0.0110218311961
"SKCO1_LARGE_INTESTINE",2.21510192255,0.386612794095,0.140469320118,0.281506167461,0.00991359906532
"SKES1_BONE",0.766403441553,1.40402911929,0.381193235517,0.804331184663,0.00650346191634
"SKHEP1_LIVER",0.757181549807,1.14017705292,0.241728644818,0.692886022545,0.0172664608078
"SKMEL28_SKIN",0.843418324577,0.729243885574,0.129906341434,0.652243727225,0.0106872572801
"SKMEL2_SKIN",1.07446591359,0.853469817676,0.21905355528,0.633587495751,0.0102831065948
"SKMEL30_SKIN",0.983718108029,0.589813800947,0.0808576792479,0.522083612471,0.005767717989
"SKMEL3_SKIN",0.639188354958,0.928997405108,0.229453478009,0.471930214564,0.00880110693442
"SKMEL5_SKIN",0.580385854715,0.87274955808,0.20510320738,0.492618861001,0.00989958277359
"SKMES1_LUNG",0.833603573334,2.30999953093,0.426625400782,0.96590491129,0.0316488888998
"SKMM2_HAEMATOPOIETIC_AND_LYMPHOID_TISSUE",0.74726824499,1.77705053367,0.413901269436,1.2371806669,0.0113374588349
"SKNAS_AUTONOMIC_GANGLIA",0.692537164375,0.931288506863,0.147217899561,0.652942254446,0.013990992898
"SKNBE2_AUTONOMIC_GANGLIA",0.828903812075,0.882769994564,0.146509379148,0.680648115205,0.0311097244458
"SKNDZ_AUTONOMIC_GANGLIA",0.735217805171,0.728206998786,0.135569920142,0.565848953367,0.0259907445367
"SKNEP1_BONE",0.696504437275,2.48350513915,0.305958390236,1.54469024423,0.00701706446966
"SKNFI_AUTONOMIC_GANGLIA",0.524447705284,0.930195070897,0.162052909533,0.683230357827,0.0124318346051
"SKNMC_BONE",0.883733795851,1.24403928548,0.232474317153,1.02809901876,0.0143980257495
"SKNO1_HAEMATOPOIETIC_AND_LYMPHOID_TISSUE",0.976248299904,1.16858212883,0.25132933259,0.827418377034,0.0252890792486
"SKNSH_AUTONOMIC_GANGLIA",0.381988178945,0.893277014422,0.182696590821,0.510358243484,0.0140730694029
"SKOV3_OVARY",1.36115942303,0.862257356972,0.132876038551,0.579317720502,0.0111600023254
"SKRC20_KIDNEY",1.1075081675,1.55102209445,0.323520243168,0.832039345085,0.0127387059621
"SLR20_KIDNEY",0.780595045925,1.97864345743,0.250970214605,1.33946822741,0.0185113782884
"SLR21_KIDNEY",0.884340979128,1.63283894694,0.302176773548,0.659022451168,0.0155579014631
"SLR23_KIDNEY",0.880732621596,1.79813451836,0.326617211103,0.633499550532,0.0194248167825
"SLR24_KIDNEY",0.630466285757,2.82688518555,0.405396193266,1.56834834554,0.0379058639198
"SLR25_KIDNEY",0.868432494093,1.78804761014,0.413394838572,0.846036398447,0.00759077790008
"SLR26_KIDNEY",0.67311246052,2.26403329923,0.408189088106,0.803803181776,0.00905236934515
"SMSCTR_SOFT_TISSUE",0.85075509709,1.9544860441,0.353896647692,1.06850377157,0.0101915970036
"SNB19_CENTRAL_NERVOUS_SYSTEM",0.891580599946,0.648156692117,0.0646055489779,0.534520276385,0.0147336134331
"SNGM_ENDOMETRIUM",2.64346728927,0.219129296374,0.0561264716089,0.211409122095,0.00835465215203
"SNU1076_UPPER_AERODIGESTIVE_TRACT",1.02889391414,1.46554383707,0.152896791697,0.808605772342,0.0190114479596
"SNU1079_BILIARY_TRACT",0.455322630526,0.340587762909,0.0544510136048,0.252251143975,0.0156072657367
"SNU1105_CENTRAL_NERVOUS_SYSTEM",0.639287858191,0.721624405752,0.162070678547,0.407864453989,0.0106066447871
"SNU1_STOMACH",0.425612820338,0.41707632958,0.0720639973879,0.328619915971,0.00929101003839
"SNU216_STOMACH",1.64885905595,0.824082699295,0.143097564578,0.509322196377,0.0035565239857
"SNU349_KIDNEY",0.575580782789,1.03434674927,0.159713868052,0.669607643218,0.0118351146954
"SNU407_LARGE_INTESTINE",0.765838742548,0.4639654479,0.0756534462174,0.402033528421,0.0158792418631
"SNU410_PANCREAS",1.07960275786,0.387543151022,0.0862201601267,0.346064825613,0.0155225006582
"SNU423_LIVER",0.519986574802,0.74505699924,0.0924211243788,0.573508655703,0.0143737726526
"SNU449_LIVER",1.66400221036,0.330879788558,0.0880691980322,0.275059611417,0.0144643478548
"SNU5_STOMACH",0.859032291395,1.45364827462,0.265684455633,0.813039832863,0.00680000946059
"SNU601_STOMACH",1.55225654597,1.48593778175,0.197114363313,1.00697413436,0.0204456556162
"SNU61_LARGE_INTESTINE",1.19755864035,0.396507104729,0.115085504949,0.259847663666,0.00644766419351
"SNU685_ENDOMETRIUM",1.13884092046,0.744200668937,0.178323950619,0.417355168869,0.00898786382182
"SNU719_STOMACH",1.04355162203,0.95480937301,0.176137890667,0.762942675996,0.0141926263024
"SNU738_CENTRAL_NERVOUS_SYSTEM",0.275828250486,0.161472679386,0.0534850334128,0.141321490166,0.0186184325788
"SNU761_LIVER",0.412846995189,0.836728213339,0.340713252624,0.592048685961,0.0253834852354
"SNU81_LARGE_INTESTINE",1.02388460531,0.696564336276,0.185700344543,0.555409931368,0.0146839446487
"SNU840_OVARY",1.51858936287,1.09419826678,0.152858734131,0.656778617173,0.0110430824585
"SNU886_LIVER",0.520685796935,0.819991568535,0.109305135906,0.585536362562,0.0233651268015
"SNU8_OVARY",0.711815854555,2.37980142925,0.37058147788,1.30017606422,0.00915250239662
"SNUC1_LARGE_INTESTINE",1.11671252537,1.54477813901,0.571506857872,0.455943524332,0.00627170467998
"SNUC2A_LARGE_INTESTINE",0.880599182641,0.590234801969,0.115328437649,0.413638321787,0.00728812360321
"SNUC4_LARGE_INTESTINE",2.05283149792,0.391616838014,0.0877269854148,0.371729160949,0.00505043884766
"SQ1_LUNG",1.24008232211,0.685067488096,0.130127228796,0.571603660113,0.0166569966404
"SS1A_SOFT_TISSUE",0.634427564791,0.893097478265,0.164619301756,0.736902137574,0.0155389483497
"SU8686_PANCREAS",1.22173002958,0.854879363388,0.119527829811,0.621975128961,0.0142967564951
"SUDHL10_HAEMATOPOIETIC_AND_LYMPHOID_TISSUE",0.631937987094,2.2855383637,0.621061086655,1.43499726013,0.0309633387783
"SUDHL4_HAEMATOPOIETIC_AND_LYMPHOID_TISSUE",0.646199843776,0.796808471135,0.1865065936,0.653823862897,0.0153725893357
"SUDHL6_HAEMATOPOIETIC_AND_LYMPHOID_TISSUE",0.209524206402,0.342571314893,0.0884489019712,0.313775467538,0.0152436626002
"SUIT2_PANCREAS",1.18089221916,0.7160696577,0.268564825257,0.459366362998,0.0128024109471
"SUM102PT_BREAST",0.546251777323,1.5979381501,1.04005110264,0.589992523137,0.0132104043723
"SUM1315MO2_BREAST",0.449033755013,0.399665082876,0.699869453907,-0.379769439954,0.0066892613254
"SUM149PT_BREAST",1.79202790049,1.0472726849,0.285645842552,0.332162358449,0.00657627744328
"SUM159PT_BREAST",0.930639467715,1.28848363293,0.271906048059,0.373934762207,0.00780388898726
"SUM185PE_BREAST",0.397775516314,0.364440214873,0.604748010635,-0.384971855527,0.00492281414015
"SUM190PT_BREAST",0.923928049181,1.24835606361,0.648794054985,0.384048774968,0.00435865420555
"SUM225CWN_BREAST",1.85448783261,0.725944010571,0.665870904922,0.00726717385194,0.0196700226675
"SUM229PE_BREAST",0.963964962457,1.46540404071,0.478020071983,0.553489800635,0.00657243181814
"SUM44PE_BREAST",0.540962068651,1.06242160443,0.664515316486,0.267738204934,0.0219324985626
"SUM52PE_BREAST",1.55829038468,0.447835723957,0.132833939046,0.286421218646,0.0166452472353
"SUMB002_CENTRAL_NERVOUS_SYSTEM",0.907748398971,1.83818328919,0.382512569427,0.834748363015,0.0225509353801
"SUPT1_HAEMATOPOIETIC_AND_LYMPHOID_TISSUE",1.0876746281,1.83959550242,0.2148129493,1.21035657711,0.00969480864262
"SW1088_CENTRAL_NERVOUS_SYSTEM",0.336590157348,0.485462344699,0.0847639019291,0.405215402764,0.0107489205479
"SW1271_LUNG",1.26515265057,0.281400162383,0.0724872499704,0.20218261265,0.0213595771419
"SW1353_BONE",0.472894372654,1.38881744071,0.368743320306,0.898168563649,0.0169512527894
"SW1417_LARGE_INTESTINE",1.40568345336,0.471632529265,0.157860179432,0.258396003228,0.00641323007977
"SW1463_LARGE_INTESTINE",4.3102465784,0.179506305661,0.123438768089,0.179263405342,0.0161501651237
"SW1573_LUNG",1.51765910731,0.608242790467,0.147204656154,0.426257201532,0.0103596654427
"SW1783_CENTRAL_NERVOUS_SYSTEM",0.860548921554,0.687784402186,0.1880489178,0.387206854656,0.0256956948253
"SW1990_PANCREAS",0.532554203641,0.725341236225,0.117959871888,0.536711678572,0.00797811111978
"SW403_LARGE_INTESTINE",1.62254100154,0.517206687086,0.313350230455,0.35863411272,0.0133295983624
"SW480_LARGE_INTESTINE",0.709293372906,1.00350795157,0.216875396669,0.59323711296,0.0113095662998
"SW48_LARGE_INTESTINE",0.695772641776,1.07484921854,0.131203815341,0.826082287829,0.0189413051463
"SW527_BREAST",1.32960448061,1.30989786927,0.315801084042,0.397791305784,0.0210265312746
"SW579_THYROID",0.448905569926,1.03488702424,0.259585469961,0.834027314495,0.0125504499997
"SW620_LARGE_INTESTINE",0.902192507604,1.0991055485,0.28760387376,0.798517012696,0.0196230724417
"SW780_URINARY_TRACT",0.968904013864,0.689503176383,0.108997508883,0.53055473361,0.0117923182778
"SW837_LARGE_INTESTINE",1.14770058321,1.40202409891,0.315682440996,0.35672930841,0.0152905940134
"SW948_LARGE_INTESTINE",1.71903644061,0.347166251462,0.0547259400288,0.323748452835,0.0196096634014
"SYO1_SOFT_TISSUE",0.708662534635,0.910444367022,0.169726202885,0.754314413656,0.00889286466469
"T24_URINARY_TRACT",0.719499738006,0.965728136592,0.099582662185,0.763985143703,0.0101495467094
"T47D_BREAST",0.837539538269,0.893162743683,0.313267915696,0.532034070568,0.031462855947
"T98G_CENTRAL_NERVOUS_SYSTEM",0.83712097155,1.01551601041,0.175104990602,0.731969991484,0.00691985038035
"TC71_BONE",0.624984208469,1.32801773314,0.298396807164,0.964655782339,0.0157917995195
"TCCPAN2_PANCREAS",0.794904774317,0.643694957718,0.0813560908039,0.520189251741,0.0133508221696
"TCCSUP_URINARY_TRACT",0.660376837312,1.12835296472,0.259355392307,0.698101841134,0.0140757303317
"TE10_OESOPHAGUS",1.11806881826,0.902330919921,0.118498012424,0.738469742068,0.00941035513642
"TE11_OESOPHAGUS",1.25615161809,1.0185320598,0.178721137345,0.689702721231,0.0130498034356
"TE14_OESOPHAGUS",1.42928886099,0.481573957127,0.0522830200692,0.41498140407,0.0127883578911
"TE15_OESOPHAGUS",0.864494613084,1.47616116088,0.19401319325,0.792574997998,0.0161937772922
"TE1_OESOPHAGUS",1.22590467498,0.479926564378,0.0691015552729,0.331079751613,0.00671320920857
"TE4_OESOPHAGUS",0.912221385939,1.66999235419,0.4612116913,1.44150237211,0.0152286387938
"TE6_OESOPHAGUS",1.43728349244,0.794736372775,0.136595154181,0.634961441867,0.00865298164666
"TE8_OESOPHAGUS",0.925641034178,1.8019386466,0.396228522062,0.617617593429,0.0196884211376
"TE9_OESOPHAGUS",0.719808214404,1.29101782438,0.247480969876,0.99672662102,0.0154182530381
"TEN_ENDOMETRIUM",0.870514064931,0.431420794942,0.0877550393343,0.352921040671,0.00413246391791
"THP1_HAEMATOPOIETIC_AND_LYMPHOID_TISSUE",1.16306944492,0.74683572724,0.15362947993,0.611892311628,0.0121464465052
"TM87_SOFT_TISSUE",0.809594078538,1.90526099859,0.450847476721,0.671462643133,0.0401357882017
"TOV112D_OVARY",0.862599495853,1.49075154286,0.252295851707,0.690012045868,0.0125358933912
"TOV21G_OVARY",1.05920821789,2.00605726864,0.244192302227,1.12725094954,0.0172798604498
"TTC549_SOFT_TISSUE",0.751176656801,2.46339214649,0.359860956669,1.20977713284,0.00717698069457
"TTC709_SOFT_TISSUE",0.619974828633,2.36911007754,0.474232584238,1.04232543486,0.00409349001419
"TT_OESOPHAGUS",0.79981180576,1.52042115264,0.170654192567,1.07024783852,0.0115009854997
"TUHR10TKB_KIDNEY",0.873191363047,1.98774178344,0.359955608845,0.597248963628,0.00441669111308
"TUHR14TKB_KIDNEY",0.591704569994,1.85498574532,0.527361214161,0.307154109041,0.00782282282572
"TUHR4TKB_KIDNEY",0.661982920613,1.08838818277,0.300068594515,0.342170387524,0.00766274675021
"TYKNU_OVARY",0.801507050081,0.913740569658,0.177727345377,0.69059048465,0.0153217055685
"U118MG_CENTRAL_NERVOUS_SYSTEM",0.769575784709,0.961389590178,0.173769554123,0.656014890146,0.0102740473723
"U178_CENTRAL_NERVOUS_SYSTEM",0.625122858973,2.73163029914,0.515036761761,1.61910240383,0.0119276590935
"U251MG_CENTRAL_NERVOUS_SYSTEM",0.858959366221,0.807318953668,0.133515417576,0.614480499118,0.0106254219682
"U2OS_BONE",1.1652244025,0.75543519007,0.198170561343,0.549212842046,0.00964336743561
"U343_CENTRAL_NERVOUS_SYSTEM",0.440353125454,1.92543734877,0.481986135244,0.80710199003,0.00626159113736
"U87MG_CENTRAL_NERVOUS_SYSTEM",0.633311755351,1.10372451494,0.214773575465,0.669745968904,0.0127767798633
"U937_HAEMATOPOIETIC_AND_LYMPHOID_TISSUE",0.784710402741,1.73608116122,0.32761451602,1.00767170603,0.00881897813015
"UACC257_SKIN",0.920012249021,1.18717011889,0.270975250751,0.766033920037,0.00938072919227
"UACC62_SKIN",0.834420626478,0.908416595515,0.424819638332,0.411512499247,0.010753548084
"UACC812_BREAST",1.46579905803,1.18661236062,0.203200772405,0.731775410327,0.00744560402271
"UACC893_BREAST",1.42756956376,1.01021643378,0.764123797417,0.210875861926,0.0150768366215
"UBLC1_URINARY_TRACT",1.0234326985,0.861407575423,0.121872238815,0.743553426222,0.0166888218099
"UMUC3_URINARY_TRACT",1.14696481014,1.07564285981,0.174090902011,0.871203999431,0.0178492057853
"UOK101_KIDNEY",0.665015437791,1.35288871421,0.480985969305,0.464352964542,0.00761800252052
"VCAP_PROSTATE",1.45052518006,0.961860477022,0.358471989632,0.544717578584,0.0113002322574
"VMRCRCW_KIDNEY",0.815627984141,0.923134045957,0.0973373552163,0.768341346086,0.0100344414261
"WM115_SKIN",0.716396034553,1.12992489801,0.339695200324,0.693670683295,0.0120428689352
"WM1799_SKIN",0.957041231929,0.859776924083,0.18514761515,0.563925341541,0.0222765212589
"WM2664_SKIN",0.77966113667,1.06724388883,0.19863389805,0.749935163208,0.0282111887188
"WM793_SKIN",0.894691914977,1.33203865685,0.198663696647,1.0183268109,0.016722666548
"WM88_SKIN",0.636374172946,1.15647595524,0.297812228402,0.915020921476,0.0217740596783
"WM983B_SKIN",1.01636124247,1.77175205885,0.298578351736,0.885594622025,0.0244273660743
"WSUDLCL2_HAEMATOPOIETIC_AND_LYMPHOID_TISSUE",0.372170442882,1.12636938887,0.287463913361,0.941051649961,0.0264109839332
"YD38_UPPER_AERODIGESTIVE_TRACT",1.06342011388,1.24884349285,0.301818341017,0.822661329133,0.0191196885584
"YD8_UPPER_AERODIGESTIVE_TRACT",0.661413934611,1.93630990691,0.448528200388,0.0872708318776,0.0199456884394
"YKG1_CENTRAL_NERVOUS_SYSTEM",1.04079606309,1.24665819157,0.167421743274,0.770614638044,0.00743693602638
"YMB1_BREAST",0.742208408905,0.378276060055,0.0780166710416,0.314589943306,0.0260712269277
"ZR751_BREAST",1.06663848787,1.5126494859,0.600303992629,0.69971141462,0.0167237854486
"ZR7530_BREAST",1.99965786888,0.723244901087,0.151657655835,0.509552904296,0.0162740899973
"ZR75B_BREAST",1.03492129093,1.49101883963,0.468842715025,0.586430109439,0.0433241214132
