pin,sale_date,sale_price,valid,comments,document_num
30-19-301-012,2020-09-01,320000,NA,NA,02024507036
28-09-201-090,2020-09-01,5359963,NA,NA,02024507325
08-22-400-025,2020-09-01,650000,NA,NA,02024507602
17-07-100-035,2020-09-01,574900,NA,NA,02024521096
17-09-128-005,2020-09-01,1,NA,NA,02024540072
14-28-311-095,2020-09-01,165000,NA,NA,02024541027
25-18-207-018,2020-09-01,1,NA,NA,02024541091
20-15-120-034,2020-09-01,1,NA,NA,02024541094
19-01-104-002,2020-09-01,170000,NA,NA,02024557096
13-13-107-002,2020-09-02,1,NA,NA,02024607304
14-20-424-025,2020-09-02,1200000,NA,NA,02024639118
26-30-100-048,2020-09-03,470000,NA,NA,02024717009
17-04-323-002,2020-09-03,9587745,NA,NA,02024717030
16-32-120-038,2020-09-03,375000,NA,NA,02024720067
25-05-129-014,2020-09-03,650000,NA,NA,02024762056
17-09-200-013,2020-09-04,168000,NA,NA,02024806204
20-22-301-038,2020-09-04,425000,NA,NA,02024806319
20-25-310-011,2020-09-04,170000,NA,NA,02024806320
20-24-318-022,2020-09-04,390000,NA,NA,02024806325
21-30-107-022,2020-09-04,799000,NA,NA,02024806326
20-25-207-039,2020-09-04,270000,NA,NA,02024806328
20-27-226-032,2020-09-04,348000,NA,NA,02024806331
21-30-318-005,2020-09-04,144000,NA,NA,02024806332
08-27-102-067,2020-09-04,820000,NA,NA,02024807368
17-08-130-001,2020-09-04,1,NA,NA,02024807569
17-04-203-152,2020-09-04,1,NA,NA,02024808005
08-34-204-010,2020-09-04,1100000,NA,NA,02024808033
13-25-410-033,2020-09-04,365000,NA,NA,02024815036
19-10-103-014,2020-09-04,1,NA,NA,02024815107
17-10-309-016,2020-09-04,83000,NA,NA,02024821173
16-36-414-008,2020-09-04,1,NA,NA,02024825012
08-27-400-010,2020-09-04,682500,NA,NA,02024862082
02-09-402-041,2020-09-08,675000,NA,NA,02025207516
20-27-404-004,2020-09-08,50000,NA,NA,02025239077
03-29-340-031,2020-09-08,140000,NA,NA,02025239212
13-14-112-009,2020-09-09,1,NA,NA,02025307014
16-18-303-035,2020-09-09,120000,NA,NA,02025320369
17-21-327-015,2020-09-09,3500000,NA,NA,02025339093
12-26-309-052,2020-09-10,340000,NA,NA,02025407154
14-20-114-033,2020-09-10,3725000,NA,NA,02025407375
29-25-301-049,2020-09-10,175000,NA,NA,02025408087
20-29-321-019,2020-09-10,480000,NA,NA,02025439017
08-34-301-021,2020-09-10,1300000,NA,NA,02025439088
20-10-306-044,2020-09-10,225000,NA,NA,02025439201
12-21-409-014,2020-09-11,1,NA,NA,02025506089
13-30-325-019,2020-09-11,340000,NA,NA,02025515068
13-22-125-011,2020-09-11,1,NA,NA,02025515078
28-22-405-011,2020-09-14,1,NA,NA,02025807178
13-30-316-044,2020-09-14,232500,NA,NA,02025807203
28-30-103-023,2020-09-14,1,NA,NA,02025807618
08-35-200-021,2020-09-14,4366205,NA,NA,02025820145
31-03-200-051,2020-09-14,2992500,NA,NA,02025821006
16-15-120-050,2020-09-14,1,NA,NA,02025839087
13-22-306-012,2020-09-15,271300,NA,NA,02025916039
12-27-300-055,2020-09-15,5475000,NA,NA,02025916114
02-09-315-007,2020-09-15,6500000,NA,NA,02025916118
16-20-102-009,2020-09-15,140000,NA,NA,02025939034
13-32-212-059,2020-09-16,105000,NA,NA,02026007017
07-07-100-035,2020-09-16,154000,NA,NA,02026007153
20-29-414-001,2020-09-16,425000,NA,NA,02026007549
20-27-219-018,2020-09-16,330000,NA,NA,02026021086
13-31-421-037,2020-09-16,2698075,NA,NA,02026021156
14-28-300-047,2020-09-17,230000,NA,NA,02026106082
16-03-403-001,2020-09-17,664000,NA,NA,02026106122
06-19-401-034,2020-09-17,1,NA,NA,02026107095
13-26-110-001,2020-09-17,700000,NA,NA,02026107495
20-26-318-029,2020-09-17,1450000,NA,NA,02026115107
20-19-331-021,2020-09-17,1,NA,NA,02026117123
06-19-401-040,2020-09-17,1,NA,NA,02026120019
06-19-401-046,2020-09-17,1,NA,NA,02026139040
19-20-103-016,2020-09-17,132500,NA,NA,02026162304
13-28-108-016,2020-09-18,110000,NA,NA,02026206031
28-18-100-031,2020-09-18,1,NA,NA,02026206217
14-05-404-018,2020-09-18,5300000,NA,NA,02026208035
12-02-304-010,2020-09-18,1,NA,NA,02026234020
16-23-428-035,2020-09-21,1,NA,NA,02026516047
16-11-133-012,2020-09-21,1,NA,NA,02026528004
19-35-421-043,2020-09-21,950000,NA,NA,02026540044
12-21-420-026,2020-09-21,250000,NA,NA,02026541017
09-15-100-011,2020-09-22,1090000,NA,NA,02026607443
17-32-421-008,2020-09-22,1,NA,NA,02026640030
11-31-114-014,2020-09-22,5475000,NA,NA,02026640050
14-28-117-023,2020-09-22,15015000,NA,NA,02026641058
20-20-106-002,2020-09-23,1,NA,NA,02026716022
13-21-330-025,2020-09-23,175000,NA,NA,02026720324
18-03-103-041,2020-09-23,300000,NA,NA,02026721227
20-35-316-054,2020-09-23,330000,NA,NA,02026728096
20-27-425-038,2020-09-23,1,NA,NA,02026733276
14-19-430-020,2020-09-23,500000,NA,NA,02026739053
21-30-302-013,2020-09-23,1460000,NA,NA,02026741142
13-26-318-001,2020-09-23,2075000,NA,NA,02026741146
13-05-408-020,2020-09-24,1,NA,NA,02026820169
13-14-330-025,2020-09-24,1,NA,NA,02026821131
29-23-202-028,2020-09-24,1050000,NA,NA,02026844006
16-27-405-008,2020-09-25,110000,NA,NA,02026906263
28-18-100-050,2020-09-25,150000,NA,NA,02026907466
23-03-402-008,2020-09-25,3625000,NA,NA,02026908058
12-24-232-029,2020-09-25,245000,NA,NA,02026917089
20-27-402-023,2020-09-25,1,NA,NA,02026925008
15-11-303-011,2020-09-25,28000,NA,NA,02026939146
29-23-109-038,2020-09-28,113500,NA,NA,02027207530
07-11-400-071,2020-09-29,1,NA,NA,02027240014
17-21-300-035,2020-09-29,225000,NA,NA,02027339088
02-02-400-078,2020-09-29,2953846,NA,NA,02027340028
19-13-316-005,2020-09-30,120000,NA,NA,02027406339
06-22-302-019,2020-09-30,2866200,NA,NA,02027407305
08-12-120-028,2020-09-30,1,NA,NA,02027407332
11-32-116-006,2020-09-30,2000000,NA,NA,02027407454
28-31-200-006,2020-09-30,1,NA,NA,02027408165
27-36-202-005,2020-09-30,1,NA,NA,02027408166
24-28-304-013,2020-09-30,1,NA,NA,02027408167
29-31-308-004,2020-09-30,100,NA,NA,02027417257
19-19-217-044,2020-09-30,1,NA,NA,02027420118
13-22-202-003,2020-09-30,1,NA,NA,02027425050
20-35-122-020,2020-09-30,350000,NA,NA,02027434205
14-19-329-035,2020-09-30,505000,NA,NA,02027434284
18-25-201-024,2020-09-30,165000,NA,NA,02027434286
20-32-108-019,2020-09-30,375000,NA,NA,02027444063
11-19-109-003,2020-09-30,1610000,NA,NA,02027444224
13-31-323-025,2020-09-30,600000,NA,NA,02027462090
19-01-427-091,2020-10-01,1,NA,NA,02027507570
16-02-309-009,2020-10-01,1900000,NA,NA,02027515106
12-19-400-146,2020-10-01,391000,NA,NA,02027517126
16-19-103-001,2020-10-01,1,NA,NA,02027520088
28-35-302-043,2020-10-01,500000,NA,NA,02027520111
11-31-225-045,2020-10-01,250000,NA,NA,02027539158
16-04-413-001,2020-10-01,420000,NA,NA,02027541151
17-31-227-051,2020-10-02,80000,NA,NA,02027606294
04-05-301-017,2020-10-02,3238830,NA,NA,02027606401
13-27-302-002,2020-10-02,401800,NA,NA,02027607110
27-20-404-007,2020-10-02,315000,NA,NA,02027607161
20-34-208-041,2020-10-02,105000,NA,NA,02027607411
01-01-201-039,2020-10-02,10100,NA,NA,02027615020
12-22-402-056,2020-10-02,2100,NA,NA,02027615026
03-02-200-096,2020-10-02,88000,NA,NA,02027620275
08-08-302-008,2020-10-02,485000,NA,NA,02027634328
13-20-203-001,2020-10-02,255000,NA,NA,02027634401
13-25-400-019,2020-10-02,2100000,NA,NA,02027641148
20-25-100-014,2020-10-02,1240000,NA,NA,02027641182
13-28-430-035,2020-10-02,165000,NA,NA,02027657082
15-13-102-041,2020-10-05,650000,NA,NA,02027916066
03-28-201-033,2020-10-05,1,NA,NA,02027916073
14-18-134-014,2020-10-05,5585000,NA,NA,02027920308
15-21-102-039,2020-10-06,1000000,NA,NA,02028007444
32-19-212-010,2020-10-06,1,NA,NA,02028039228
21-30-118-001,2020-10-07,2440000,NA,NA,02028040022
19-15-423-038,2020-10-06,45000,NA,NA,02028041044
13-11-205-045,2020-10-06,50000,NA,NA,02028041090
13-16-413-006,2020-10-07,1200000,NA,NA,02028107267
16-09-204-005,2020-10-07,120000,NA,NA,02028107292
27-10-100-116,2020-10-07,190000,NA,NA,02028116053
01-02-202-045,2020-10-07,600000,NA,NA,02028116160
05-19-112-015,2020-10-07,450000,NA,NA,02028139150
17-20-324-026,2020-10-08,1250000,NA,NA,02028217113
12-16-404-031,2020-10-08,359000,NA,NA,02028239211
17-28-220-008,2020-10-08,1,NA,NA,02028240017
13-10-427-037,2020-10-08,150000,NA,NA,02028247066
06-32-201-012,2020-10-08,2000000,NA,NA,02028262007
21-31-408-046,2020-10-08,170000,NA,NA,02028262153
33-19-205-038,2020-10-09,180000,NA,NA,02028307114
17-10-135-039,2020-10-09,1,NA,NA,02028307182
29-22-102-020,2020-10-09,1,NA,NA,02028317116
17-10-303-024,2020-10-09,75289635,NA,NA,02028317135
20-26-309-024,2020-10-09,1,NA,NA,02028317143
20-30-414-021,2020-10-10,855000,NA,NA,02028317158
20-27-215-017,2020-10-10,855000,NA,NA,02028317159
20-25-327-001,2020-10-10,850000,NA,NA,02028317165
17-10-135-039,2020-10-09,1,NA,NA,02028334009
11-30-319-019,2020-10-09,165000,NA,NA,02028339081
09-32-200-040,2020-10-09,350000,NA,NA,02028339254
14-20-100-055,2020-10-10,160000,NA,NA,02028407179
08-27-102-043,2020-10-10,560000,NA,NA,02028417302
17-20-319-001,2020-10-10,320000,NA,NA,02028422211
13-36-207-028,2020-10-10,425000,NA,NA,02028441087
27-16-207-013,2020-10-10,65000,NA,NA,02028444036
25-23-102-009,2020-10-10,1000000,NA,NA,02028444374
12-28-206-034,2020-10-10,25000,NA,NA,02028462387
16-25-200-003,2020-10-11,150000,NA,NA,02028521102
28-19-300-053,2020-10-11,2150000,NA,NA,02028521232
15-10-216-041,2020-10-11,95000,NA,NA,02028541042
14-29-418-036,2020-10-11,1,NA,NA,02028541256
13-27-322-041,2020-10-11,800000,NA,NA,02028544426
15-02-111-095,2020-10-13,450000,NA,NA,02028740020
13-11-412-004,2020-10-13,1,NA,NA,02028741059
13-13-205-038,2020-10-13,1,NA,NA,02028741063
18-05-302-023,2020-10-13,195000,NA,NA,02028757003
12-24-403-001,2020-10-13,180000,NA,NA,02028757082
08-22-205-011,2020-10-14,1,NA,NA,02028816145
13-28-227-031,2020-10-14,1,NA,NA,02028816176
16-26-302-002,2020-10-14,170000,NA,NA,02028820279
16-26-120-037,2020-10-14,275000,NA,NA,02028839223
17-04-446-008,2020-10-14,1100000,NA,NA,02028840007
29-30-227-002,2020-10-14,1,NA,NA,02028844001
29-30-227-003,2020-10-14,1,NA,NA,02028844002
24-29-201-040,2020-10-15,250000,NA,NA,02028907063
13-14-228-037,2020-10-15,330000,NA,NA,02028907102
17-09-210-018,2020-10-15,710000,NA,NA,02028907290
12-34-404-018,2020-10-15,1,NA,NA,02028917114
29-20-416-053,2020-10-15,1,NA,NA,02028921084
20-17-221-001,2020-10-15,34500,NA,NA,02028962059
11-31-211-009,2020-10-16,1,NA,NA,02029006211
17-07-100-035,2020-10-16,510000,NA,NA,02029021181
18-03-223-009,2020-10-16,240000,NA,NA,02029021233
13-05-427-045,2020-10-16,225000,NA,NA,02029039295
03-13-101-011,2020-10-17,610000,NA,NA,02029107172
08-34-302-029,2020-10-17,520000,NA,NA,02029120152
20-10-306-044,2020-10-17,235000,NA,NA,02029120342
14-20-329-051,2020-10-17,180000,NA,NA,02029121147
23-24-109-022,2020-10-17,1,NA,NA,02029122207
24-28-400-075,2020-10-17,325000,NA,NA,02029128072
19-12-331-037,2020-10-17,1,NA,NA,02029135142
23-01-111-011,2020-10-17,800000,NA,NA,02029144108
18-16-400-047,2020-10-17,3985000,NA,NA,02029144118
13-13-200-043,2020-10-17,1,NA,NA,02029144233
13-25-120-030,2020-10-18,1,NA,NA,02029206185
20-16-301-002,2020-10-18,1,NA,NA,02029206379
25-02-103-036,2020-10-18,510000,NA,NA,02029206401
02-28-301-068,2020-10-18,257500,NA,NA,02029207139
11-30-412-006,2020-10-18,1,NA,NA,02029217092
13-14-332-007,2020-10-18,429900,NA,NA,02029244095
16-01-326-059,2020-10-18,165000,NA,NA,02029244161
13-05-431-018,2020-10-18,750000,NA,NA,02029244272
11-31-223-036,2020-10-19,4250000,NA,NA,02029318019
08-25-400-005,2020-10-19,344000,NA,NA,02029318270
17-04-205-066,2020-10-19,223500,NA,NA,02029318326
19-24-125-001,2020-10-19,340000,NA,NA,02029318363
15-10-230-056,2020-10-19,72975,NA,NA,02029339020
14-31-103-005,2020-10-19,260000,NA,NA,02029339057
17-33-202-052,2020-10-19,65000,NA,NA,02029339352
20-35-110-001,2020-10-20,1,NA,NA,02029401020
13-21-210-001,2020-10-20,1,NA,NA,02029410054
10-25-420-030,2020-10-20,675000,NA,NA,02029413019
10-25-426-019,2020-10-20,600000,NA,NA,02029416241
09-15-303-013,2020-10-20,285000,NA,NA,02029447100
20-31-206-034,2020-10-21,150000,NA,NA,02029506535
16-02-411-019,2020-10-21,1,NA,NA,02029507243
24-31-201-097,2020-10-21,265000,NA,NA,02029507710
13-26-123-032,2020-10-21,80000,NA,NA,02029507777
27-20-204-001,2020-10-21,1,NA,NA,02029510139
12-24-232-029,2020-10-21,214000,NA,NA,02029517082
16-02-411-010,2020-10-21,1,NA,NA,02029534055
13-02-433-014,2020-10-21,550000,NA,NA,02029535042
13-22-321-010,2020-10-21,540338,NA,NA,02029539265
03-32-108-005,2020-10-21,1050000,NA,NA,02029562039
10-28-200-049,2020-10-21,331000,NA,NA,02029562142
03-23-401-006,2020-10-22,650000,NA,NA,02029601017
26-06-403-016,2020-10-22,310000,NA,NA,02029601131
13-13-316-032,2020-10-22,1,NA,NA,02029606210
20-03-201-027,2020-10-22,2350000,NA,NA,02029607081
28-03-100-076,2020-10-22,1,NA,NA,02029608008
32-19-220-052,2020-10-22,400000,NA,NA,02029610094
14-07-209-024,2020-10-22,2300000,NA,NA,02029613233
17-34-102-031,2020-10-22,4150000,NA,NA,02029617024
13-29-400-010,2020-10-22,760000,NA,NA,02029634067
09-21-313-014,2020-10-22,75000,NA,NA,02029634160
13-08-412-029,2020-10-22,1,NA,NA,02029657016
24-12-408-030,2020-10-22,153000,NA,NA,02029662021
19-24-103-035,2020-10-22,700000,NA,NA,02029662067
32-21-419-001,2020-10-22,1,NA,NA,02029662105
11-19-405-001,2020-10-23,2650000,NA,NA,02029706242
16-23-110-001,2020-10-23,325000,NA,NA,02029707681
20-32-407-001,2020-10-23,1305000,NA,NA,02029717059
17-17-203-025,2020-10-23,1,NA,NA,02029717073
15-10-300-027,2020-10-23,1,NA,NA,02029721216
19-31-300-025,2020-10-23,450000,NA,NA,02029735000
16-19-307-038,2020-10-23,1,NA,NA,02029739118
08-31-400-063,2020-10-24,140000,NA,NA,02029803316
13-27-215-033,2020-10-24,140000,NA,NA,02029810062
29-31-409-075,2020-10-24,1,NA,NA,02029812321
03-26-201-020,2020-10-24,140000,NA,NA,02029817163
19-32-311-027,2020-10-24,126000,NA,NA,02029838331
08-16-200-091,2020-10-24,975000,NA,NA,02029846092
16-21-415-045,2020-10-24,1,NA,NA,02029846285
10-27-204-053,2020-10-24,1600000,NA,NA,02029862004
13-22-434-007,2020-10-24,90000,NA,NA,02029862340
15-04-404-038,2020-10-25,350000,NA,NA,02029903013
15-21-200-069,2020-10-25,475000,NA,NA,02029903289
23-12-211-010,2020-10-25,1750000,NA,NA,02029904011
17-27-110-020,2020-10-25,1,NA,NA,02029904028
20-11-412-049,2020-10-25,625000,NA,NA,02029906097
20-28-210-016,2020-10-25,585000,NA,NA,02029910059
17-31-431-047,2020-10-25,210000,NA,NA,02029925080
21-31-106-024,2020-10-25,351000,NA,NA,02029935219
16-20-106-009,2020-10-25,275000,NA,NA,02029946450
07-11-302-014,2020-10-25,2275000,NA,NA,02029955104
15-05-225-036,2020-10-26,350000,NA,NA,02030007319
11-30-213-014,2020-10-26,1,NA,NA,02030007788
10-27-431-052,2020-10-26,1400000,NA,NA,02030007817
13-10-314-057,2020-10-26,1,NA,NA,02030013116
29-28-100-059,2020-10-26,1,NA,NA,02030016063
07-33-201-105,2020-10-26,525000,NA,NA,02030039239
16-05-408-001,2020-10-26,830000,NA,NA,02030044081
12-22-100-152,2020-10-27,235000,NA,NA,02030107300
27-09-220-056,2020-10-27,6854838,NA,NA,02030113163
28-36-304-074,2020-10-27,192500,NA,NA,02030120299
08-34-402-046,2020-10-27,4045000,NA,NA,02030121132
03-08-100-057,2020-10-27,1,NA,NA,02030139473
25-04-412-021,2020-10-27,1,NA,NA,02030140185
20-18-430-036,2020-10-27,40000,NA,NA,02030140187
29-22-215-001,2020-10-28,2661000,NA,NA,02030216125
07-12-302-010,2020-10-28,650000,NA,NA,02030216133
13-35-225-009,2020-10-28,1,NA,NA,02030220036
10-24-121-001,2020-10-28,435000,NA,NA,02030234047
14-31-331-034,2020-10-28,155000,NA,NA,02030234052
20-25-310-008,2020-10-28,2250000,NA,NA,02030234059
20-25-310-009,2020-10-28,2200000,NA,NA,02030234060
20-29-428-015,2020-10-28,1850000,NA,NA,02030234062
21-31-106-017,2020-10-28,1425000,NA,NA,02030234063
20-31-214-036,2020-10-28,1575000,NA,NA,02030234064
21-30-414-040,2020-10-28,1060000,NA,NA,02030239462
13-14-122-034,2020-10-28,1,NA,NA,02030244022
12-17-401-077,2020-10-28,3000000,NA,NA,02030244027
12-29-421-004,2020-10-28,1,NA,NA,02030247013
28-12-443-004,2020-10-29,500000,NA,NA,02030307092
17-05-115-010,2020-10-29,825000,NA,NA,02030317021
14-05-327-037,2020-10-29,2350000,NA,NA,02030317027
13-13-323-001,2020-10-29,2825000,NA,NA,02030317131
28-16-302-008,2020-10-29,400000,NA,NA,02030334056
05-33-110-024,2020-10-29,1853000,NA,NA,02030334062
13-32-413-029,2020-10-30,250000,NA,NA,02030406129
08-11-203-026,2020-10-30,215000,NA,NA,02030406297
16-19-116-006,2020-10-30,140000,NA,NA,02030407184
20-15-409-015,2020-10-30,1800000,NA,NA,02030407226
20-17-117-001,2020-10-30,358000,NA,NA,02030420170
19-24-131-031,2020-10-30,90000,NA,NA,02030425045
15-11-125-005,2020-10-31,175000,NA,NA,02030504042
16-01-207-051,2020-10-31,120000,NA,NA,02030504051
17-10-135-039,2020-10-31,129000,NA,NA,02030510003
02-02-410-024,2020-10-31,950000,NA,NA,02030517092
20-27-320-035,2020-10-31,125000,NA,NA,02030517218
07-13-300-026,2020-10-31,1,NA,NA,02030522029
16-22-309-035,2020-10-31,1,NA,NA,02030522039
13-32-315-026,2020-10-31,1,NA,NA,02030522049
19-11-204-009,2020-10-31,1,NA,NA,02030522072
13-01-304-030,2020-10-31,1,NA,NA,02030522074
14-30-115-001,2020-10-31,1,NA,NA,02030522112
19-09-322-057,2020-10-31,615000,NA,NA,02030546227
