<?xml version="1.0" encoding="utf-8"?>
<!-- Generator: Adobe Illustrator 23.0.1, SVG Export Plug-In . SVG Version: 6.00 Build 0)  -->
<svg version="1.1" id="Layer_1" xmlns="http://www.w3.org/2000/svg" xmlns:xlink="http://www.w3.org/1999/xlink" x="0px" y="0px"
	 viewBox="0 0 512 512" style="enable-background:new 0 0 512 512;" xml:space="preserve">
<style type="text/css">
	.st0{fill:#FFFFFF;}
</style>
<path class="st0" d="M140,131.7h106.1v42.4H140V131.7z"/>
<path class="st0" d="M87,355.2h212.1V78H87V355.2z M267.3,322.6h-63.6v-21.2h63.6V322.6z M267.3,280.2h-63.6V259h63.6V280.2z
	 M267.3,237.8h-63.6v-21.2h63.6V237.8z M118.8,110.5h148.5v84.8H118.8V110.5z M118.8,216.6h63.6v21.2h-63.6V216.6z M118.8,259h63.6
	v21.2h-63.6V259z M118.8,301.4h63.6v21.2h-63.6V301.4z"/>
<path class="st0" d="M214.3,376.4v52.2l65.2-52.2H214.3z"/>
<path class="st0" d="M299.1,387.8L233.9,440h65.2V387.8z"/>
<path class="st0" d="M320.3,163.6h106.1V440H320.3V163.6z"/>
</svg>
