<svg width="50" height="50" viewBox="0 0 50 50" fill="none" xmlns="http://www.w3.org/2000/svg">
<path d="M49.9998 4.54528C49.9998 2.03853 47.9613 0 45.4544 0C44.2404 0 43.0996 0.472692 42.2406 1.33157L13.8613 29.7085C13.3345 29.6023 12.7901 29.5442 12.2324 29.5442C7.77791 29.5442 4.54534 32.8899 4.54534 37.4983C4.54534 42.4065 0.272901 48.119 0.229648 48.1757C-0.0266731 48.5152 -0.0721632 48.9692 0.112034 49.352C0.295166 49.7359 0.676878 49.9844 1.10195 49.9978C1.12081 49.9978 1.19847 50 1.33281 50C2.15184 50 5.06928 49.9234 9.43824 48.9647C15.5127 47.632 20.4544 42.6018 20.4544 37.7525C20.4544 37.1986 20.396 36.6585 20.2908 36.1351L48.6682 7.75888C49.5271 6.90001 49.9998 5.75924 49.9998 4.54528ZM8.95202 46.7454C6.59272 47.2625 4.6751 47.5088 3.33458 47.6243C4.75064 45.3238 6.81804 41.3124 6.81804 37.4983C6.81804 34.1526 9.04417 31.8167 12.2324 31.8167C15.5128 31.8167 18.1817 34.48 18.1817 37.7524C18.1816 41.5287 13.9546 45.6479 8.95202 46.7454ZM19.3998 33.8122C18.6495 32.4583 17.5396 31.3495 16.184 30.5996L22.589 24.1951L25.8033 27.4091L19.3998 33.8122ZM47.0613 6.15203L27.4102 25.8023L24.196 22.5882L43.8475 2.93843C44.2769 2.50899 44.8473 2.27259 45.4543 2.27259C46.7072 2.27259 47.727 3.29244 47.727 4.54517C47.7271 5.15221 47.4907 5.72259 47.0613 6.15203Z" fill="#21D695"/>
</svg>
