<svg width="25" height="20" viewBox="0 0 25 20" fill="none" xmlns="http://www.w3.org/2000/svg">
<path d="M22.5 0H2.5C1.11875 0 0.0125 1.11875 0.0125 2.5L0 17.5C0 18.8813 1.11875 20 2.5 20H22.5C23.8813 20 25 18.8813 25 17.5V2.5C25 1.11875 23.8813 0 22.5 0ZM22.5 17.5H2.5V5L12.5 11.25L22.5 5V17.5ZM12.5 8.75L2.5 2.5H22.5L12.5 8.75Z" fill="#BDBDBD"/>
</svg>
