<svg width="100" height="100" viewBox="0 0 100 100" fill="none" xmlns="http://www.w3.org/2000/svg">
<g clip-path="url(#clip0)">
<path d="M51.3055 54.5757C51.1205 54.5357 50.9307 54.5285 50.7433 54.5565C48.8651 54.3379 47.4483 52.7488 47.4451 50.8586C47.4451 49.9528 46.7106 49.2184 45.8048 49.2184C44.8989 49.2184 44.1645 49.9528 44.1645 50.8586C44.1693 54.0151 46.2805 56.7799 49.324 57.6152V59.2555C49.324 60.1614 50.0585 60.8958 50.9643 60.8958C51.8701 60.8958 52.6046 60.1614 52.6046 59.2555V57.7145C56.1174 56.9793 58.505 53.7075 58.1358 50.1378C57.7657 46.5681 54.7583 43.8554 51.1693 43.8546C49.1126 43.8546 47.4451 42.1871 47.4451 40.1303C47.4451 38.0735 49.1126 36.406 51.1693 36.406C53.2261 36.406 54.8936 38.0735 54.8936 40.1303C54.8936 41.0361 55.6281 41.7706 56.5339 41.7706C57.4398 41.7706 58.1742 41.0361 58.1742 40.1303C58.1694 36.8161 55.8475 33.9576 52.6046 33.2736V31.7807C52.6046 30.8748 51.8701 30.1404 50.9643 30.1404C50.0585 30.1404 49.324 30.8748 49.324 31.7807V33.3737C45.9393 34.298 43.7608 37.5842 44.2269 41.0618C44.6931 44.5394 47.6605 47.1352 51.1693 47.1344C53.1989 47.1344 54.8544 48.7594 54.8912 50.7882C54.9289 52.8169 53.3334 54.502 51.3055 54.5757Z" fill="#21D695"/>
<path d="M27.3835 45.6207C27.3835 58.7575 38.0326 69.4065 51.1693 69.4065C64.306 69.4065 74.9551 58.7575 74.9551 45.6207C74.9551 32.484 64.306 21.835 51.1693 21.835C38.039 21.8494 27.3988 32.4904 27.3835 45.6207ZM51.1693 25.1155C62.4944 25.1155 71.6745 34.2957 71.6745 45.6207C71.6745 56.9458 62.4944 66.1259 51.1693 66.1259C39.8443 66.1259 30.6641 56.9458 30.6641 45.6207C30.6769 34.3013 39.8499 25.1284 51.1693 25.1155Z" fill="#21D695"/>
<path d="M83.0411 73.4504L70.1919 79.5214C68.4179 76.2216 65.0148 74.1216 61.2697 74.0158L49.408 73.6899C47.5298 73.6362 45.6869 73.1605 44.017 72.2979L42.81 71.6723C36.6301 68.451 29.264 68.459 23.0905 71.6932L23.1658 68.9588C23.1906 68.053 22.477 67.2985 21.5712 67.2737L8.56418 66.9157C7.65834 66.8908 6.90467 67.6045 6.87984 68.5103L6.09413 97.0536C6.06931 97.9594 6.78293 98.7139 7.68877 98.7387L20.6957 99.0967H20.7406C21.6296 99.0967 22.3569 98.3895 22.3809 97.5013L22.4185 96.1357L25.7976 94.3264C27.1239 93.6128 28.6745 93.443 30.1234 93.8531L50.3018 99.5164C50.3371 99.5268 50.3723 99.5348 50.4084 99.5428C51.8668 99.848 53.3533 100.001 54.8431 100C57.9987 100.002 61.1175 99.3218 63.9856 98.0051C64.0561 97.973 64.1241 97.9354 64.189 97.8929L93.4459 78.9687C94.1747 78.497 94.4102 77.5399 93.9833 76.7838C91.8112 72.9298 86.9937 71.4617 83.0411 73.4504ZM9.41876 95.5046L10.114 70.2403L19.8412 70.5078L19.146 95.7729L9.41876 95.5046ZM62.5079 95.0753C58.9446 96.6835 54.9648 97.1273 51.1348 96.3447L31.0108 90.6958C28.7458 90.0559 26.3214 90.321 24.2494 91.4351L22.5226 92.3602L22.9848 75.5624C28.4567 71.923 35.4744 71.549 41.3019 74.5853L42.5089 75.2108C44.6185 76.3001 46.9452 76.9008 49.3183 76.9696L61.1808 77.2956C64.5126 77.3917 67.3422 79.7641 68.0182 83.0286L50.3491 82.5409C49.4432 82.516 48.6896 83.2305 48.6639 84.1355C48.6391 85.0413 49.3535 85.7958 50.2586 85.8206L69.7578 86.3573H69.8035C70.6917 86.3564 71.4181 85.6492 71.4422 84.7618C71.4622 84.049 71.4093 83.3354 71.2836 82.6338L84.4628 76.4066C84.4756 76.401 84.4884 76.3946 84.5012 76.3882C86.3706 75.4423 88.6308 75.7586 90.1685 77.1819L62.5079 95.0753Z" fill="#21D695"/>
<path d="M52.8096 17.223V1.64029C52.8096 0.734446 52.0752 0 51.1693 0C50.2635 0 49.5291 0.734446 49.5291 1.64029V17.223C49.5291 18.1289 50.2635 18.8633 51.1693 18.8633C52.0752 18.8633 52.8096 18.1289 52.8096 17.223Z" fill="#21D695"/>
<path d="M65.1119 17.223V9.84171C65.1119 8.93586 64.3774 8.20142 63.4716 8.20142C62.5657 8.20142 61.8313 8.93586 61.8313 9.84171V17.223C61.8313 18.1288 62.5657 18.8633 63.4716 18.8633C64.3774 18.8633 65.1119 18.1288 65.1119 17.223Z" fill="#21D695"/>
<path d="M40.5076 17.223V9.84171C40.5076 8.93586 39.7732 8.20142 38.8673 8.20142C37.9615 8.20142 37.2271 8.93586 37.2271 9.84171V17.223C37.2271 18.1288 37.9615 18.8633 38.8673 18.8633C39.7732 18.8633 40.5076 18.1288 40.5076 17.223Z" fill="#21D695"/>
</g>
<defs>
<clipPath id="clip0">
<rect width="100" height="100" fill="white"/>
</clipPath>
</defs>
</svg>
