<?xml version="1.0" encoding="utf-8"?>
<!-- Generator: Adobe Illustrator 23.0.1, SVG Export Plug-In . SVG Version: 6.00 Build 0)  -->
<svg version="1.1" id="Layer_1" xmlns="http://www.w3.org/2000/svg" xmlns:xlink="http://www.w3.org/1999/xlink" x="0px" y="0px"
	 viewBox="0 0 20 20" style="enable-background:new 0 0 20 20;" xml:space="preserve">
<style type="text/css">
	.st0{fill-rule:evenodd;clip-rule:evenodd;fill:#FFFFFF;}
</style>
<path class="st0" d="M8.1,16.2C3.6,16.2,0,12.6,0,8.1C0,3.6,3.6,0,8.1,0c4.5,0,8.1,3.6,8.1,8.1c0,1.9-0.6,3.6-1.7,5l5.5,5.5L18.6,20
	l-5.5-5.5C11.7,15.6,10,16.2,8.1,16.2z M14.2,8.1c0,3.4-2.7,6.1-6.1,6.1C4.8,14.2,2,11.5,2,8.1C2,4.8,4.8,2,8.1,2
	C11.5,2,14.2,4.8,14.2,8.1z"/>
</svg>
