<svg width="22" height="22" viewBox="0 0 22 22" fill="none" xmlns="http://www.w3.org/2000/svg">
<g clip-path="url(#clip0)">
<path d="M14.5189 15.4181L15.525 13.7857L17.3405 13.1665L17.5416 11.2597L18.9076 9.91495L18.2581 8.11001L18.9076 6.30502L17.5417 4.96031L17.3405 3.05353L15.525 2.43435L14.519 0.80184L12.6161 1.03159L10.9997 0L9.38324 1.03168L7.48041 0.801926L6.47438 2.43439L4.65887 3.05357L4.45773 4.96036L3.0918 6.30506L3.74123 8.11005L3.0918 9.91504L4.45769 11.2597L4.65882 13.1665L6.47434 13.7857L7.48037 15.4182L9.38324 15.1885L10.9997 16.2201L12.6161 15.1885L14.5189 15.4181ZM5.43828 8.11005C5.43828 5.0435 7.93313 2.54865 10.9997 2.54865C14.0662 2.54865 16.5611 5.0435 16.5611 8.11005C16.5611 11.1766 14.0662 13.6715 10.9997 13.6715C7.93313 13.6715 5.43828 11.1766 5.43828 8.11005Z" fill="#214C59"/>
<path d="M11 3.83838C8.64471 3.83838 6.72852 5.75457 6.72852 8.1099C6.72852 10.4652 8.64471 12.3814 11 12.3814C13.3554 12.3814 15.2716 10.4652 15.2716 8.1099C15.2716 5.75457 13.3554 3.83838 11 3.83838Z" fill="#214C59"/>
<path d="M9.07976 16.5244L6.81617 16.7977L5.62022 14.8569L5.21365 14.7183L3.45996 20.1996L6.61709 20.026L9.08715 22L10.5407 17.4568L9.07976 16.5244Z" fill="#214C59"/>
<path d="M16.3804 14.8569L15.1844 16.7977L12.9209 16.5244L11.46 17.4568L12.9135 22L15.3836 20.026L18.5407 20.1996L16.787 14.7183L16.3804 14.8569Z" fill="#214C59"/>
<path d="M10.2069 9.18213L9.11109 8.05798L8.73926 8.43943L10.2069 9.94504L13.3603 6.71007L12.9884 6.32861L10.2069 9.18213Z" fill="#21D695"/>
</g>
<defs>
<clipPath id="clip0">
<rect width="22" height="22" fill="white"/>
</clipPath>
</defs>
</svg>
