<svg width="11" height="15" viewBox="0 0 11 15" fill="none" xmlns="http://www.w3.org/2000/svg">
<path d="M5.25 0C2.35125 0 0 2.35125 0 5.25C0 9.1875 5.25 15 5.25 15C5.25 15 10.5 9.1875 10.5 5.25C10.5 2.35125 8.14875 0 5.25 0ZM5.25 7.125C4.215 7.125 3.375 6.285 3.375 5.25C3.375 4.215 4.215 3.375 5.25 3.375C6.285 3.375 7.125 4.215 7.125 5.25C7.125 6.285 6.285 7.125 5.25 7.125Z" fill="#21D695"/>
</svg>
