<svg width="9" height="5" viewBox="0 0 9 5" fill="none" xmlns="http://www.w3.org/2000/svg">
<path fill-rule="evenodd" clip-rule="evenodd" d="M7.90411 0L8.60274 0.698631L4.30137 5L0 0.698631L0.698631 0L4.30137 3.60274L7.90411 0Z" fill="#333333"/>
</svg>
