<svg width="21" height="20" viewBox="0 0 21 20" fill="none" xmlns="http://www.w3.org/2000/svg">
<path d="M5.69744 1.62051L4.23077 0.153846C1.77436 2.02564 0.153846 4.91795 0 8.20513H2.05128C2.21026 5.48718 3.61026 3.10769 5.69744 1.62051ZM18.4103 8.20513H20.4615C20.3077 4.91795 18.6872 2.02564 16.2308 0.153846L14.7692 1.61538C16.8513 3.10769 18.2513 5.48718 18.4103 8.20513ZM16.3846 8.71795C16.3846 5.5641 14.7077 2.93333 11.7692 2.2359V1.53846C11.7692 0.68718 11.0821 0 10.2308 0C9.37949 0 8.69231 0.68718 8.69231 1.53846V2.2359C5.75385 2.93333 4.07692 5.5641 4.07692 8.71795V13.8462L2.02564 15.8974V16.9231H18.4359V15.8974L16.3846 13.8462V8.71795ZM10.2308 20C10.3744 20 10.5128 19.9846 10.6462 19.959C11.3128 19.8205 11.8615 19.359 12.1231 18.7487C12.2256 18.5026 12.2821 18.2359 12.2821 17.9487H8.17949C8.17949 19.0821 9.09744 20 10.2308 20Z" fill="#214C59"/>
</svg>
