<?xml version="1.0" encoding="utf-8"?>
<!-- Generator: Adobe Illustrator 23.0.1, SVG Export Plug-In . SVG Version: 6.00 Build 0)  -->
<svg version="1.1" id="Layer_1" xmlns="http://www.w3.org/2000/svg" xmlns:xlink="http://www.w3.org/1999/xlink" x="0px" y="0px"
	 viewBox="0 0 20 20" style="enable-background:new 0 0 20 20;" xml:space="preserve">
<style type="text/css">
	.st0{fill-rule:evenodd;clip-rule:evenodd;fill:#21D695;}
</style>
<path class="st0" d="M6,7c0-3.9,3.1-7,7-7c3.9,0,7,3.1,7,7c0,3.9-3.1,7-7,7h-2v2H9v2H7v2H0v-5.4l6.1-6.1C6,8,6,7.5,6,7z M9,14v-2h4
	c2.8,0,5-2.2,5-5s-2.2-5-5-5S8,4.2,8,7c0,0.5,0.1,1,0.2,1.5L8.4,9L2,15.4V18h3v-2h2v-2H9z M11,7c0,1.1,0.9,2,2,2s2-0.9,2-2
	s-0.9-2-2-2S11,5.9,11,7z"/>
</svg>
