<svg width="37" height="25" viewBox="0 0 37 25" fill="none" xmlns="http://www.w3.org/2000/svg">
<path d="M34.8182 2.40909C33.8318 0.654545 32.7614 0.331818 30.5818 0.209091C28.4045 0.0613637 22.9295 0 18.1864 0C13.4341 0 7.95682 0.0613638 5.78182 0.206818C3.60682 0.331818 2.53409 0.652273 1.53864 2.40909C0.522727 4.16136 0 7.17955 0 12.4932C0 12.4977 0 12.5 0 12.5C0 12.5045 0 12.5068 0 12.5068V12.5114C0 17.8023 0.522727 20.8432 1.53864 22.5773C2.53409 24.3318 3.60455 24.65 5.77955 24.7977C7.95682 24.925 13.4341 25 18.1864 25C22.9295 25 28.4045 24.925 30.5841 24.8C32.7636 24.6523 33.8341 24.3341 34.8205 22.5795C35.8455 20.8455 36.3636 17.8045 36.3636 12.5136C36.3636 12.5136 36.3636 12.5068 36.3636 12.5023C36.3636 12.5023 36.3636 12.4977 36.3636 12.4955C36.3636 7.17955 35.8455 4.16136 34.8182 2.40909Z" fill="#21D695"/>
<path d="M13.6364 19.318V5.68164L25 12.4998L13.6364 19.318Z" fill="#FAFAFA"/>
</svg>
