{
  "project_info": {
    "project_number": "1061209663319",
    "firebase_url": "https://ab-thai-aec0d.firebaseio.com",
    "project_id": "ab-thai-aec0d",
    "storage_bucket": "ab-thai-aec0d.appspot.com"
  },
  "client": [
    {
      "client_info": {
        "mobilesdk_app_id": "1:1061209663319:android:cf5fc8b6231696cafe0012",
        "android_client_info": {
          "package_name": "app.abthai.store"
        }
      },
      "oauth_client": [
        {
          "client_id": "1061209663319-a19v4irmjokpgvu3sf0aisdg28lrcn9v.apps.googleusercontent.com",
          "client_type": 1,
          "android_info": {
            "package_name": "app.abthai.store",
            "certificate_hash": "fd546e4c02ba8dfb3c541446b9a5b3a933d90567"
          }
        },
        {
          "client_id": "1061209663319-tti9ht7esdq3eosek0bntbfq2q7j465p.apps.googleusercontent.com",
          "client_type": 3
        }
      ],
      "api_key": [
        {
          "current_key": "AIzaSyDubf2t10_Ptz5VZyfsFnhZE32936wiWBY"
        }
      ],
      "services": {
        "appinvite_service": {
          "other_platform_oauth_client": [
            {
              "client_id": "1061209663319-tti9ht7esdq3eosek0bntbfq2q7j465p.apps.googleusercontent.com",
              "client_type": 3
            }
          ]
        }
      }
    }
  ],
  "configuration_version": "1"
}