<svg version="1" xmlns="http://www.w3.org/2000/svg" viewBox="0 0 48 48" enable-background="new 0 0 48 48">
    <polygon fill="#f12c2d" points="41,41 23,41 41,23"/>
    <rect x="17.4" y="5" transform="matrix(.707 -.707 .707 .707 -8.854 21.374)" fill="#f12c2d" width="8" height="32.7"/>
</svg>
