// Jest Snapshot v1, https://goo.gl/fbAQLP

exports[`Locations container should render 1`] = `
ShallowWrapper {
  "length": 1,
  Symbol(enzyme.__root__): [Circular],
  Symbol(enzyme.__unrendered__): <Locations
    history={
        Object {
            "push": [Function],
          }
    }
/>,
  Symbol(enzyme.__renderer__): Object {
    "batchedUpdates": [Function],
    "getNode": [Function],
    "render": [Function],
    "simulateEvent": [Function],
    "unmount": [Function],
  },
  Symbol(enzyme.__node__): Object {
    "instance": null,
    "key": undefined,
    "nodeType": "host",
    "props": Object {
      "children": Array [
        <nav
          uk-navbar={true}
>
          <div
                    className="uk-navbar-right"
          >
                    <ul
                              className="uk-navbar-nav"
                    >
                              <li
                                        className="uk-active"
                              >
                                        <button
                                                  className="uk-button uk-button-default"
                                                  uk-toggle="target: #cart-off-canvas"
                                        >
                                                  <span
                                                            uk-icon="icon: cart"
                                                  />
                                        </button>
                              </li>
                              <li
                                        className="uk-active"
                              >
                                        <button
                                                  className="uk-button uk-button-default"
                                                  id="router-btn"
                                                  onClick={[Function]}
                                        >
                                                  HOME  
                                        </button>
                              </li>
                    </ul>
          </div>
</nav>,
        <Connect(Locations) />,
        <Connect(Cart) />,
      ],
      "className": "uk-container uk-padding",
    },
    "ref": null,
    "rendered": Array [
      Object {
        "instance": null,
        "key": undefined,
        "nodeType": "host",
        "props": Object {
          "children": <div
            className="uk-navbar-right"
>
            <ul
                        className="uk-navbar-nav"
            >
                        <li
                                    className="uk-active"
                        >
                                    <button
                                                className="uk-button uk-button-default"
                                                uk-toggle="target: #cart-off-canvas"
                                    >
                                                <span
                                                            uk-icon="icon: cart"
                                                />
                                    </button>
                        </li>
                        <li
                                    className="uk-active"
                        >
                                    <button
                                                className="uk-button uk-button-default"
                                                id="router-btn"
                                                onClick={[Function]}
                                    >
                                                HOME  
                                    </button>
                        </li>
            </ul>
</div>,
          "uk-navbar": true,
        },
        "ref": null,
        "rendered": Object {
          "instance": null,
          "key": undefined,
          "nodeType": "host",
          "props": Object {
            "children": <ul
              className="uk-navbar-nav"
>
              <li
                            className="uk-active"
              >
                            <button
                                          className="uk-button uk-button-default"
                                          uk-toggle="target: #cart-off-canvas"
                            >
                                          <span
                                                        uk-icon="icon: cart"
                                          />
                            </button>
              </li>
              <li
                            className="uk-active"
              >
                            <button
                                          className="uk-button uk-button-default"
                                          id="router-btn"
                                          onClick={[Function]}
                            >
                                          HOME  
                            </button>
              </li>
</ul>,
            "className": "uk-navbar-right",
          },
          "ref": null,
          "rendered": Object {
            "instance": null,
            "key": undefined,
            "nodeType": "host",
            "props": Object {
              "children": Array [
                <li
                  className="uk-active"
>
                  <button
                                    className="uk-button uk-button-default"
                                    uk-toggle="target: #cart-off-canvas"
                  >
                                    <span
                                                      uk-icon="icon: cart"
                                    />
                  </button>
</li>,
                <li
                  className="uk-active"
>
                  <button
                                    className="uk-button uk-button-default"
                                    id="router-btn"
                                    onClick={[Function]}
                  >
                                    HOME  
                  </button>
</li>,
              ],
              "className": "uk-navbar-nav",
            },
            "ref": null,
            "rendered": Array [
              Object {
                "instance": null,
                "key": undefined,
                "nodeType": "host",
                "props": Object {
                  "children": <button
                    className="uk-button uk-button-default"
                    uk-toggle="target: #cart-off-canvas"
>
                    <span
                                        uk-icon="icon: cart"
                    />
</button>,
                  "className": "uk-active",
                },
                "ref": null,
                "rendered": Object {
                  "instance": null,
                  "key": undefined,
                  "nodeType": "host",
                  "props": Object {
                    "children": <span
                      uk-icon="icon: cart"
/>,
                    "className": "uk-button uk-button-default",
                    "uk-toggle": "target: #cart-off-canvas",
                  },
                  "ref": null,
                  "rendered": Object {
                    "instance": null,
                    "key": undefined,
                    "nodeType": "host",
                    "props": Object {
                      "uk-icon": "icon: cart",
                    },
                    "ref": null,
                    "rendered": null,
                    "type": "span",
                  },
                  "type": "button",
                },
                "type": "li",
              },
              Object {
                "instance": null,
                "key": undefined,
                "nodeType": "host",
                "props": Object {
                  "children": <button
                    className="uk-button uk-button-default"
                    id="router-btn"
                    onClick={[Function]}
>
                    HOME  
</button>,
                  "className": "uk-active",
                },
                "ref": null,
                "rendered": Object {
                  "instance": null,
                  "key": undefined,
                  "nodeType": "host",
                  "props": Object {
                    "children": "HOME  ",
                    "className": "uk-button uk-button-default",
                    "id": "router-btn",
                    "onClick": [Function],
                  },
                  "ref": null,
                  "rendered": "HOME  ",
                  "type": "button",
                },
                "type": "li",
              },
            ],
            "type": "ul",
          },
          "type": "div",
        },
        "type": "nav",
      },
      Object {
        "instance": null,
        "key": undefined,
        "nodeType": "class",
        "props": Object {},
        "ref": null,
        "rendered": null,
        "type": [Function],
      },
      Object {
        "instance": null,
        "key": undefined,
        "nodeType": "class",
        "props": Object {},
        "ref": null,
        "rendered": null,
        "type": [Function],
      },
    ],
    "type": "div",
  },
  Symbol(enzyme.__nodes__): Array [
    Object {
      "instance": null,
      "key": undefined,
      "nodeType": "host",
      "props": Object {
        "children": Array [
          <nav
            uk-navbar={true}
>
            <div
                        className="uk-navbar-right"
            >
                        <ul
                                    className="uk-navbar-nav"
                        >
                                    <li
                                                className="uk-active"
                                    >
                                                <button
                                                            className="uk-button uk-button-default"
                                                            uk-toggle="target: #cart-off-canvas"
                                                >
                                                            <span
                                                                        uk-icon="icon: cart"
                                                            />
                                                </button>
                                    </li>
                                    <li
                                                className="uk-active"
                                    >
                                                <button
                                                            className="uk-button uk-button-default"
                                                            id="router-btn"
                                                            onClick={[Function]}
                                                >
                                                            HOME  
                                                </button>
                                    </li>
                        </ul>
            </div>
</nav>,
          <Connect(Locations) />,
          <Connect(Cart) />,
        ],
        "className": "uk-container uk-padding",
      },
      "ref": null,
      "rendered": Array [
        Object {
          "instance": null,
          "key": undefined,
          "nodeType": "host",
          "props": Object {
            "children": <div
              className="uk-navbar-right"
>
              <ul
                            className="uk-navbar-nav"
              >
                            <li
                                          className="uk-active"
                            >
                                          <button
                                                        className="uk-button uk-button-default"
                                                        uk-toggle="target: #cart-off-canvas"
                                          >
                                                        <span
                                                                      uk-icon="icon: cart"
                                                        />
                                          </button>
                            </li>
                            <li
                                          className="uk-active"
                            >
                                          <button
                                                        className="uk-button uk-button-default"
                                                        id="router-btn"
                                                        onClick={[Function]}
                                          >
                                                        HOME  
                                          </button>
                            </li>
              </ul>
</div>,
            "uk-navbar": true,
          },
          "ref": null,
          "rendered": Object {
            "instance": null,
            "key": undefined,
            "nodeType": "host",
            "props": Object {
              "children": <ul
                className="uk-navbar-nav"
>
                <li
                                className="uk-active"
                >
                                <button
                                                className="uk-button uk-button-default"
                                                uk-toggle="target: #cart-off-canvas"
                                >
                                                <span
                                                                uk-icon="icon: cart"
                                                />
                                </button>
                </li>
                <li
                                className="uk-active"
                >
                                <button
                                                className="uk-button uk-button-default"
                                                id="router-btn"
                                                onClick={[Function]}
                                >
                                                HOME  
                                </button>
                </li>
</ul>,
              "className": "uk-navbar-right",
            },
            "ref": null,
            "rendered": Object {
              "instance": null,
              "key": undefined,
              "nodeType": "host",
              "props": Object {
                "children": Array [
                  <li
                    className="uk-active"
>
                    <button
                                        className="uk-button uk-button-default"
                                        uk-toggle="target: #cart-off-canvas"
                    >
                                        <span
                                                            uk-icon="icon: cart"
                                        />
                    </button>
</li>,
                  <li
                    className="uk-active"
>
                    <button
                                        className="uk-button uk-button-default"
                                        id="router-btn"
                                        onClick={[Function]}
                    >
                                        HOME  
                    </button>
</li>,
                ],
                "className": "uk-navbar-nav",
              },
              "ref": null,
              "rendered": Array [
                Object {
                  "instance": null,
                  "key": undefined,
                  "nodeType": "host",
                  "props": Object {
                    "children": <button
                      className="uk-button uk-button-default"
                      uk-toggle="target: #cart-off-canvas"
>
                      <span
                                            uk-icon="icon: cart"
                      />
</button>,
                    "className": "uk-active",
                  },
                  "ref": null,
                  "rendered": Object {
                    "instance": null,
                    "key": undefined,
                    "nodeType": "host",
                    "props": Object {
                      "children": <span
                        uk-icon="icon: cart"
/>,
                      "className": "uk-button uk-button-default",
                      "uk-toggle": "target: #cart-off-canvas",
                    },
                    "ref": null,
                    "rendered": Object {
                      "instance": null,
                      "key": undefined,
                      "nodeType": "host",
                      "props": Object {
                        "uk-icon": "icon: cart",
                      },
                      "ref": null,
                      "rendered": null,
                      "type": "span",
                    },
                    "type": "button",
                  },
                  "type": "li",
                },
                Object {
                  "instance": null,
                  "key": undefined,
                  "nodeType": "host",
                  "props": Object {
                    "children": <button
                      className="uk-button uk-button-default"
                      id="router-btn"
                      onClick={[Function]}
>
                      HOME  
</button>,
                    "className": "uk-active",
                  },
                  "ref": null,
                  "rendered": Object {
                    "instance": null,
                    "key": undefined,
                    "nodeType": "host",
                    "props": Object {
                      "children": "HOME  ",
                      "className": "uk-button uk-button-default",
                      "id": "router-btn",
                      "onClick": [Function],
                    },
                    "ref": null,
                    "rendered": "HOME  ",
                    "type": "button",
                  },
                  "type": "li",
                },
              ],
              "type": "ul",
            },
            "type": "div",
          },
          "type": "nav",
        },
        Object {
          "instance": null,
          "key": undefined,
          "nodeType": "class",
          "props": Object {},
          "ref": null,
          "rendered": null,
          "type": [Function],
        },
        Object {
          "instance": null,
          "key": undefined,
          "nodeType": "class",
          "props": Object {},
          "ref": null,
          "rendered": null,
          "type": [Function],
        },
      ],
      "type": "div",
    },
  ],
  Symbol(enzyme.__options__): Object {
    "adapter": ReactSixteenAdapter {
      "options": Object {
        "enableComponentDidUpdateOnSetState": true,
      },
    },
  },
}
`;
