%YAML 1.1
%TAG !u! tag:unity3d.com,2011:
--- !u!1 &7785367302220635144
GameObject:
  m_ObjectHideFlags: 0
  m_CorrespondingSourceObject: {fileID: 0}
  m_PrefabInstance: {fileID: 0}
  m_PrefabAsset: {fileID: 0}
  serializedVersion: 6
  m_Component:
  - component: {fileID: 7785367302220635145}
  m_Layer: 0
  m_Name: Gas1
  m_TagString: Untagged
  m_Icon: {fileID: 0}
  m_NavMeshLayer: 0
  m_StaticEditorFlags: 0
  m_IsActive: 1
--- !u!4 &7785367302220635145
Transform:
  m_ObjectHideFlags: 0
  m_CorrespondingSourceObject: {fileID: 0}
  m_PrefabInstance: {fileID: 0}
  m_PrefabAsset: {fileID: 0}
  m_GameObject: {fileID: 7785367302220635144}
  serializedVersion: 2
  m_LocalRotation: {x: 0.52231836, y: -0.026296372, z: 0.0028309433, w: 0.8523404}
  m_LocalPosition: {x: -2.346, y: 3.2, z: -2.453}
  m_LocalScale: {x: 1, y: 1, z: 1}
  m_ConstrainProportionsScale: 0
  m_Children: []
  m_Father: {fileID: 7785367302414673104}
  m_LocalEulerAnglesHint: {x: 62.941, y: -5.281, z: -2.8530002}
--- !u!1 &7785367302414673109
GameObject:
  m_ObjectHideFlags: 0
  m_CorrespondingSourceObject: {fileID: 0}
  m_PrefabInstance: {fileID: 0}
  m_PrefabAsset: {fileID: 0}
  serializedVersion: 6
  m_Component:
  - component: {fileID: 7785367302414673104}
  - component: {fileID: 7785367302414673107}
  - component: {fileID: 7785367302414673106}
  m_Layer: 13
  m_Name: Event_Decontamination
  m_TagString: Untagged
  m_Icon: {fileID: 0}
  m_NavMeshLayer: 0
  m_StaticEditorFlags: 0
  m_IsActive: 1
--- !u!4 &7785367302414673104
Transform:
  m_ObjectHideFlags: 0
  m_CorrespondingSourceObject: {fileID: 0}
  m_PrefabInstance: {fileID: 0}
  m_PrefabAsset: {fileID: 0}
  m_GameObject: {fileID: 7785367302414673109}
  serializedVersion: 2
  m_LocalRotation: {x: 0, y: 0, z: 0, w: 1}
  m_LocalPosition: {x: 0, y: 0, z: 0}
  m_LocalScale: {x: 1, y: 1, z: 1}
  m_ConstrainProportionsScale: 0
  m_Children:
  - {fileID: 7785367302220635145}
  - {fileID: 7785367302951569533}
  - {fileID: 3261635291174406014}
  - {fileID: 3261635292056605546}
  m_Father: {fileID: 0}
  m_LocalEulerAnglesHint: {x: 0, y: 0, z: 0}
--- !u!114 &7785367302414673107
MonoBehaviour:
  m_ObjectHideFlags: 0
  m_CorrespondingSourceObject: {fileID: 0}
  m_PrefabInstance: {fileID: 0}
  m_PrefabAsset: {fileID: 0}
  m_GameObject: {fileID: 7785367302414673109}
  m_Enabled: 1
  m_EditorHideFlags: 0
  m_Script: {fileID: 11500000, guid: a0213213ae8e6dd4281c7f6fb1013c69, type: 3}
  m_Name: 
  m_EditorClassIdentifier: 
  isStarted: 0
  x: 0
  y: 0
  state: 0
  gas: {fileID: 8300000, guid: 0e50e809da0101d40ac3b31154dad84e, type: 3}
  pos1: {fileID: 7785367302220635145}
  pos2: {fileID: 7785367302951569533}
  smokeprefab: {fileID: 8602308993848613176, guid: 7ffef60d34a0677428ac80f719e0160b,
    type: 3}
  door1: {fileID: 4403478566619153313}
  door2: {fileID: 4403478565217949621}
--- !u!65 &7785367302414673106
BoxCollider:
  m_ObjectHideFlags: 0
  m_CorrespondingSourceObject: {fileID: 0}
  m_PrefabInstance: {fileID: 0}
  m_PrefabAsset: {fileID: 0}
  m_GameObject: {fileID: 7785367302414673109}
  m_Material: {fileID: 0}
  m_IncludeLayers:
    serializedVersion: 2
    m_Bits: 0
  m_ExcludeLayers:
    serializedVersion: 2
    m_Bits: 0
  m_LayerOverridePriority: 0
  m_IsTrigger: 1
  m_ProvidesContacts: 0
  m_Enabled: 1
  serializedVersion: 3
  m_Size: {x: 2.2251406, y: 1.4755664, z: 5.6989365}
  m_Center: {x: -2.1880527, y: 0.2377832, z: -0.24062824}
--- !u!1 &7785367302951569532
GameObject:
  m_ObjectHideFlags: 0
  m_CorrespondingSourceObject: {fileID: 0}
  m_PrefabInstance: {fileID: 0}
  m_PrefabAsset: {fileID: 0}
  serializedVersion: 6
  m_Component:
  - component: {fileID: 7785367302951569533}
  m_Layer: 0
  m_Name: Gas2
  m_TagString: Untagged
  m_Icon: {fileID: 0}
  m_NavMeshLayer: 0
  m_StaticEditorFlags: 0
  m_IsActive: 1
--- !u!4 &7785367302951569533
Transform:
  m_ObjectHideFlags: 0
  m_CorrespondingSourceObject: {fileID: 0}
  m_PrefabInstance: {fileID: 0}
  m_PrefabAsset: {fileID: 0}
  m_GameObject: {fileID: 7785367302951569532}
  serializedVersion: 2
  m_LocalRotation: {x: 0, y: 0.85290915, z: -0.52205944, w: 0}
  m_LocalPosition: {x: -2.275, y: 3.2, z: 1.915}
  m_LocalScale: {x: 1, y: 1, z: 1}
  m_ConstrainProportionsScale: 0
  m_Children: []
  m_Father: {fileID: 7785367302414673104}
  m_LocalEulerAnglesHint: {x: 62.941, y: 180, z: 0}
--- !u!1001 &7785367302666129639
PrefabInstance:
  m_ObjectHideFlags: 0
  serializedVersion: 2
  m_Modification:
    serializedVersion: 3
    m_TransformParent: {fileID: 7785367302414673104}
    m_Modifications:
    - target: {fileID: 3253926415715605622, guid: 8b117d26e8560c2458ce6465ec63e1cf,
        type: 3}
      propertyPath: scp173
      value: 0
      objectReference: {fileID: 0}
    - target: {fileID: 3253926415715605622, guid: 8b117d26e8560c2458ce6465ec63e1cf,
        type: 3}
      propertyPath: ignoreSave
      value: 1
      objectReference: {fileID: 0}
    - target: {fileID: 3253926415715605622, guid: 8b117d26e8560c2458ce6465ec63e1cf,
        type: 3}
      propertyPath: switchOpen
      value: 1
      objectReference: {fileID: 0}
    - target: {fileID: 3509292714356461652, guid: 8b117d26e8560c2458ce6465ec63e1cf,
        type: 3}
      propertyPath: m_IsActive
      value: 0
      objectReference: {fileID: 0}
    - target: {fileID: 4416237426726600126, guid: 8b117d26e8560c2458ce6465ec63e1cf,
        type: 3}
      propertyPath: m_IsActive
      value: 0
      objectReference: {fileID: 0}
    - target: {fileID: 4704157506594609049, guid: 8b117d26e8560c2458ce6465ec63e1cf,
        type: 3}
      propertyPath: m_RootOrder
      value: 2
      objectReference: {fileID: 0}
    - target: {fileID: 4704157506594609049, guid: 8b117d26e8560c2458ce6465ec63e1cf,
        type: 3}
      propertyPath: m_LocalPosition.x
      value: -2.52
      objectReference: {fileID: 0}
    - target: {fileID: 4704157506594609049, guid: 8b117d26e8560c2458ce6465ec63e1cf,
        type: 3}
      propertyPath: m_LocalPosition.y
      value: 0
      objectReference: {fileID: 0}
    - target: {fileID: 4704157506594609049, guid: 8b117d26e8560c2458ce6465ec63e1cf,
        type: 3}
      propertyPath: m_LocalPosition.z
      value: 2.864
      objectReference: {fileID: 0}
    - target: {fileID: 4704157506594609049, guid: 8b117d26e8560c2458ce6465ec63e1cf,
        type: 3}
      propertyPath: m_LocalRotation.w
      value: 1
      objectReference: {fileID: 0}
    - target: {fileID: 4704157506594609049, guid: 8b117d26e8560c2458ce6465ec63e1cf,
        type: 3}
      propertyPath: m_LocalRotation.x
      value: -0
      objectReference: {fileID: 0}
    - target: {fileID: 4704157506594609049, guid: 8b117d26e8560c2458ce6465ec63e1cf,
        type: 3}
      propertyPath: m_LocalRotation.y
      value: -0
      objectReference: {fileID: 0}
    - target: {fileID: 4704157506594609049, guid: 8b117d26e8560c2458ce6465ec63e1cf,
        type: 3}
      propertyPath: m_LocalRotation.z
      value: -0
      objectReference: {fileID: 0}
    - target: {fileID: 4704157506594609049, guid: 8b117d26e8560c2458ce6465ec63e1cf,
        type: 3}
      propertyPath: m_LocalEulerAnglesHint.x
      value: 0
      objectReference: {fileID: 0}
    - target: {fileID: 4704157506594609049, guid: 8b117d26e8560c2458ce6465ec63e1cf,
        type: 3}
      propertyPath: m_LocalEulerAnglesHint.y
      value: 0
      objectReference: {fileID: 0}
    - target: {fileID: 4704157506594609049, guid: 8b117d26e8560c2458ce6465ec63e1cf,
        type: 3}
      propertyPath: m_LocalEulerAnglesHint.z
      value: 0
      objectReference: {fileID: 0}
    - target: {fileID: 5843247054901121862, guid: 8b117d26e8560c2458ce6465ec63e1cf,
        type: 3}
      propertyPath: isOpen
      value: 1
      objectReference: {fileID: 0}
    - target: {fileID: 5843247054901121862, guid: 8b117d26e8560c2458ce6465ec63e1cf,
        type: 3}
      propertyPath: scp173
      value: 0
      objectReference: {fileID: 0}
    - target: {fileID: 5843247054901121862, guid: 8b117d26e8560c2458ce6465ec63e1cf,
        type: 3}
      propertyPath: ignoreSave
      value: 1
      objectReference: {fileID: 0}
    - target: {fileID: 5843247054901121862, guid: 8b117d26e8560c2458ce6465ec63e1cf,
        type: 3}
      propertyPath: switchOpen
      value: 1
      objectReference: {fileID: 0}
    - target: {fileID: 8844315487564344749, guid: 8b117d26e8560c2458ce6465ec63e1cf,
        type: 3}
      propertyPath: m_Name
      value: KeyDoor_def (1)
      objectReference: {fileID: 0}
    m_RemovedComponents: []
    m_RemovedGameObjects: []
    m_AddedGameObjects: []
    m_AddedComponents: []
  m_SourcePrefab: {fileID: 100100000, guid: 8b117d26e8560c2458ce6465ec63e1cf, type: 3}
--- !u!4 &3261635291174406014 stripped
Transform:
  m_CorrespondingSourceObject: {fileID: 4704157506594609049, guid: 8b117d26e8560c2458ce6465ec63e1cf,
    type: 3}
  m_PrefabInstance: {fileID: 7785367302666129639}
  m_PrefabAsset: {fileID: 0}
--- !u!114 &4403478566619153313 stripped
MonoBehaviour:
  m_CorrespondingSourceObject: {fileID: 5843247054901121862, guid: 8b117d26e8560c2458ce6465ec63e1cf,
    type: 3}
  m_PrefabInstance: {fileID: 7785367302666129639}
  m_PrefabAsset: {fileID: 0}
  m_GameObject: {fileID: 0}
  m_Enabled: 1
  m_EditorHideFlags: 0
  m_Script: {fileID: 11500000, guid: fd3b7ec2d9ca287468ffa0e795e730d6, type: 3}
  m_Name: 
  m_EditorClassIdentifier: 
--- !u!1001 &7785367303950320883
PrefabInstance:
  m_ObjectHideFlags: 0
  serializedVersion: 2
  m_Modification:
    serializedVersion: 3
    m_TransformParent: {fileID: 7785367302414673104}
    m_Modifications:
    - target: {fileID: 3253926415715605622, guid: 8b117d26e8560c2458ce6465ec63e1cf,
        type: 3}
      propertyPath: scp173
      value: 0
      objectReference: {fileID: 0}
    - target: {fileID: 3253926415715605622, guid: 8b117d26e8560c2458ce6465ec63e1cf,
        type: 3}
      propertyPath: ignoreSave
      value: 1
      objectReference: {fileID: 0}
    - target: {fileID: 3253926415715605622, guid: 8b117d26e8560c2458ce6465ec63e1cf,
        type: 3}
      propertyPath: switchOpen
      value: 1
      objectReference: {fileID: 0}
    - target: {fileID: 3509292714356461652, guid: 8b117d26e8560c2458ce6465ec63e1cf,
        type: 3}
      propertyPath: m_IsActive
      value: 0
      objectReference: {fileID: 0}
    - target: {fileID: 4416237426726600126, guid: 8b117d26e8560c2458ce6465ec63e1cf,
        type: 3}
      propertyPath: m_IsActive
      value: 0
      objectReference: {fileID: 0}
    - target: {fileID: 4704157506594609049, guid: 8b117d26e8560c2458ce6465ec63e1cf,
        type: 3}
      propertyPath: m_RootOrder
      value: 3
      objectReference: {fileID: 0}
    - target: {fileID: 4704157506594609049, guid: 8b117d26e8560c2458ce6465ec63e1cf,
        type: 3}
      propertyPath: m_LocalPosition.x
      value: -2.52
      objectReference: {fileID: 0}
    - target: {fileID: 4704157506594609049, guid: 8b117d26e8560c2458ce6465ec63e1cf,
        type: 3}
      propertyPath: m_LocalPosition.y
      value: 0
      objectReference: {fileID: 0}
    - target: {fileID: 4704157506594609049, guid: 8b117d26e8560c2458ce6465ec63e1cf,
        type: 3}
      propertyPath: m_LocalPosition.z
      value: -3.456
      objectReference: {fileID: 0}
    - target: {fileID: 4704157506594609049, guid: 8b117d26e8560c2458ce6465ec63e1cf,
        type: 3}
      propertyPath: m_LocalRotation.w
      value: 1
      objectReference: {fileID: 0}
    - target: {fileID: 4704157506594609049, guid: 8b117d26e8560c2458ce6465ec63e1cf,
        type: 3}
      propertyPath: m_LocalRotation.x
      value: -0
      objectReference: {fileID: 0}
    - target: {fileID: 4704157506594609049, guid: 8b117d26e8560c2458ce6465ec63e1cf,
        type: 3}
      propertyPath: m_LocalRotation.y
      value: -0
      objectReference: {fileID: 0}
    - target: {fileID: 4704157506594609049, guid: 8b117d26e8560c2458ce6465ec63e1cf,
        type: 3}
      propertyPath: m_LocalRotation.z
      value: -0
      objectReference: {fileID: 0}
    - target: {fileID: 4704157506594609049, guid: 8b117d26e8560c2458ce6465ec63e1cf,
        type: 3}
      propertyPath: m_LocalEulerAnglesHint.x
      value: 0
      objectReference: {fileID: 0}
    - target: {fileID: 4704157506594609049, guid: 8b117d26e8560c2458ce6465ec63e1cf,
        type: 3}
      propertyPath: m_LocalEulerAnglesHint.y
      value: 0
      objectReference: {fileID: 0}
    - target: {fileID: 4704157506594609049, guid: 8b117d26e8560c2458ce6465ec63e1cf,
        type: 3}
      propertyPath: m_LocalEulerAnglesHint.z
      value: 0
      objectReference: {fileID: 0}
    - target: {fileID: 5843247054901121862, guid: 8b117d26e8560c2458ce6465ec63e1cf,
        type: 3}
      propertyPath: isOpen
      value: 1
      objectReference: {fileID: 0}
    - target: {fileID: 5843247054901121862, guid: 8b117d26e8560c2458ce6465ec63e1cf,
        type: 3}
      propertyPath: scp173
      value: 0
      objectReference: {fileID: 0}
    - target: {fileID: 5843247054901121862, guid: 8b117d26e8560c2458ce6465ec63e1cf,
        type: 3}
      propertyPath: ignoreSave
      value: 1
      objectReference: {fileID: 0}
    - target: {fileID: 5843247054901121862, guid: 8b117d26e8560c2458ce6465ec63e1cf,
        type: 3}
      propertyPath: switchOpen
      value: 1
      objectReference: {fileID: 0}
    - target: {fileID: 8844315487564344749, guid: 8b117d26e8560c2458ce6465ec63e1cf,
        type: 3}
      propertyPath: m_Name
      value: KeyDoor_def
      objectReference: {fileID: 0}
    m_RemovedComponents: []
    m_RemovedGameObjects: []
    m_AddedGameObjects: []
    m_AddedComponents: []
  m_SourcePrefab: {fileID: 100100000, guid: 8b117d26e8560c2458ce6465ec63e1cf, type: 3}
--- !u!4 &3261635292056605546 stripped
Transform:
  m_CorrespondingSourceObject: {fileID: 4704157506594609049, guid: 8b117d26e8560c2458ce6465ec63e1cf,
    type: 3}
  m_PrefabInstance: {fileID: 7785367303950320883}
  m_PrefabAsset: {fileID: 0}
--- !u!114 &4403478565217949621 stripped
MonoBehaviour:
  m_CorrespondingSourceObject: {fileID: 5843247054901121862, guid: 8b117d26e8560c2458ce6465ec63e1cf,
    type: 3}
  m_PrefabInstance: {fileID: 7785367303950320883}
  m_PrefabAsset: {fileID: 0}
  m_GameObject: {fileID: 0}
  m_Enabled: 1
  m_EditorHideFlags: 0
  m_Script: {fileID: 11500000, guid: fd3b7ec2d9ca287468ffa0e795e730d6, type: 3}
  m_Name: 
  m_EditorClassIdentifier: 
