%YAML 1.1
%TAG !u! tag:unity3d.com,2011:
--- !u!1 &5198688300472878824
GameObject:
  m_ObjectHideFlags: 0
  m_CorrespondingSourceObject: {fileID: 0}
  m_PrefabInstance: {fileID: 0}
  m_PrefabAsset: {fileID: 0}
  serializedVersion: 6
  m_Component:
  - component: {fileID: 8620485409135581213}
  - component: {fileID: 2632025263250819523}
  - component: {fileID: 186575303806590460}
  m_Layer: 13
  m_Name: GameObject
  m_TagString: Untagged
  m_Icon: {fileID: 0}
  m_NavMeshLayer: 0
  m_StaticEditorFlags: 0
  m_IsActive: 1
--- !u!4 &8620485409135581213
Transform:
  m_ObjectHideFlags: 0
  m_CorrespondingSourceObject: {fileID: 0}
  m_PrefabInstance: {fileID: 0}
  m_PrefabAsset: {fileID: 0}
  m_GameObject: {fileID: 5198688300472878824}
  m_LocalRotation: {x: 0, y: 0, z: 0, w: 1}
  m_LocalPosition: {x: 0, y: 0, z: 0}
  m_LocalScale: {x: 1, y: 1, z: 1}
  m_Children: []
  m_Father: {fileID: 6606088577543266254}
  m_RootOrder: 3
  m_LocalEulerAnglesHint: {x: 0, y: 0, z: 0}
--- !u!65 &2632025263250819523
BoxCollider:
  m_ObjectHideFlags: 0
  m_CorrespondingSourceObject: {fileID: 0}
  m_PrefabInstance: {fileID: 0}
  m_PrefabAsset: {fileID: 0}
  m_GameObject: {fileID: 5198688300472878824}
  m_Material: {fileID: 0}
  m_IsTrigger: 1
  m_Enabled: 1
  serializedVersion: 2
  m_Size: {x: 1.9545963, y: 1.9256897, z: 2.5432794}
  m_Center: {x: 0.023837686, y: 0.13532591, z: -0.77163994}
--- !u!114 &186575303806590460
MonoBehaviour:
  m_ObjectHideFlags: 0
  m_CorrespondingSourceObject: {fileID: 0}
  m_PrefabInstance: {fileID: 0}
  m_PrefabAsset: {fileID: 0}
  m_GameObject: {fileID: 5198688300472878824}
  m_Enabled: 1
  m_EditorHideFlags: 0
  m_Script: {fileID: 11500000, guid: 929d0809ce969f044b90d608b2146146, type: 3}
  m_Name: 
  m_EditorClassIdentifier: 
  autoFalse: 0
--- !u!1 &6606088577408377853
GameObject:
  m_ObjectHideFlags: 0
  m_CorrespondingSourceObject: {fileID: 0}
  m_PrefabInstance: {fileID: 0}
  m_PrefabAsset: {fileID: 0}
  serializedVersion: 6
  m_Component:
  - component: {fileID: 6606088577408377852}
  - component: {fileID: 6606088577408377826}
  - component: {fileID: 6606088577408377827}
  m_Layer: 13
  m_Name: Col
  m_TagString: Untagged
  m_Icon: {fileID: 0}
  m_NavMeshLayer: 0
  m_StaticEditorFlags: 0
  m_IsActive: 1
--- !u!4 &6606088577408377852
Transform:
  m_ObjectHideFlags: 0
  m_CorrespondingSourceObject: {fileID: 0}
  m_PrefabInstance: {fileID: 0}
  m_PrefabAsset: {fileID: 0}
  m_GameObject: {fileID: 6606088577408377853}
  m_LocalRotation: {x: 0, y: 0, z: 0, w: 1}
  m_LocalPosition: {x: 0, y: -4.51, z: 0}
  m_LocalScale: {x: 1, y: 1, z: 1}
  m_Children: []
  m_Father: {fileID: 6606088578665155953}
  m_RootOrder: 6
  m_LocalEulerAnglesHint: {x: 0, y: 0, z: 0}
--- !u!65 &6606088577408377826
BoxCollider:
  m_ObjectHideFlags: 0
  m_CorrespondingSourceObject: {fileID: 0}
  m_PrefabInstance: {fileID: 0}
  m_PrefabAsset: {fileID: 0}
  m_GameObject: {fileID: 6606088577408377853}
  m_Material: {fileID: 0}
  m_IsTrigger: 1
  m_Enabled: 1
  serializedVersion: 2
  m_Size: {x: 10.592529, y: 1, z: 16.807623}
  m_Center: {x: 2.8232174, y: 0, z: 0.9024048}
--- !u!114 &6606088577408377827
MonoBehaviour:
  m_ObjectHideFlags: 0
  m_CorrespondingSourceObject: {fileID: 0}
  m_PrefabInstance: {fileID: 0}
  m_PrefabAsset: {fileID: 0}
  m_GameObject: {fileID: 6606088577408377853}
  m_Enabled: 1
  m_EditorHideFlags: 0
  m_Script: {fileID: 11500000, guid: 929d0809ce969f044b90d608b2146146, type: 3}
  m_Name: 
  m_EditorClassIdentifier: 
  autoFalse: 0
--- !u!1 &6606088577543266255
GameObject:
  m_ObjectHideFlags: 0
  m_CorrespondingSourceObject: {fileID: 0}
  m_PrefabInstance: {fileID: 0}
  m_PrefabAsset: {fileID: 0}
  serializedVersion: 6
  m_Component:
  - component: {fileID: 6606088577543266254}
  - component: {fileID: 6606088577543266253}
  m_Layer: 0
  m_Name: SCP012
  m_TagString: Untagged
  m_Icon: {fileID: 0}
  m_NavMeshLayer: 0
  m_StaticEditorFlags: 0
  m_IsActive: 1
--- !u!4 &6606088577543266254
Transform:
  m_ObjectHideFlags: 0
  m_CorrespondingSourceObject: {fileID: 0}
  m_PrefabInstance: {fileID: 0}
  m_PrefabAsset: {fileID: 0}
  m_GameObject: {fileID: 6606088577543266255}
  m_LocalRotation: {x: -0, y: 1, z: -0, w: 0}
  m_LocalPosition: {x: 2.719, y: -4.17, z: -3.363}
  m_LocalScale: {x: 1, y: 1, z: 1}
  m_Children:
  - {fileID: 6606088578504842794}
  - {fileID: 6606088577592757394}
  - {fileID: 6606088577978705566}
  - {fileID: 8620485409135581213}
  m_Father: {fileID: 6606088578665155953}
  m_RootOrder: 1
  m_LocalEulerAnglesHint: {x: 0, y: 0, z: 0}
--- !u!95 &6606088577543266253
Animator:
  serializedVersion: 5
  m_ObjectHideFlags: 0
  m_CorrespondingSourceObject: {fileID: 0}
  m_PrefabInstance: {fileID: 0}
  m_PrefabAsset: {fileID: 0}
  m_GameObject: {fileID: 6606088577543266255}
  m_Enabled: 1
  m_Avatar: {fileID: 0}
  m_Controller: {fileID: 9100000, guid: a98d91b11d12a464bbab2913e6e951fc, type: 2}
  m_CullingMode: 0
  m_UpdateMode: 0
  m_ApplyRootMotion: 0
  m_LinearVelocityBlending: 0
  m_StabilizeFeet: 0
  m_WarningMessage: 
  m_HasTransformHierarchy: 1
  m_AllowConstantClipSamplingOptimization: 1
  m_KeepAnimatorStateOnDisable: 0
  m_WriteDefaultValuesOnDisable: 0
--- !u!1 &6606088577978705567
GameObject:
  m_ObjectHideFlags: 0
  m_CorrespondingSourceObject: {fileID: 0}
  m_PrefabInstance: {fileID: 0}
  m_PrefabAsset: {fileID: 0}
  serializedVersion: 6
  m_Component:
  - component: {fileID: 6606088577978705566}
  - component: {fileID: 6606088577978705565}
  m_Layer: 22
  m_Name: Point Light
  m_TagString: Untagged
  m_Icon: {fileID: 0}
  m_NavMeshLayer: 0
  m_StaticEditorFlags: 0
  m_IsActive: 1
--- !u!4 &6606088577978705566
Transform:
  m_ObjectHideFlags: 0
  m_CorrespondingSourceObject: {fileID: 0}
  m_PrefabInstance: {fileID: 0}
  m_PrefabAsset: {fileID: 0}
  m_GameObject: {fileID: 6606088577978705567}
  m_LocalRotation: {x: -0.08631335, y: -0, z: -0, w: 0.9962681}
  m_LocalPosition: {x: -0.024999857, y: 1.122, z: -1.039}
  m_LocalScale: {x: 1, y: 1, z: 1}
  m_Children: []
  m_Father: {fileID: 6606088577543266254}
  m_RootOrder: 2
  m_LocalEulerAnglesHint: {x: 0, y: 0, z: 0}
--- !u!108 &6606088577978705565
Light:
  m_ObjectHideFlags: 0
  m_CorrespondingSourceObject: {fileID: 0}
  m_PrefabInstance: {fileID: 0}
  m_PrefabAsset: {fileID: 0}
  m_GameObject: {fileID: 6606088577978705567}
  m_Enabled: 1
  serializedVersion: 10
  m_Type: 2
  m_Shape: 0
  m_Color: {r: 0.9056604, g: 0.38946933, b: 0.21787111, a: 1}
  m_Intensity: 2
  m_Range: 10
  m_SpotAngle: 30
  m_InnerSpotAngle: 21.80208
  m_CookieSize: 10
  m_Shadows:
    m_Type: 2
    m_Resolution: -1
    m_CustomResolution: -1
    m_Strength: 0.331
    m_Bias: 0.05
    m_NormalBias: 0.4
    m_NearPlane: 0.2
    m_CullingMatrixOverride:
      e00: 1
      e01: 0
      e02: 0
      e03: 0
      e10: 0
      e11: 1
      e12: 0
      e13: 0
      e20: 0
      e21: 0
      e22: 1
      e23: 0
      e30: 0
      e31: 0
      e32: 0
      e33: 1
    m_UseCullingMatrixOverride: 0
  m_Cookie: {fileID: 0}
  m_DrawHalo: 0
  m_Flare: {fileID: 0}
  m_RenderMode: 2
  m_CullingMask:
    serializedVersion: 2
    m_Bits: 4294967295
  m_RenderingLayerMask: 1
  m_Lightmapping: 4
  m_LightShadowCasterMode: 0
  m_AreaSize: {x: 1, y: 1}
  m_BounceIntensity: 1
  m_ColorTemperature: 6570
  m_UseColorTemperature: 0
  m_BoundingSphereOverride: {x: 0, y: 0, z: 0, w: 0}
  m_UseBoundingSphereOverride: 0
  m_UseViewFrustumForShadowCasterCull: 1
  m_ShadowRadius: 0
  m_ShadowAngle: 0
--- !u!1 &6606088578287475821
GameObject:
  m_ObjectHideFlags: 0
  m_CorrespondingSourceObject: {fileID: 0}
  m_PrefabInstance: {fileID: 0}
  m_PrefabAsset: {fileID: 0}
  serializedVersion: 6
  m_Component:
  - component: {fileID: 6606088578287475820}
  m_Layer: 0
  m_Name: Path1 (2)
  m_TagString: Untagged
  m_Icon: {fileID: 0}
  m_NavMeshLayer: 0
  m_StaticEditorFlags: 0
  m_IsActive: 1
--- !u!4 &6606088578287475820
Transform:
  m_ObjectHideFlags: 0
  m_CorrespondingSourceObject: {fileID: 0}
  m_PrefabInstance: {fileID: 0}
  m_PrefabAsset: {fileID: 0}
  m_GameObject: {fileID: 6606088578287475821}
  m_LocalRotation: {x: -0, y: -0, z: -0, w: 1}
  m_LocalPosition: {x: 2.854, y: -5.517, z: -2.028}
  m_LocalScale: {x: 1, y: 1, z: 1}
  m_Children: []
  m_Father: {fileID: 6606088578665155953}
  m_RootOrder: 4
  m_LocalEulerAnglesHint: {x: 0, y: 0, z: 0}
--- !u!1 &6606088578520081163
GameObject:
  m_ObjectHideFlags: 0
  m_CorrespondingSourceObject: {fileID: 0}
  m_PrefabInstance: {fileID: 0}
  m_PrefabAsset: {fileID: 0}
  serializedVersion: 6
  m_Component:
  - component: {fileID: 6606088578520081162}
  - component: {fileID: 6606088578520081161}
  m_Layer: 0
  m_Name: Event_SCP012
  m_TagString: Untagged
  m_Icon: {fileID: 0}
  m_NavMeshLayer: 0
  m_StaticEditorFlags: 0
  m_IsActive: 1
--- !u!4 &6606088578520081162
Transform:
  m_ObjectHideFlags: 0
  m_CorrespondingSourceObject: {fileID: 0}
  m_PrefabInstance: {fileID: 0}
  m_PrefabAsset: {fileID: 0}
  m_GameObject: {fileID: 6606088578520081163}
  m_LocalRotation: {x: 0, y: 0, z: 0, w: 1}
  m_LocalPosition: {x: 0, y: 0, z: 0}
  m_LocalScale: {x: 1, y: 1, z: 1}
  m_Children:
  - {fileID: 6606088578665155953}
  - {fileID: 8930265211878975658}
  - {fileID: 7660962261928416964}
  m_Father: {fileID: 0}
  m_RootOrder: 0
  m_LocalEulerAnglesHint: {x: 0, y: 0, z: 0}
--- !u!114 &6606088578520081161
MonoBehaviour:
  m_ObjectHideFlags: 0
  m_CorrespondingSourceObject: {fileID: 0}
  m_PrefabInstance: {fileID: 0}
  m_PrefabAsset: {fileID: 0}
  m_GameObject: {fileID: 6606088578520081163}
  m_Enabled: 1
  m_EditorHideFlags: 0
  m_Script: {fileID: 11500000, guid: 7988d32fc1705894b94d74ed1e236d60, type: 3}
  m_Name: 
  m_EditorClassIdentifier: 
  isStarted: 0
  x: 0
  y: 0
  state: 0
  door: {fileID: 5364061042796773535}
  golgotha: {fileID: 6606088579123216736}
  Dvoice:
  - {fileID: 8300000, guid: a0933f1f7a0922d4c89527cacf503ba9, type: 3}
  - {fileID: 8300000, guid: cbd250786a84e1545a70a88805e30072, type: 3}
  - {fileID: 8300000, guid: 493cd0bd74841464fbb9e05a31e7d370, type: 3}
  - {fileID: 8300000, guid: 1d5c1e15f4afdaa48899900984099a11, type: 3}
  - {fileID: 8300000, guid: 4c0ec4555254b854690169143fa62572, type: 3}
  - {fileID: 8300000, guid: 2bfae695f855591419501d6a847832e0, type: 3}
  - {fileID: 8300000, guid: 9f4d286062f74a74b917471c1cecc9bb, type: 3}
  Pages: {fileID: 6606088577590464112}
  bloodPages:
  - {fileID: 2800000, guid: 2d3644198a97c074b8815c0a3fae4854, type: 3}
  - {fileID: 2800000, guid: 7de734fd7c80faf4cb5074e6de8c5374, type: 3}
  - {fileID: 2800000, guid: eb62b822eab68184bad2e30c6d0558bf, type: 3}
  Path:
  - {fileID: 6606088578530382804}
  - {fileID: 6606088578803772513}
  - {fileID: 6606088578287475820}
  blood: {fileID: 796671394911397036}
  trigger: {fileID: 6606088577408377827}
  scp012: {fileID: 186575303806590460}
  box: {fileID: 6606088577543266253}
  StartTimer: 97
--- !u!1 &6606088578530382805
GameObject:
  m_ObjectHideFlags: 0
  m_CorrespondingSourceObject: {fileID: 0}
  m_PrefabInstance: {fileID: 0}
  m_PrefabAsset: {fileID: 0}
  serializedVersion: 6
  m_Component:
  - component: {fileID: 6606088578530382804}
  m_Layer: 0
  m_Name: Path1
  m_TagString: Untagged
  m_Icon: {fileID: 0}
  m_NavMeshLayer: 0
  m_StaticEditorFlags: 0
  m_IsActive: 1
--- !u!4 &6606088578530382804
Transform:
  m_ObjectHideFlags: 0
  m_CorrespondingSourceObject: {fileID: 0}
  m_PrefabInstance: {fileID: 0}
  m_PrefabAsset: {fileID: 0}
  m_GameObject: {fileID: 6606088578530382805}
  m_LocalRotation: {x: -0, y: -0, z: -0, w: 1}
  m_LocalPosition: {x: -0.29, y: -5.517, z: 6.109}
  m_LocalScale: {x: 1, y: 1, z: 1}
  m_Children: []
  m_Father: {fileID: 6606088578665155953}
  m_RootOrder: 2
  m_LocalEulerAnglesHint: {x: 0, y: 0, z: 0}
--- !u!1 &6606088578665155954
GameObject:
  m_ObjectHideFlags: 0
  m_CorrespondingSourceObject: {fileID: 0}
  m_PrefabInstance: {fileID: 0}
  m_PrefabAsset: {fileID: 0}
  serializedVersion: 6
  m_Component:
  - component: {fileID: 6606088578665155953}
  m_Layer: 15
  m_Name: Container
  m_TagString: Untagged
  m_Icon: {fileID: 0}
  m_NavMeshLayer: 0
  m_StaticEditorFlags: 0
  m_IsActive: 1
--- !u!4 &6606088578665155953
Transform:
  m_ObjectHideFlags: 0
  m_CorrespondingSourceObject: {fileID: 0}
  m_PrefabInstance: {fileID: 0}
  m_PrefabAsset: {fileID: 0}
  m_GameObject: {fileID: 6606088578665155954}
  m_LocalRotation: {x: -0, y: -0, z: -0, w: 1}
  m_LocalPosition: {x: 0, y: 0, z: 0}
  m_LocalScale: {x: 1, y: 1, z: 1}
  m_Children:
  - {fileID: 2742757700992224112}
  - {fileID: 6606088577543266254}
  - {fileID: 6606088578530382804}
  - {fileID: 6606088578803772513}
  - {fileID: 6606088578287475820}
  - {fileID: 6606088579123216737}
  - {fileID: 6606088577408377852}
  - {fileID: 796671394911397036}
  m_Father: {fileID: 6606088578520081162}
  m_RootOrder: 0
  m_LocalEulerAnglesHint: {x: 0, y: 0, z: 0}
--- !u!1 &6606088578803772514
GameObject:
  m_ObjectHideFlags: 0
  m_CorrespondingSourceObject: {fileID: 0}
  m_PrefabInstance: {fileID: 0}
  m_PrefabAsset: {fileID: 0}
  serializedVersion: 6
  m_Component:
  - component: {fileID: 6606088578803772513}
  m_Layer: 0
  m_Name: Path1 (1)
  m_TagString: Untagged
  m_Icon: {fileID: 0}
  m_NavMeshLayer: 0
  m_StaticEditorFlags: 0
  m_IsActive: 1
--- !u!4 &6606088578803772513
Transform:
  m_ObjectHideFlags: 0
  m_CorrespondingSourceObject: {fileID: 0}
  m_PrefabInstance: {fileID: 0}
  m_PrefabAsset: {fileID: 0}
  m_GameObject: {fileID: 6606088578803772514}
  m_LocalRotation: {x: -0, y: -0, z: -0, w: 1}
  m_LocalPosition: {x: 3.804, y: -5.517, z: 3.206}
  m_LocalScale: {x: 1, y: 1, z: 1}
  m_Children: []
  m_Father: {fileID: 6606088578665155953}
  m_RootOrder: 3
  m_LocalEulerAnglesHint: {x: 0, y: 0, z: 0}
--- !u!1 &6606088579123216738
GameObject:
  m_ObjectHideFlags: 0
  m_CorrespondingSourceObject: {fileID: 0}
  m_PrefabInstance: {fileID: 0}
  m_PrefabAsset: {fileID: 0}
  serializedVersion: 6
  m_Component:
  - component: {fileID: 6606088579123216737}
  - component: {fileID: 6606088579123216736}
  m_Layer: 0
  m_Name: Audio
  m_TagString: Untagged
  m_Icon: {fileID: 0}
  m_NavMeshLayer: 0
  m_StaticEditorFlags: 0
  m_IsActive: 1
--- !u!4 &6606088579123216737
Transform:
  m_ObjectHideFlags: 0
  m_CorrespondingSourceObject: {fileID: 0}
  m_PrefabInstance: {fileID: 0}
  m_PrefabAsset: {fileID: 0}
  m_GameObject: {fileID: 6606088579123216738}
  m_LocalRotation: {x: -0, y: -0, z: -0, w: 1}
  m_LocalPosition: {x: 1.121, y: -3.652, z: 3.155}
  m_LocalScale: {x: 1, y: 1, z: 1}
  m_Children: []
  m_Father: {fileID: 6606088578665155953}
  m_RootOrder: 5
  m_LocalEulerAnglesHint: {x: 0, y: 0, z: 0}
--- !u!82 &6606088579123216736
AudioSource:
  m_ObjectHideFlags: 0
  m_CorrespondingSourceObject: {fileID: 0}
  m_PrefabInstance: {fileID: 0}
  m_PrefabAsset: {fileID: 0}
  m_GameObject: {fileID: 6606088579123216738}
  m_Enabled: 1
  serializedVersion: 4
  OutputAudioMixerGroup: {fileID: 243143395467718416, guid: 4cdd06a97de31484aa0429062392c9f2,
    type: 2}
  m_audioClip: {fileID: 8300000, guid: a573fcb794d392a4db863e118958fe33, type: 3}
  m_PlayOnAwake: 0
  m_Volume: 1
  m_Pitch: 1
  Loop: 1
  Mute: 0
  Spatialize: 0
  SpatializePostEffects: 0
  Priority: 128
  DopplerLevel: 1
  MinDistance: 3
  MaxDistance: 500
  Pan2D: 0
  rolloffMode: 0
  BypassEffects: 0
  BypassListenerEffects: 0
  BypassReverbZones: 0
  rolloffCustomCurve:
    serializedVersion: 2
    m_Curve:
    - serializedVersion: 3
      time: 0
      value: 1
      inSlope: 0
      outSlope: 0
      tangentMode: 0
      weightedMode: 0
      inWeight: 0.33333334
      outWeight: 0.33333334
    - serializedVersion: 3
      time: 1
      value: 0
      inSlope: 0
      outSlope: 0
      tangentMode: 0
      weightedMode: 0
      inWeight: 0.33333334
      outWeight: 0.33333334
    m_PreInfinity: 2
    m_PostInfinity: 2
    m_RotationOrder: 4
  panLevelCustomCurve:
    serializedVersion: 2
    m_Curve:
    - serializedVersion: 3
      time: 0
      value: 1
      inSlope: 0
      outSlope: 0
      tangentMode: 0
      weightedMode: 0
      inWeight: 0.33333334
      outWeight: 0.33333334
    m_PreInfinity: 2
    m_PostInfinity: 2
    m_RotationOrder: 4
  spreadCustomCurve:
    serializedVersion: 2
    m_Curve:
    - serializedVersion: 3
      time: 0
      value: 0
      inSlope: 0
      outSlope: 0
      tangentMode: 0
      weightedMode: 0
      inWeight: 0.33333334
      outWeight: 0.33333334
    m_PreInfinity: 2
    m_PostInfinity: 2
    m_RotationOrder: 4
  reverbZoneMixCustomCurve:
    serializedVersion: 2
    m_Curve:
    - serializedVersion: 3
      time: 0
      value: 1
      inSlope: 0
      outSlope: 0
      tangentMode: 0
      weightedMode: 0
      inWeight: 0.33333334
      outWeight: 0.33333334
    m_PreInfinity: 2
    m_PostInfinity: 2
    m_RotationOrder: 4
--- !u!1 &8380561847845334583
GameObject:
  m_ObjectHideFlags: 0
  m_CorrespondingSourceObject: {fileID: 0}
  m_PrefabInstance: {fileID: 0}
  m_PrefabAsset: {fileID: 0}
  serializedVersion: 6
  m_Component:
  - component: {fileID: 796671394911397036}
  m_Layer: 0
  m_Name: Path1 (3)
  m_TagString: Untagged
  m_Icon: {fileID: 0}
  m_NavMeshLayer: 0
  m_StaticEditorFlags: 0
  m_IsActive: 1
--- !u!4 &796671394911397036
Transform:
  m_ObjectHideFlags: 0
  m_CorrespondingSourceObject: {fileID: 0}
  m_PrefabInstance: {fileID: 0}
  m_PrefabAsset: {fileID: 0}
  m_GameObject: {fileID: 8380561847845334583}
  m_LocalRotation: {x: -0, y: -0, z: -0, w: 1}
  m_LocalPosition: {x: 2.854, y: -5.7315, z: -2.229}
  m_LocalScale: {x: 1, y: 1, z: 1}
  m_Children: []
  m_Father: {fileID: 6606088578665155953}
  m_RootOrder: 7
  m_LocalEulerAnglesHint: {x: 0, y: 0, z: 0}
--- !u!1001 &5239502701503411055
PrefabInstance:
  m_ObjectHideFlags: 0
  serializedVersion: 2
  m_Modification:
    m_TransformParent: {fileID: 6606088578520081162}
    m_Modifications:
    - target: {fileID: 2515057412153927080, guid: 27636d52bdabbd34ab87716aa4fd1397,
        type: 3}
      propertyPath: m_Name
      value: Lever (1)
      objectReference: {fileID: 0}
    - target: {fileID: 2515057412153927083, guid: 27636d52bdabbd34ab87716aa4fd1397,
        type: 3}
      propertyPath: m_RootOrder
      value: 2
      objectReference: {fileID: 0}
    - target: {fileID: 2515057412153927083, guid: 27636d52bdabbd34ab87716aa4fd1397,
        type: 3}
      propertyPath: m_LocalPosition.x
      value: -1.806
      objectReference: {fileID: 0}
    - target: {fileID: 2515057412153927083, guid: 27636d52bdabbd34ab87716aa4fd1397,
        type: 3}
      propertyPath: m_LocalPosition.y
      value: -3.8321743
      objectReference: {fileID: 0}
    - target: {fileID: 2515057412153927083, guid: 27636d52bdabbd34ab87716aa4fd1397,
        type: 3}
      propertyPath: m_LocalPosition.z
      value: 2.758
      objectReference: {fileID: 0}
    - target: {fileID: 2515057412153927083, guid: 27636d52bdabbd34ab87716aa4fd1397,
        type: 3}
      propertyPath: m_LocalRotation.w
      value: 1
      objectReference: {fileID: 0}
    - target: {fileID: 2515057412153927083, guid: 27636d52bdabbd34ab87716aa4fd1397,
        type: 3}
      propertyPath: m_LocalRotation.x
      value: -0
      objectReference: {fileID: 0}
    - target: {fileID: 2515057412153927083, guid: 27636d52bdabbd34ab87716aa4fd1397,
        type: 3}
      propertyPath: m_LocalRotation.y
      value: -0
      objectReference: {fileID: 0}
    - target: {fileID: 2515057412153927083, guid: 27636d52bdabbd34ab87716aa4fd1397,
        type: 3}
      propertyPath: m_LocalRotation.z
      value: -0
      objectReference: {fileID: 0}
    - target: {fileID: 2515057412153927083, guid: 27636d52bdabbd34ab87716aa4fd1397,
        type: 3}
      propertyPath: m_LocalEulerAnglesHint.x
      value: 0
      objectReference: {fileID: 0}
    - target: {fileID: 2515057412153927083, guid: 27636d52bdabbd34ab87716aa4fd1397,
        type: 3}
      propertyPath: m_LocalEulerAnglesHint.y
      value: 0
      objectReference: {fileID: 0}
    - target: {fileID: 2515057412153927083, guid: 27636d52bdabbd34ab87716aa4fd1397,
        type: 3}
      propertyPath: m_LocalEulerAnglesHint.z
      value: 0
      objectReference: {fileID: 0}
    m_RemovedComponents: []
  m_SourcePrefab: {fileID: 100100000, guid: 27636d52bdabbd34ab87716aa4fd1397, type: 3}
--- !u!4 &7660962261928416964 stripped
Transform:
  m_CorrespondingSourceObject: {fileID: 2515057412153927083, guid: 27636d52bdabbd34ab87716aa4fd1397,
    type: 3}
  m_PrefabInstance: {fileID: 5239502701503411055}
  m_PrefabAsset: {fileID: 0}
--- !u!1001 &6415918084811836673
PrefabInstance:
  m_ObjectHideFlags: 0
  serializedVersion: 2
  m_Modification:
    m_TransformParent: {fileID: 6606088578520081162}
    m_Modifications:
    - target: {fileID: 2515057412153927080, guid: 27636d52bdabbd34ab87716aa4fd1397,
        type: 3}
      propertyPath: m_Name
      value: Lever
      objectReference: {fileID: 0}
    - target: {fileID: 2515057412153927083, guid: 27636d52bdabbd34ab87716aa4fd1397,
        type: 3}
      propertyPath: m_RootOrder
      value: 1
      objectReference: {fileID: 0}
    - target: {fileID: 2515057412153927083, guid: 27636d52bdabbd34ab87716aa4fd1397,
        type: 3}
      propertyPath: m_LocalPosition.x
      value: -1.316
      objectReference: {fileID: 0}
    - target: {fileID: 2515057412153927083, guid: 27636d52bdabbd34ab87716aa4fd1397,
        type: 3}
      propertyPath: m_LocalPosition.y
      value: -3.8321743
      objectReference: {fileID: 0}
    - target: {fileID: 2515057412153927083, guid: 27636d52bdabbd34ab87716aa4fd1397,
        type: 3}
      propertyPath: m_LocalPosition.z
      value: 2.758
      objectReference: {fileID: 0}
    - target: {fileID: 2515057412153927083, guid: 27636d52bdabbd34ab87716aa4fd1397,
        type: 3}
      propertyPath: m_LocalRotation.w
      value: 1
      objectReference: {fileID: 0}
    - target: {fileID: 2515057412153927083, guid: 27636d52bdabbd34ab87716aa4fd1397,
        type: 3}
      propertyPath: m_LocalRotation.x
      value: -0
      objectReference: {fileID: 0}
    - target: {fileID: 2515057412153927083, guid: 27636d52bdabbd34ab87716aa4fd1397,
        type: 3}
      propertyPath: m_LocalRotation.y
      value: -0
      objectReference: {fileID: 0}
    - target: {fileID: 2515057412153927083, guid: 27636d52bdabbd34ab87716aa4fd1397,
        type: 3}
      propertyPath: m_LocalRotation.z
      value: -0
      objectReference: {fileID: 0}
    - target: {fileID: 2515057412153927083, guid: 27636d52bdabbd34ab87716aa4fd1397,
        type: 3}
      propertyPath: m_LocalEulerAnglesHint.x
      value: 0
      objectReference: {fileID: 0}
    - target: {fileID: 2515057412153927083, guid: 27636d52bdabbd34ab87716aa4fd1397,
        type: 3}
      propertyPath: m_LocalEulerAnglesHint.y
      value: 0
      objectReference: {fileID: 0}
    - target: {fileID: 2515057412153927083, guid: 27636d52bdabbd34ab87716aa4fd1397,
        type: 3}
      propertyPath: m_LocalEulerAnglesHint.z
      value: 0
      objectReference: {fileID: 0}
    m_RemovedComponents: []
  m_SourcePrefab: {fileID: 100100000, guid: 27636d52bdabbd34ab87716aa4fd1397, type: 3}
--- !u!4 &8930265211878975658 stripped
Transform:
  m_CorrespondingSourceObject: {fileID: 2515057412153927083, guid: 27636d52bdabbd34ab87716aa4fd1397,
    type: 3}
  m_PrefabInstance: {fileID: 6415918084811836673}
  m_PrefabAsset: {fileID: 0}
--- !u!1001 &6606088577592366608
PrefabInstance:
  m_ObjectHideFlags: 0
  serializedVersion: 2
  m_Modification:
    m_TransformParent: {fileID: 6606088577543266254}
    m_Modifications:
    - target: {fileID: 100002, guid: db99edec80e39bf4e9a3267a11dd7bbe, type: 3}
      propertyPath: m_Name
      value: room012_3
      objectReference: {fileID: 0}
    - target: {fileID: 400002, guid: db99edec80e39bf4e9a3267a11dd7bbe, type: 3}
      propertyPath: m_RootOrder
      value: 1
      objectReference: {fileID: 0}
    - target: {fileID: 400002, guid: db99edec80e39bf4e9a3267a11dd7bbe, type: 3}
      propertyPath: m_LocalScale.x
      value: 1
      objectReference: {fileID: 0}
    - target: {fileID: 400002, guid: db99edec80e39bf4e9a3267a11dd7bbe, type: 3}
      propertyPath: m_LocalScale.y
      value: 1
      objectReference: {fileID: 0}
    - target: {fileID: 400002, guid: db99edec80e39bf4e9a3267a11dd7bbe, type: 3}
      propertyPath: m_LocalScale.z
      value: 1
      objectReference: {fileID: 0}
    - target: {fileID: 400002, guid: db99edec80e39bf4e9a3267a11dd7bbe, type: 3}
      propertyPath: m_LocalPosition.x
      value: -0.024999857
      objectReference: {fileID: 0}
    - target: {fileID: 400002, guid: db99edec80e39bf4e9a3267a11dd7bbe, type: 3}
      propertyPath: m_LocalPosition.y
      value: 0.012000084
      objectReference: {fileID: 0}
    - target: {fileID: 400002, guid: db99edec80e39bf4e9a3267a11dd7bbe, type: 3}
      propertyPath: m_LocalPosition.z
      value: -0.17499995
      objectReference: {fileID: 0}
    - target: {fileID: 400002, guid: db99edec80e39bf4e9a3267a11dd7bbe, type: 3}
      propertyPath: m_LocalRotation.w
      value: 0.9962681
      objectReference: {fileID: 0}
    - target: {fileID: 400002, guid: db99edec80e39bf4e9a3267a11dd7bbe, type: 3}
      propertyPath: m_LocalRotation.x
      value: -0.08631335
      objectReference: {fileID: 0}
    - target: {fileID: 400002, guid: db99edec80e39bf4e9a3267a11dd7bbe, type: 3}
      propertyPath: m_LocalRotation.y
      value: -0
      objectReference: {fileID: 0}
    - target: {fileID: 400002, guid: db99edec80e39bf4e9a3267a11dd7bbe, type: 3}
      propertyPath: m_LocalRotation.z
      value: -0
      objectReference: {fileID: 0}
    - target: {fileID: 400002, guid: db99edec80e39bf4e9a3267a11dd7bbe, type: 3}
      propertyPath: m_LocalEulerAnglesHint.x
      value: -9.903001
      objectReference: {fileID: 0}
    - target: {fileID: 400002, guid: db99edec80e39bf4e9a3267a11dd7bbe, type: 3}
      propertyPath: m_LocalEulerAnglesHint.y
      value: 180.00002
      objectReference: {fileID: 0}
    - target: {fileID: 400002, guid: db99edec80e39bf4e9a3267a11dd7bbe, type: 3}
      propertyPath: m_LocalEulerAnglesHint.z
      value: 0
      objectReference: {fileID: 0}
    - target: {fileID: 2300000, guid: db99edec80e39bf4e9a3267a11dd7bbe, type: 3}
      propertyPath: m_Materials.Array.data[0]
      value: 
      objectReference: {fileID: 2100000, guid: 97978dcc073e8f3419c8341dafb90eb8, type: 2}
    m_RemovedComponents: []
  m_SourcePrefab: {fileID: 100100000, guid: db99edec80e39bf4e9a3267a11dd7bbe, type: 3}
--- !u!4 &6606088577592757394 stripped
Transform:
  m_CorrespondingSourceObject: {fileID: 400002, guid: db99edec80e39bf4e9a3267a11dd7bbe,
    type: 3}
  m_PrefabInstance: {fileID: 6606088577592366608}
  m_PrefabAsset: {fileID: 0}
--- !u!23 &6606088577590464112 stripped
MeshRenderer:
  m_CorrespondingSourceObject: {fileID: 2300000, guid: db99edec80e39bf4e9a3267a11dd7bbe,
    type: 3}
  m_PrefabInstance: {fileID: 6606088577592366608}
  m_PrefabAsset: {fileID: 0}
--- !u!1001 &6606088578504967296
PrefabInstance:
  m_ObjectHideFlags: 0
  serializedVersion: 2
  m_Modification:
    m_TransformParent: {fileID: 6606088577543266254}
    m_Modifications:
    - target: {fileID: 100042, guid: cff13625cfbff594799ddadef04eec78, type: 3}
      propertyPath: m_Name
      value: room012_2
      objectReference: {fileID: 0}
    - target: {fileID: 400042, guid: cff13625cfbff594799ddadef04eec78, type: 3}
      propertyPath: m_RootOrder
      value: 0
      objectReference: {fileID: 0}
    - target: {fileID: 400042, guid: cff13625cfbff594799ddadef04eec78, type: 3}
      propertyPath: m_LocalScale.x
      value: 1
      objectReference: {fileID: 0}
    - target: {fileID: 400042, guid: cff13625cfbff594799ddadef04eec78, type: 3}
      propertyPath: m_LocalScale.y
      value: 1
      objectReference: {fileID: 0}
    - target: {fileID: 400042, guid: cff13625cfbff594799ddadef04eec78, type: 3}
      propertyPath: m_LocalScale.z
      value: 1
      objectReference: {fileID: 0}
    - target: {fileID: 400042, guid: cff13625cfbff594799ddadef04eec78, type: 3}
      propertyPath: m_LocalPosition.x
      value: 0
      objectReference: {fileID: 0}
    - target: {fileID: 400042, guid: cff13625cfbff594799ddadef04eec78, type: 3}
      propertyPath: m_LocalPosition.y
      value: 0
      objectReference: {fileID: 0}
    - target: {fileID: 400042, guid: cff13625cfbff594799ddadef04eec78, type: 3}
      propertyPath: m_LocalPosition.z
      value: 0
      objectReference: {fileID: 0}
    - target: {fileID: 400042, guid: cff13625cfbff594799ddadef04eec78, type: 3}
      propertyPath: m_LocalRotation.w
      value: 1
      objectReference: {fileID: 0}
    - target: {fileID: 400042, guid: cff13625cfbff594799ddadef04eec78, type: 3}
      propertyPath: m_LocalRotation.x
      value: -0
      objectReference: {fileID: 0}
    - target: {fileID: 400042, guid: cff13625cfbff594799ddadef04eec78, type: 3}
      propertyPath: m_LocalRotation.y
      value: -0
      objectReference: {fileID: 0}
    - target: {fileID: 400042, guid: cff13625cfbff594799ddadef04eec78, type: 3}
      propertyPath: m_LocalRotation.z
      value: -0
      objectReference: {fileID: 0}
    - target: {fileID: 400042, guid: cff13625cfbff594799ddadef04eec78, type: 3}
      propertyPath: m_LocalEulerAnglesHint.x
      value: 0
      objectReference: {fileID: 0}
    - target: {fileID: 400042, guid: cff13625cfbff594799ddadef04eec78, type: 3}
      propertyPath: m_LocalEulerAnglesHint.y
      value: 180
      objectReference: {fileID: 0}
    - target: {fileID: 400042, guid: cff13625cfbff594799ddadef04eec78, type: 3}
      propertyPath: m_LocalEulerAnglesHint.z
      value: 0
      objectReference: {fileID: 0}
    m_RemovedComponents: []
  m_SourcePrefab: {fileID: 100100000, guid: cff13625cfbff594799ddadef04eec78, type: 3}
--- !u!4 &6606088578504842794 stripped
Transform:
  m_CorrespondingSourceObject: {fileID: 400042, guid: cff13625cfbff594799ddadef04eec78,
    type: 3}
  m_PrefabInstance: {fileID: 6606088578504967296}
  m_PrefabAsset: {fileID: 0}
--- !u!1001 &8608982853041332720
PrefabInstance:
  m_ObjectHideFlags: 0
  serializedVersion: 2
  m_Modification:
    m_TransformParent: {fileID: 6606088578665155953}
    m_Modifications:
    - target: {fileID: 4398250280754143599, guid: e975ec10717902d498e734f0817b70d3,
        type: 3}
      propertyPath: ignoreSave
      value: 1
      objectReference: {fileID: 0}
    - target: {fileID: 5866356131641617024, guid: e975ec10717902d498e734f0817b70d3,
        type: 3}
      propertyPath: m_RootOrder
      value: 0
      objectReference: {fileID: 0}
    - target: {fileID: 5866356131641617024, guid: e975ec10717902d498e734f0817b70d3,
        type: 3}
      propertyPath: m_LocalPosition.x
      value: 3.83
      objectReference: {fileID: 0}
    - target: {fileID: 5866356131641617024, guid: e975ec10717902d498e734f0817b70d3,
        type: 3}
      propertyPath: m_LocalPosition.y
      value: -5.7599998
      objectReference: {fileID: 0}
    - target: {fileID: 5866356131641617024, guid: e975ec10717902d498e734f0817b70d3,
        type: 3}
      propertyPath: m_LocalPosition.z
      value: 2.489
      objectReference: {fileID: 0}
    - target: {fileID: 5866356131641617024, guid: e975ec10717902d498e734f0817b70d3,
        type: 3}
      propertyPath: m_LocalRotation.w
      value: 1
      objectReference: {fileID: 0}
    - target: {fileID: 5866356131641617024, guid: e975ec10717902d498e734f0817b70d3,
        type: 3}
      propertyPath: m_LocalRotation.x
      value: -0
      objectReference: {fileID: 0}
    - target: {fileID: 5866356131641617024, guid: e975ec10717902d498e734f0817b70d3,
        type: 3}
      propertyPath: m_LocalRotation.y
      value: -0
      objectReference: {fileID: 0}
    - target: {fileID: 5866356131641617024, guid: e975ec10717902d498e734f0817b70d3,
        type: 3}
      propertyPath: m_LocalRotation.z
      value: -0
      objectReference: {fileID: 0}
    - target: {fileID: 5866356131641617024, guid: e975ec10717902d498e734f0817b70d3,
        type: 3}
      propertyPath: m_LocalEulerAnglesHint.x
      value: 0
      objectReference: {fileID: 0}
    - target: {fileID: 5866356131641617024, guid: e975ec10717902d498e734f0817b70d3,
        type: 3}
      propertyPath: m_LocalEulerAnglesHint.y
      value: 0
      objectReference: {fileID: 0}
    - target: {fileID: 5866356131641617024, guid: e975ec10717902d498e734f0817b70d3,
        type: 3}
      propertyPath: m_LocalEulerAnglesHint.z
      value: 0
      objectReference: {fileID: 0}
    - target: {fileID: 7682208121852514484, guid: e975ec10717902d498e734f0817b70d3,
        type: 3}
      propertyPath: m_Name
      value: LightDoor_def (1)
      objectReference: {fileID: 0}
    m_RemovedComponents: []
  m_SourcePrefab: {fileID: 100100000, guid: e975ec10717902d498e734f0817b70d3, type: 3}
--- !u!4 &2742757700992224112 stripped
Transform:
  m_CorrespondingSourceObject: {fileID: 5866356131641617024, guid: e975ec10717902d498e734f0817b70d3,
    type: 3}
  m_PrefabInstance: {fileID: 8608982853041332720}
  m_PrefabAsset: {fileID: 0}
--- !u!114 &5364061042796773535 stripped
MonoBehaviour:
  m_CorrespondingSourceObject: {fileID: 4398250280754143599, guid: e975ec10717902d498e734f0817b70d3,
    type: 3}
  m_PrefabInstance: {fileID: 8608982853041332720}
  m_PrefabAsset: {fileID: 0}
  m_GameObject: {fileID: 0}
  m_Enabled: 1
  m_EditorHideFlags: 0
  m_Script: {fileID: 11500000, guid: fd3b7ec2d9ca287468ffa0e795e730d6, type: 3}
  m_Name: 
  m_EditorClassIdentifier: 
