%YAML 1.1
%TAG !u! tag:unity3d.com,2011:
--- !u!1 &1842641802
GameObject:
  m_ObjectHideFlags: 0
  m_CorrespondingSourceObject: {fileID: 0}
  m_PrefabInstance: {fileID: 0}
  m_PrefabAsset: {fileID: 0}
  serializedVersion: 6
  m_Component:
  - component: {fileID: 1842641803}
  - component: {fileID: 1842641806}
  - component: {fileID: 1842641805}
  - component: {fileID: 1842641804}
  m_Layer: 0
  m_Name: Quad
  m_TagString: Untagged
  m_Icon: {fileID: 0}
  m_NavMeshLayer: 0
  m_StaticEditorFlags: 0
  m_IsActive: 1
--- !u!4 &1842641803
Transform:
  m_ObjectHideFlags: 0
  m_CorrespondingSourceObject: {fileID: 0}
  m_PrefabInstance: {fileID: 0}
  m_PrefabAsset: {fileID: 0}
  m_GameObject: {fileID: 1842641802}
  m_LocalRotation: {x: -0, y: 0.7071068, z: -0.7071068, w: 0}
  m_LocalPosition: {x: -8.05, y: 7.027, z: -13.14}
  m_LocalScale: {x: 4, y: 4, z: 1}
  m_Children: []
  m_Father: {fileID: 429266193469349101}
  m_RootOrder: 10
  m_LocalEulerAnglesHint: {x: 90, y: 0, z: 0}
--- !u!33 &1842641806
MeshFilter:
  m_ObjectHideFlags: 0
  m_CorrespondingSourceObject: {fileID: 0}
  m_PrefabInstance: {fileID: 0}
  m_PrefabAsset: {fileID: 0}
  m_GameObject: {fileID: 1842641802}
  m_Mesh: {fileID: 10210, guid: 0000000000000000e000000000000000, type: 0}
--- !u!23 &1842641805
MeshRenderer:
  m_ObjectHideFlags: 0
  m_CorrespondingSourceObject: {fileID: 0}
  m_PrefabInstance: {fileID: 0}
  m_PrefabAsset: {fileID: 0}
  m_GameObject: {fileID: 1842641802}
  m_Enabled: 1
  m_CastShadows: 1
  m_ReceiveShadows: 1
  m_DynamicOccludee: 1
  m_MotionVectors: 1
  m_LightProbeUsage: 1
  m_ReflectionProbeUsage: 1
  m_RayTracingMode: 2
  m_RayTraceProcedural: 0
  m_RenderingLayerMask: 1
  m_RendererPriority: 0
  m_Materials:
  - {fileID: 2100000, guid: acabfb77aec63194bb9c5b5f9763dc6d, type: 2}
  m_StaticBatchInfo:
    firstSubMesh: 0
    subMeshCount: 0
  m_StaticBatchRoot: {fileID: 0}
  m_ProbeAnchor: {fileID: 0}
  m_LightProbeVolumeOverride: {fileID: 0}
  m_ScaleInLightmap: 1
  m_ReceiveGI: 1
  m_PreserveUVs: 0
  m_IgnoreNormalsForChartDetection: 0
  m_ImportantGI: 0
  m_StitchLightmapSeams: 1
  m_SelectedEditorRenderState: 3
  m_MinimumChartSize: 4
  m_AutoUVMaxDistance: 0.5
  m_AutoUVMaxAngle: 89
  m_LightmapParameters: {fileID: 0}
  m_SortingLayerID: 0
  m_SortingLayer: 0
  m_SortingOrder: 0
  m_AdditionalVertexStreams: {fileID: 0}
--- !u!114 &1842641804
MonoBehaviour:
  m_ObjectHideFlags: 0
  m_CorrespondingSourceObject: {fileID: 0}
  m_PrefabInstance: {fileID: 0}
  m_PrefabAsset: {fileID: 0}
  m_GameObject: {fileID: 1842641802}
  m_Enabled: 1
  m_EditorHideFlags: 0
  m_Script: {fileID: 11500000, guid: 14f38494322e00246b446811100543b0, type: 3}
  m_Name: 
  m_EditorClassIdentifier: 
  columns: 3
  rows: 4
  x: 2
  y: 3
--- !u!1 &2059528010
GameObject:
  m_ObjectHideFlags: 0
  m_CorrespondingSourceObject: {fileID: 0}
  m_PrefabInstance: {fileID: 0}
  m_PrefabAsset: {fileID: 0}
  serializedVersion: 6
  m_Component:
  - component: {fileID: 2059528011}
  m_Layer: 0
  m_Name: GameObject
  m_TagString: Untagged
  m_Icon: {fileID: 0}
  m_NavMeshLayer: 0
  m_StaticEditorFlags: 0
  m_IsActive: 1
--- !u!4 &2059528011
Transform:
  m_ObjectHideFlags: 0
  m_CorrespondingSourceObject: {fileID: 0}
  m_PrefabInstance: {fileID: 0}
  m_PrefabAsset: {fileID: 0}
  m_GameObject: {fileID: 2059528010}
  m_LocalRotation: {x: 0, y: 0, z: 0, w: 1}
  m_LocalPosition: {x: -0.67, y: -9.595, z: -11.9}
  m_LocalScale: {x: 1, y: 1, z: 1}
  m_Children: []
  m_Father: {fileID: 429266193469349101}
  m_RootOrder: 11
  m_LocalEulerAnglesHint: {x: 0, y: 0, z: 0}
--- !u!1 &83019721520284227
GameObject:
  m_ObjectHideFlags: 0
  m_CorrespondingSourceObject: {fileID: 0}
  m_PrefabInstance: {fileID: 0}
  m_PrefabAsset: {fileID: 0}
  serializedVersion: 6
  m_Component:
  - component: {fileID: 3998536933340311632}
  - component: {fileID: 6482839194884627754}
  m_Layer: 0
  m_Name: humanReWeight
  m_TagString: Untagged
  m_Icon: {fileID: 0}
  m_NavMeshLayer: 0
  m_StaticEditorFlags: 0
  m_IsActive: 1
--- !u!4 &3998536933340311632
Transform:
  m_ObjectHideFlags: 0
  m_CorrespondingSourceObject: {fileID: 0}
  m_PrefabInstance: {fileID: 0}
  m_PrefabAsset: {fileID: 0}
  m_GameObject: {fileID: 83019721520284227}
  m_LocalRotation: {x: -0, y: -0, z: -0, w: 1}
  m_LocalPosition: {x: 0, y: 0, z: 0}
  m_LocalScale: {x: 1, y: 1, z: 1}
  m_Children:
  - {fileID: 3767053548615162688}
  m_Father: {fileID: 429266194340570387}
  m_RootOrder: 0
  m_LocalEulerAnglesHint: {x: 0, y: 0, z: 0}
--- !u!95 &6482839194884627754
Animator:
  serializedVersion: 5
  m_ObjectHideFlags: 0
  m_CorrespondingSourceObject: {fileID: 0}
  m_PrefabInstance: {fileID: 0}
  m_PrefabAsset: {fileID: 0}
  m_GameObject: {fileID: 83019721520284227}
  m_Enabled: 1
  m_Avatar: {fileID: 9000000, guid: bb31dbcb8c5b1854c8d82c23b9eec0d8, type: 3}
  m_Controller: {fileID: 9100000, guid: e9503e3f3172b594a8315fb0004b6d91, type: 2}
  m_CullingMode: 1
  m_UpdateMode: 0
  m_ApplyRootMotion: 0
  m_LinearVelocityBlending: 0
  m_StabilizeFeet: 0
  m_WarningMessage: 
  m_HasTransformHierarchy: 0
  m_AllowConstantClipSamplingOptimization: 1
  m_KeepAnimatorStateOnDisable: 0
  m_WriteDefaultValuesOnDisable: 0
--- !u!1 &429266193305263217
GameObject:
  m_ObjectHideFlags: 0
  m_CorrespondingSourceObject: {fileID: 0}
  m_PrefabInstance: {fileID: 0}
  m_PrefabAsset: {fileID: 0}
  serializedVersion: 6
  m_Component:
  - component: {fileID: 429266193305263216}
  m_Layer: 0
  m_Name: notFloatPos
  m_TagString: Untagged
  m_Icon: {fileID: 0}
  m_NavMeshLayer: 0
  m_StaticEditorFlags: 0
  m_IsActive: 1
--- !u!4 &429266193305263216
Transform:
  m_ObjectHideFlags: 0
  m_CorrespondingSourceObject: {fileID: 0}
  m_PrefabInstance: {fileID: 0}
  m_PrefabAsset: {fileID: 0}
  m_GameObject: {fileID: 429266193305263217}
  m_LocalRotation: {x: -0, y: -0, z: -0, w: 1}
  m_LocalPosition: {x: -5.77, y: -9.367, z: -5.26}
  m_LocalScale: {x: 1, y: 1, z: 1}
  m_Children: []
  m_Father: {fileID: 429266193469349101}
  m_RootOrder: 0
  m_LocalEulerAnglesHint: {x: 0, y: 0, z: 0}
--- !u!1 &429266193469349099
GameObject:
  m_ObjectHideFlags: 0
  m_CorrespondingSourceObject: {fileID: 0}
  m_PrefabInstance: {fileID: 0}
  m_PrefabAsset: {fileID: 0}
  serializedVersion: 6
  m_Component:
  - component: {fileID: 429266193469349101}
  - component: {fileID: 429266193469349098}
  m_Layer: 0
  m_Name: EV_106Recall
  m_TagString: Untagged
  m_Icon: {fileID: 0}
  m_NavMeshLayer: 0
  m_StaticEditorFlags: 0
  m_IsActive: 1
--- !u!4 &429266193469349101
Transform:
  m_ObjectHideFlags: 0
  m_CorrespondingSourceObject: {fileID: 0}
  m_PrefabInstance: {fileID: 0}
  m_PrefabAsset: {fileID: 0}
  m_GameObject: {fileID: 429266193469349099}
  m_LocalRotation: {x: 0, y: 0, z: 0, w: 1}
  m_LocalPosition: {x: 0, y: 0, z: 0}
  m_LocalScale: {x: 1, y: 1, z: 1}
  m_Children:
  - {fileID: 429266193305263216}
  - {fileID: 429266193590089651}
  - {fileID: 429266195058233259}
  - {fileID: 7750913669791311597}
  - {fileID: 429266194340570387}
  - {fileID: 2815392090014227148}
  - {fileID: 2815392089574572152}
  - {fileID: 1289154194448872905}
  - {fileID: 429266194759302004}
  - {fileID: 8063747137078144946}
  - {fileID: 1842641803}
  - {fileID: 2059528011}
  m_Father: {fileID: 0}
  m_RootOrder: 0
  m_LocalEulerAnglesHint: {x: 0, y: 0, z: 0}
--- !u!114 &429266193469349098
MonoBehaviour:
  m_ObjectHideFlags: 0
  m_CorrespondingSourceObject: {fileID: 0}
  m_PrefabInstance: {fileID: 0}
  m_PrefabAsset: {fileID: 0}
  m_GameObject: {fileID: 429266193469349099}
  m_Enabled: 1
  m_EditorHideFlags: 0
  m_Script: {fileID: 11500000, guid: 853a3f74a0acb1a45820597793e8376c, type: 3}
  m_Name: 
  m_EditorClassIdentifier: 
  isStarted: 0
  x: 0
  y: 0
  state: 0
  leverMag: {fileID: 2815392090014227149}
  leverAud: {fileID: 2815392089574572153}
  buttonBreak: {fileID: 1289154194448872910}
  box: {fileID: 429266193589955922}
  lureIdle:
  - {fileID: 8300000, guid: 7ccd51412141d7d4785fb1cbb0f1b500, type: 3}
  - {fileID: 8300000, guid: 8602d9e37651ed8438d3092c5e783daf, type: 3}
  - {fileID: 8300000, guid: dcb1e2db9084c1e49a5bf80e01133ccf, type: 3}
  - {fileID: 8300000, guid: 674c676ecaa32cd48a5dc8f009cbbfec, type: 3}
  - {fileID: 8300000, guid: 0d2b03deb538a26448dee4d20c919b2c, type: 3}
  - {fileID: 8300000, guid: 882c6ad13f521b141ad1d729d7ab2306, type: 3}
  magUp: {fileID: 8300000, guid: d1846be2a8378774f9644766739fbf2e, type: 3}
  magDown: {fileID: 8300000, guid: 78a829a828c483042a96b1f0b5921f02, type: 3}
  femurBreak: {fileID: 8300000, guid: 6f9bca2a75da2b54bbe3e600379b34fd, type: 3}
  attack106: {fileID: 8300000, guid: 1f1600bf731b87943815e40d27df4646, type: 3}
  cry: {fileID: 8300000, guid: 338e6f69cf8153e46a7a81dcb29116da, type: 3}
  paSystem: {fileID: 429266195058233260}
  paSystem2: {fileID: 1369582455204570561}
  boxSound: {fileID: 549811023835034178}
  lureSubject: {fileID: 6482839194884627754}
  spawn1061: {fileID: 429266194759302004}
  spawn1062: {fileID: 2059528011}
  decal1: {fileID: 1842641803}
  decal2: {fileID: 0}
  audMax: 3
  audMin: 8
  spawnMin: 2
  spawnMax: 6
  decalSize1: 4
  decalSize2: 3
--- !u!1 &429266194340570384
GameObject:
  m_ObjectHideFlags: 0
  m_CorrespondingSourceObject: {fileID: 0}
  m_PrefabInstance: {fileID: 0}
  m_PrefabAsset: {fileID: 0}
  serializedVersion: 6
  m_Component:
  - component: {fileID: 429266194340570387}
  m_Layer: 0
  m_Name: Human
  m_TagString: Untagged
  m_Icon: {fileID: 0}
  m_NavMeshLayer: 0
  m_StaticEditorFlags: 0
  m_IsActive: 1
--- !u!4 &429266194340570387
Transform:
  m_ObjectHideFlags: 0
  m_CorrespondingSourceObject: {fileID: 0}
  m_PrefabInstance: {fileID: 0}
  m_PrefabAsset: {fileID: 0}
  m_GameObject: {fileID: 429266194340570384}
  m_LocalRotation: {x: -0, y: 0.09365076, z: -0, w: 0.9956051}
  m_LocalPosition: {x: -8.148, y: 7.830004, z: -15.083}
  m_LocalScale: {x: 1, y: 1, z: 1}
  m_Children:
  - {fileID: 3998536933340311632}
  m_Father: {fileID: 429266193469349101}
  m_RootOrder: 4
  m_LocalEulerAnglesHint: {x: 0, y: 10.747001, z: 0}
--- !u!1 &429266194759302005
GameObject:
  m_ObjectHideFlags: 0
  m_CorrespondingSourceObject: {fileID: 0}
  m_PrefabInstance: {fileID: 0}
  m_PrefabAsset: {fileID: 0}
  serializedVersion: 6
  m_Component:
  - component: {fileID: 429266194759302004}
  m_Layer: 0
  m_Name: 106Spawn
  m_TagString: Untagged
  m_Icon: {fileID: 0}
  m_NavMeshLayer: 0
  m_StaticEditorFlags: 0
  m_IsActive: 1
--- !u!4 &429266194759302004
Transform:
  m_ObjectHideFlags: 0
  m_CorrespondingSourceObject: {fileID: 0}
  m_PrefabInstance: {fileID: 0}
  m_PrefabAsset: {fileID: 0}
  m_GameObject: {fileID: 429266194759302005}
  m_LocalRotation: {x: 0, y: 1, z: 0, w: 0}
  m_LocalPosition: {x: -8.41, y: 7.027, z: -13.14}
  m_LocalScale: {x: 1, y: 1, z: 1}
  m_Children: []
  m_Father: {fileID: 429266193469349101}
  m_RootOrder: 8
  m_LocalEulerAnglesHint: {x: 0, y: 180, z: 0}
--- !u!1 &429266195058233256
GameObject:
  m_ObjectHideFlags: 0
  m_CorrespondingSourceObject: {fileID: 0}
  m_PrefabInstance: {fileID: 0}
  m_PrefabAsset: {fileID: 0}
  serializedVersion: 6
  m_Component:
  - component: {fileID: 429266195058233259}
  - component: {fileID: 429266195058233260}
  - component: {fileID: 429266195058233261}
  - component: {fileID: 429266195058233258}
  m_Layer: 0
  m_Name: PASystem
  m_TagString: Untagged
  m_Icon: {fileID: 0}
  m_NavMeshLayer: 0
  m_StaticEditorFlags: 0
  m_IsActive: 1
--- !u!4 &429266195058233259
Transform:
  m_ObjectHideFlags: 0
  m_CorrespondingSourceObject: {fileID: 0}
  m_PrefabInstance: {fileID: 0}
  m_PrefabAsset: {fileID: 0}
  m_GameObject: {fileID: 429266195058233256}
  m_LocalRotation: {x: 0, y: 0, z: 0, w: 1}
  m_LocalPosition: {x: 2.46, y: 0.91, z: -24.83}
  m_LocalScale: {x: 1, y: 1, z: 1}
  m_Children: []
  m_Father: {fileID: 429266193469349101}
  m_RootOrder: 2
  m_LocalEulerAnglesHint: {x: 0, y: 0, z: 0}
--- !u!82 &429266195058233260
AudioSource:
  m_ObjectHideFlags: 0
  m_CorrespondingSourceObject: {fileID: 0}
  m_PrefabInstance: {fileID: 0}
  m_PrefabAsset: {fileID: 0}
  m_GameObject: {fileID: 429266195058233256}
  m_Enabled: 1
  serializedVersion: 4
  OutputAudioMixerGroup: {fileID: 243188032471989292, guid: 4cdd06a97de31484aa0429062392c9f2,
    type: 2}
  m_audioClip: {fileID: 8300000, guid: efcd4f9d8edc6b34ca57ee4e06ed7b8a, type: 3}
  m_PlayOnAwake: 1
  m_Volume: 0.52
  m_Pitch: 1
  Loop: 1
  Mute: 0
  Spatialize: 0
  SpatializePostEffects: 0
  Priority: 128
  DopplerLevel: 1
  MinDistance: 1
  MaxDistance: 500
  Pan2D: 0
  rolloffMode: 0
  BypassEffects: 0
  BypassListenerEffects: 0
  BypassReverbZones: 0
  rolloffCustomCurve:
    serializedVersion: 2
    m_Curve:
    - serializedVersion: 3
      time: 0
      value: 1
      inSlope: 0
      outSlope: 0
      tangentMode: 0
      weightedMode: 0
      inWeight: 0.33333334
      outWeight: 0.33333334
    - serializedVersion: 3
      time: 1
      value: 0
      inSlope: 0
      outSlope: 0
      tangentMode: 0
      weightedMode: 0
      inWeight: 0.33333334
      outWeight: 0.33333334
    m_PreInfinity: 2
    m_PostInfinity: 2
    m_RotationOrder: 4
  panLevelCustomCurve:
    serializedVersion: 2
    m_Curve:
    - serializedVersion: 3
      time: 0
      value: 0
      inSlope: 0
      outSlope: 0
      tangentMode: 0
      weightedMode: 0
      inWeight: 0.33333334
      outWeight: 0.33333334
    m_PreInfinity: 2
    m_PostInfinity: 2
    m_RotationOrder: 4
  spreadCustomCurve:
    serializedVersion: 2
    m_Curve:
    - serializedVersion: 3
      time: 0
      value: 0
      inSlope: 0
      outSlope: 0
      tangentMode: 0
      weightedMode: 0
      inWeight: 0.33333334
      outWeight: 0.33333334
    m_PreInfinity: 2
    m_PostInfinity: 2
    m_RotationOrder: 4
  reverbZoneMixCustomCurve:
    serializedVersion: 2
    m_Curve:
    - serializedVersion: 3
      time: 0
      value: 1
      inSlope: 0
      outSlope: 0
      tangentMode: 0
      weightedMode: 0
      inWeight: 0.33333334
      outWeight: 0.33333334
    m_PreInfinity: 2
    m_PostInfinity: 2
    m_RotationOrder: 4
--- !u!168 &429266195058233261
AudioEchoFilter:
  m_ObjectHideFlags: 0
  m_CorrespondingSourceObject: {fileID: 0}
  m_PrefabInstance: {fileID: 0}
  m_PrefabAsset: {fileID: 0}
  m_GameObject: {fileID: 429266195058233256}
  m_Enabled: 1
  m_Delay: 300
  m_DecayRatio: 0.3
  m_WetMix: 0.8
  m_DryMix: 0.4
--- !u!164 &429266195058233258
AudioReverbFilter:
  m_ObjectHideFlags: 0
  m_CorrespondingSourceObject: {fileID: 0}
  m_PrefabInstance: {fileID: 0}
  m_PrefabAsset: {fileID: 0}
  m_GameObject: {fileID: 429266195058233256}
  m_Enabled: 1
  m_DryLevel: 0
  m_Room: -1000
  m_RoomHF: -476
  m_DecayTime: 4.32
  m_DecayHFRatio: 0.59
  m_ReflectionsLevel: -789
  m_ReverbLevel: -289
  m_ReverbDelay: 0.03
  m_Diffusion: 100
  m_Density: 100
  m_HFReference: 5000
  m_RoomLF: 0
  m_LFReference: 250
  m_ReflectionsDelay: 0
  m_ReverbPreset: 7
--- !u!1 &4296863796817883269
GameObject:
  m_ObjectHideFlags: 0
  m_CorrespondingSourceObject: {fileID: 0}
  m_PrefabInstance: {fileID: 0}
  m_PrefabAsset: {fileID: 0}
  serializedVersion: 6
  m_Component:
  - component: {fileID: 7750913669791311597}
  - component: {fileID: 1369582455204570561}
  - component: {fileID: 8708068454929842663}
  - component: {fileID: 5305326933751564068}
  m_Layer: 0
  m_Name: PASystem (1)
  m_TagString: Untagged
  m_Icon: {fileID: 0}
  m_NavMeshLayer: 0
  m_StaticEditorFlags: 0
  m_IsActive: 1
--- !u!4 &7750913669791311597
Transform:
  m_ObjectHideFlags: 0
  m_CorrespondingSourceObject: {fileID: 0}
  m_PrefabInstance: {fileID: 0}
  m_PrefabAsset: {fileID: 0}
  m_GameObject: {fileID: 4296863796817883269}
  m_LocalRotation: {x: 0, y: 0, z: 0, w: 1}
  m_LocalPosition: {x: 2.46, y: 0.91, z: -24.83}
  m_LocalScale: {x: 1, y: 1, z: 1}
  m_Children: []
  m_Father: {fileID: 429266193469349101}
  m_RootOrder: 3
  m_LocalEulerAnglesHint: {x: 0, y: 0, z: 0}
--- !u!82 &1369582455204570561
AudioSource:
  m_ObjectHideFlags: 0
  m_CorrespondingSourceObject: {fileID: 0}
  m_PrefabInstance: {fileID: 0}
  m_PrefabAsset: {fileID: 0}
  m_GameObject: {fileID: 4296863796817883269}
  m_Enabled: 1
  serializedVersion: 4
  OutputAudioMixerGroup: {fileID: 243188032471989292, guid: 4cdd06a97de31484aa0429062392c9f2,
    type: 2}
  m_audioClip: {fileID: 8300000, guid: efcd4f9d8edc6b34ca57ee4e06ed7b8a, type: 3}
  m_PlayOnAwake: 0
  m_Volume: 0.52
  m_Pitch: 1
  Loop: 0
  Mute: 0
  Spatialize: 0
  SpatializePostEffects: 0
  Priority: 128
  DopplerLevel: 1
  MinDistance: 1
  MaxDistance: 500
  Pan2D: 0
  rolloffMode: 0
  BypassEffects: 0
  BypassListenerEffects: 0
  BypassReverbZones: 0
  rolloffCustomCurve:
    serializedVersion: 2
    m_Curve:
    - serializedVersion: 3
      time: 0
      value: 1
      inSlope: 0
      outSlope: 0
      tangentMode: 0
      weightedMode: 0
      inWeight: 0.33333334
      outWeight: 0.33333334
    - serializedVersion: 3
      time: 1
      value: 0
      inSlope: 0
      outSlope: 0
      tangentMode: 0
      weightedMode: 0
      inWeight: 0.33333334
      outWeight: 0.33333334
    m_PreInfinity: 2
    m_PostInfinity: 2
    m_RotationOrder: 4
  panLevelCustomCurve:
    serializedVersion: 2
    m_Curve:
    - serializedVersion: 3
      time: 0
      value: 0
      inSlope: 0
      outSlope: 0
      tangentMode: 0
      weightedMode: 0
      inWeight: 0.33333334
      outWeight: 0.33333334
    m_PreInfinity: 2
    m_PostInfinity: 2
    m_RotationOrder: 4
  spreadCustomCurve:
    serializedVersion: 2
    m_Curve:
    - serializedVersion: 3
      time: 0
      value: 0
      inSlope: 0
      outSlope: 0
      tangentMode: 0
      weightedMode: 0
      inWeight: 0.33333334
      outWeight: 0.33333334
    m_PreInfinity: 2
    m_PostInfinity: 2
    m_RotationOrder: 4
  reverbZoneMixCustomCurve:
    serializedVersion: 2
    m_Curve:
    - serializedVersion: 3
      time: 0
      value: 1
      inSlope: 0
      outSlope: 0
      tangentMode: 0
      weightedMode: 0
      inWeight: 0.33333334
      outWeight: 0.33333334
    m_PreInfinity: 2
    m_PostInfinity: 2
    m_RotationOrder: 4
--- !u!168 &8708068454929842663
AudioEchoFilter:
  m_ObjectHideFlags: 0
  m_CorrespondingSourceObject: {fileID: 0}
  m_PrefabInstance: {fileID: 0}
  m_PrefabAsset: {fileID: 0}
  m_GameObject: {fileID: 4296863796817883269}
  m_Enabled: 1
  m_Delay: 300
  m_DecayRatio: 0.3
  m_WetMix: 0.8
  m_DryMix: 0.4
--- !u!164 &5305326933751564068
AudioReverbFilter:
  m_ObjectHideFlags: 0
  m_CorrespondingSourceObject: {fileID: 0}
  m_PrefabInstance: {fileID: 0}
  m_PrefabAsset: {fileID: 0}
  m_GameObject: {fileID: 4296863796817883269}
  m_Enabled: 1
  m_DryLevel: 0
  m_Room: -1000
  m_RoomHF: -476
  m_DecayTime: 4.32
  m_DecayHFRatio: 0.59
  m_ReflectionsLevel: -789
  m_ReverbLevel: -289
  m_ReverbDelay: 0.03
  m_Diffusion: 100
  m_Density: 100
  m_HFReference: 5000
  m_RoomLF: 0
  m_LFReference: 250
  m_ReflectionsDelay: 0
  m_ReverbPreset: 7
--- !u!1 &7197479245705207121
GameObject:
  m_ObjectHideFlags: 0
  m_CorrespondingSourceObject: {fileID: 0}
  m_PrefabInstance: {fileID: 0}
  m_PrefabAsset: {fileID: 0}
  serializedVersion: 6
  m_Component:
  - component: {fileID: 3767053548615162688}
  - component: {fileID: 7901264888547294832}
  m_Layer: 0
  m_Name: classd
  m_TagString: Untagged
  m_Icon: {fileID: 0}
  m_NavMeshLayer: 0
  m_StaticEditorFlags: 0
  m_IsActive: 1
--- !u!4 &3767053548615162688
Transform:
  m_ObjectHideFlags: 0
  m_CorrespondingSourceObject: {fileID: 0}
  m_PrefabInstance: {fileID: 0}
  m_PrefabAsset: {fileID: 0}
  m_GameObject: {fileID: 7197479245705207121}
  m_LocalRotation: {x: 0.000000081460335, y: -0, z: -0, w: 1}
  m_LocalPosition: {x: -0.0025937678, y: 1.0508914, z: -0.014789777}
  m_LocalScale: {x: 1, y: 1, z: 1}
  m_Children: []
  m_Father: {fileID: 3998536933340311632}
  m_RootOrder: 0
  m_LocalEulerAnglesHint: {x: 0, y: 0, z: 0}
--- !u!137 &7901264888547294832
SkinnedMeshRenderer:
  m_ObjectHideFlags: 0
  m_CorrespondingSourceObject: {fileID: 0}
  m_PrefabInstance: {fileID: 0}
  m_PrefabAsset: {fileID: 0}
  m_GameObject: {fileID: 7197479245705207121}
  m_Enabled: 1
  m_CastShadows: 1
  m_ReceiveShadows: 1
  m_DynamicOccludee: 1
  m_MotionVectors: 1
  m_LightProbeUsage: 1
  m_ReflectionProbeUsage: 1
  m_RayTracingMode: 0
  m_RayTraceProcedural: 0
  m_RenderingLayerMask: 1
  m_RendererPriority: 0
  m_Materials:
  - {fileID: 2100000, guid: cd5952062e0ada4429646a3bc834655f, type: 2}
  - {fileID: 2100000, guid: cd5952062e0ada4429646a3bc834655f, type: 2}
  m_StaticBatchInfo:
    firstSubMesh: 0
    subMeshCount: 0
  m_StaticBatchRoot: {fileID: 0}
  m_ProbeAnchor: {fileID: 0}
  m_LightProbeVolumeOverride: {fileID: 0}
  m_ScaleInLightmap: 1
  m_ReceiveGI: 1
  m_PreserveUVs: 0
  m_IgnoreNormalsForChartDetection: 0
  m_ImportantGI: 0
  m_StitchLightmapSeams: 1
  m_SelectedEditorRenderState: 3
  m_MinimumChartSize: 4
  m_AutoUVMaxDistance: 0.5
  m_AutoUVMaxAngle: 89
  m_LightmapParameters: {fileID: 0}
  m_SortingLayerID: 0
  m_SortingLayer: 0
  m_SortingOrder: 0
  serializedVersion: 2
  m_Quality: 0
  m_UpdateWhenOffscreen: 0
  m_SkinnedMotionVectors: 1
  m_Mesh: {fileID: -4494501442585646177, guid: bb31dbcb8c5b1854c8d82c23b9eec0d8, type: 3}
  m_Bones: []
  m_BlendShapeWeights: []
  m_RootBone: {fileID: 0}
  m_AABB:
    m_Center: {x: 0.0035943687, y: -0.15844506, z: 0.031375952}
    m_Extent: {x: 0.896943, y: 1.0296769, z: 0.2740914}
  m_DirtyAABB: 0
--- !u!1 &8451084379466645696
GameObject:
  m_ObjectHideFlags: 0
  m_CorrespondingSourceObject: {fileID: 0}
  m_PrefabInstance: {fileID: 0}
  m_PrefabAsset: {fileID: 0}
  serializedVersion: 6
  m_Component:
  - component: {fileID: 8063747137078144946}
  - component: {fileID: 549811023835034178}
  m_Layer: 0
  m_Name: BoxSource
  m_TagString: Untagged
  m_Icon: {fileID: 0}
  m_NavMeshLayer: 0
  m_StaticEditorFlags: 0
  m_IsActive: 1
--- !u!4 &8063747137078144946
Transform:
  m_ObjectHideFlags: 0
  m_CorrespondingSourceObject: {fileID: 0}
  m_PrefabInstance: {fileID: 0}
  m_PrefabAsset: {fileID: 0}
  m_GameObject: {fileID: 8451084379466645696}
  m_LocalRotation: {x: 0, y: 0, z: 0, w: 1}
  m_LocalPosition: {x: -6.078, y: -3.07, z: -5.49}
  m_LocalScale: {x: 1, y: 1, z: 1}
  m_Children: []
  m_Father: {fileID: 429266193469349101}
  m_RootOrder: 9
  m_LocalEulerAnglesHint: {x: 0, y: 0, z: 0}
--- !u!82 &549811023835034178
AudioSource:
  m_ObjectHideFlags: 0
  m_CorrespondingSourceObject: {fileID: 0}
  m_PrefabInstance: {fileID: 0}
  m_PrefabAsset: {fileID: 0}
  m_GameObject: {fileID: 8451084379466645696}
  m_Enabled: 1
  serializedVersion: 4
  OutputAudioMixerGroup: {fileID: 0}
  m_audioClip: {fileID: 8300000, guid: d1846be2a8378774f9644766739fbf2e, type: 3}
  m_PlayOnAwake: 0
  m_Volume: 1
  m_Pitch: 1
  Loop: 0
  Mute: 0
  Spatialize: 0
  SpatializePostEffects: 0
  Priority: 128
  DopplerLevel: 1
  MinDistance: 4.14
  MaxDistance: 500
  Pan2D: 0
  rolloffMode: 0
  BypassEffects: 0
  BypassListenerEffects: 0
  BypassReverbZones: 0
  rolloffCustomCurve:
    serializedVersion: 2
    m_Curve:
    - serializedVersion: 3
      time: 0
      value: 1
      inSlope: 0
      outSlope: 0
      tangentMode: 0
      weightedMode: 0
      inWeight: 0.33333334
      outWeight: 0.33333334
    - serializedVersion: 3
      time: 1
      value: 0
      inSlope: 0
      outSlope: 0
      tangentMode: 0
      weightedMode: 0
      inWeight: 0.33333334
      outWeight: 0.33333334
    m_PreInfinity: 2
    m_PostInfinity: 2
    m_RotationOrder: 4
  panLevelCustomCurve:
    serializedVersion: 2
    m_Curve:
    - serializedVersion: 3
      time: 0
      value: 1
      inSlope: 0
      outSlope: 0
      tangentMode: 0
      weightedMode: 0
      inWeight: 0.33333334
      outWeight: 0.33333334
    m_PreInfinity: 2
    m_PostInfinity: 2
    m_RotationOrder: 4
  spreadCustomCurve:
    serializedVersion: 2
    m_Curve:
    - serializedVersion: 3
      time: 0
      value: 0
      inSlope: 0
      outSlope: 0
      tangentMode: 0
      weightedMode: 0
      inWeight: 0.33333334
      outWeight: 0.33333334
    m_PreInfinity: 2
    m_PostInfinity: 2
    m_RotationOrder: 4
  reverbZoneMixCustomCurve:
    serializedVersion: 2
    m_Curve:
    - serializedVersion: 3
      time: 0
      value: 1
      inSlope: 0
      outSlope: 0
      tangentMode: 0
      weightedMode: 0
      inWeight: 0.33333334
      outWeight: 0.33333334
    m_PreInfinity: 2
    m_PostInfinity: 2
    m_RotationOrder: 4
--- !u!1001 &429266193589955921
PrefabInstance:
  m_ObjectHideFlags: 0
  serializedVersion: 2
  m_Modification:
    m_TransformParent: {fileID: 429266193469349101}
    m_Modifications:
    - target: {fileID: 100098, guid: cf9c11fa781c0054aba471da00caa116, type: 3}
      propertyPath: m_Name
      value: room1062 (1)
      objectReference: {fileID: 0}
    - target: {fileID: 400098, guid: cf9c11fa781c0054aba471da00caa116, type: 3}
      propertyPath: m_RootOrder
      value: 1
      objectReference: {fileID: 0}
    - target: {fileID: 400098, guid: cf9c11fa781c0054aba471da00caa116, type: 3}
      propertyPath: m_LocalPosition.x
      value: -5.77
      objectReference: {fileID: 0}
    - target: {fileID: 400098, guid: cf9c11fa781c0054aba471da00caa116, type: 3}
      propertyPath: m_LocalPosition.y
      value: -6.85
      objectReference: {fileID: 0}
    - target: {fileID: 400098, guid: cf9c11fa781c0054aba471da00caa116, type: 3}
      propertyPath: m_LocalPosition.z
      value: -5.26
      objectReference: {fileID: 0}
    - target: {fileID: 400098, guid: cf9c11fa781c0054aba471da00caa116, type: 3}
      propertyPath: m_LocalRotation.w
      value: 1
      objectReference: {fileID: 0}
    - target: {fileID: 400098, guid: cf9c11fa781c0054aba471da00caa116, type: 3}
      propertyPath: m_LocalRotation.x
      value: -0
      objectReference: {fileID: 0}
    - target: {fileID: 400098, guid: cf9c11fa781c0054aba471da00caa116, type: 3}
      propertyPath: m_LocalRotation.y
      value: -0
      objectReference: {fileID: 0}
    - target: {fileID: 400098, guid: cf9c11fa781c0054aba471da00caa116, type: 3}
      propertyPath: m_LocalRotation.z
      value: -0
      objectReference: {fileID: 0}
    - target: {fileID: 400098, guid: cf9c11fa781c0054aba471da00caa116, type: 3}
      propertyPath: m_LocalEulerAnglesHint.x
      value: 0
      objectReference: {fileID: 0}
    - target: {fileID: 400098, guid: cf9c11fa781c0054aba471da00caa116, type: 3}
      propertyPath: m_LocalEulerAnglesHint.y
      value: 0
      objectReference: {fileID: 0}
    - target: {fileID: 400098, guid: cf9c11fa781c0054aba471da00caa116, type: 3}
      propertyPath: m_LocalEulerAnglesHint.z
      value: 0
      objectReference: {fileID: 0}
    - target: {fileID: 2300000, guid: cf9c11fa781c0054aba471da00caa116, type: 3}
      propertyPath: m_Materials.Array.data[0]
      value: 
      objectReference: {fileID: 2100000, guid: 9a77c7f35d1cb0e4b8eef4d21d5b190a, type: 2}
    - target: {fileID: 2300002, guid: cf9c11fa781c0054aba471da00caa116, type: 3}
      propertyPath: m_Materials.Array.data[0]
      value: 
      objectReference: {fileID: 2100000, guid: c593b65254059d040a57ffc9cb795815, type: 2}
    - target: {fileID: 2300018, guid: cf9c11fa781c0054aba471da00caa116, type: 3}
      propertyPath: m_Materials.Array.data[0]
      value: 
      objectReference: {fileID: 2100000, guid: e12b35b0818479d4d947d98970ca8fcc, type: 2}
    - target: {fileID: 2300020, guid: cf9c11fa781c0054aba471da00caa116, type: 3}
      propertyPath: m_Materials.Array.data[0]
      value: 
      objectReference: {fileID: 2100000, guid: e12b35b0818479d4d947d98970ca8fcc, type: 2}
    - target: {fileID: 2300022, guid: cf9c11fa781c0054aba471da00caa116, type: 3}
      propertyPath: m_Materials.Array.data[0]
      value: 
      objectReference: {fileID: 2100000, guid: e12b35b0818479d4d947d98970ca8fcc, type: 2}
    - target: {fileID: 2300026, guid: cf9c11fa781c0054aba471da00caa116, type: 3}
      propertyPath: m_Materials.Array.data[0]
      value: 
      objectReference: {fileID: 2100000, guid: e12b35b0818479d4d947d98970ca8fcc, type: 2}
    - target: {fileID: 2300028, guid: cf9c11fa781c0054aba471da00caa116, type: 3}
      propertyPath: m_Materials.Array.data[0]
      value: 
      objectReference: {fileID: 2100000, guid: e12b35b0818479d4d947d98970ca8fcc, type: 2}
    - target: {fileID: 2300030, guid: cf9c11fa781c0054aba471da00caa116, type: 3}
      propertyPath: m_Materials.Array.data[0]
      value: 
      objectReference: {fileID: 2100000, guid: e12b35b0818479d4d947d98970ca8fcc, type: 2}
    - target: {fileID: 2300032, guid: cf9c11fa781c0054aba471da00caa116, type: 3}
      propertyPath: m_Materials.Array.data[0]
      value: 
      objectReference: {fileID: 2100000, guid: e12b35b0818479d4d947d98970ca8fcc, type: 2}
    - target: {fileID: 2300034, guid: cf9c11fa781c0054aba471da00caa116, type: 3}
      propertyPath: m_Materials.Array.data[0]
      value: 
      objectReference: {fileID: 2100000, guid: e12b35b0818479d4d947d98970ca8fcc, type: 2}
    - target: {fileID: 2300068, guid: cf9c11fa781c0054aba471da00caa116, type: 3}
      propertyPath: m_Materials.Array.data[0]
      value: 
      objectReference: {fileID: 2100000, guid: c593b65254059d040a57ffc9cb795815, type: 2}
    m_RemovedComponents: []
  m_SourcePrefab: {fileID: 100100000, guid: cf9c11fa781c0054aba471da00caa116, type: 3}
--- !u!4 &429266193590089651 stripped
Transform:
  m_CorrespondingSourceObject: {fileID: 400098, guid: cf9c11fa781c0054aba471da00caa116,
    type: 3}
  m_PrefabInstance: {fileID: 429266193589955921}
  m_PrefabAsset: {fileID: 0}
--- !u!1 &429266193589922387 stripped
GameObject:
  m_CorrespondingSourceObject: {fileID: 100098, guid: cf9c11fa781c0054aba471da00caa116,
    type: 3}
  m_PrefabInstance: {fileID: 429266193589955921}
  m_PrefabAsset: {fileID: 0}
--- !u!114 &429266193589955922
MonoBehaviour:
  m_ObjectHideFlags: 0
  m_CorrespondingSourceObject: {fileID: 0}
  m_PrefabInstance: {fileID: 0}
  m_PrefabAsset: {fileID: 0}
  m_GameObject: {fileID: 429266193589922387}
  m_Enabled: 1
  m_EditorHideFlags: 0
  m_Script: {fileID: 11500000, guid: 13730498fe3ba334988ec1cba988418f, type: 3}
  m_Name: 
  m_EditorClassIdentifier: 
  speedUpDown: 1
  maxMoveSpeed: 0.7
  distanceUpDown: 0.2
  distanceLeftRight: 0.1
  distanceForwardBackwards: 0.1
  rotaLimiter: 9
  isFloating: 0
  notFloatingPos: {fileID: 429266193305263216}
--- !u!1001 &429266193606852455
PrefabInstance:
  m_ObjectHideFlags: 0
  serializedVersion: 2
  m_Modification:
    m_TransformParent: {fileID: 429266193469349101}
    m_Modifications:
    - target: {fileID: 1447610124109695659, guid: 9226db53392a5fd4382976301374276d,
        type: 3}
      propertyPath: m_Name
      value: Map_Button
      objectReference: {fileID: 0}
    - target: {fileID: 1447610124109695662, guid: 9226db53392a5fd4382976301374276d,
        type: 3}
      propertyPath: m_RootOrder
      value: 7
      objectReference: {fileID: 0}
    - target: {fileID: 1447610124109695662, guid: 9226db53392a5fd4382976301374276d,
        type: 3}
      propertyPath: m_LocalPosition.x
      value: 1.0760093
      objectReference: {fileID: 0}
    - target: {fileID: 1447610124109695662, guid: 9226db53392a5fd4382976301374276d,
        type: 3}
      propertyPath: m_LocalPosition.y
      value: -4.2959137
      objectReference: {fileID: 0}
    - target: {fileID: 1447610124109695662, guid: 9226db53392a5fd4382976301374276d,
        type: 3}
      propertyPath: m_LocalPosition.z
      value: -22.866
      objectReference: {fileID: 0}
    - target: {fileID: 1447610124109695662, guid: 9226db53392a5fd4382976301374276d,
        type: 3}
      propertyPath: m_LocalRotation.w
      value: 0
      objectReference: {fileID: 0}
    - target: {fileID: 1447610124109695662, guid: 9226db53392a5fd4382976301374276d,
        type: 3}
      propertyPath: m_LocalRotation.x
      value: -0
      objectReference: {fileID: 0}
    - target: {fileID: 1447610124109695662, guid: 9226db53392a5fd4382976301374276d,
        type: 3}
      propertyPath: m_LocalRotation.y
      value: 1
      objectReference: {fileID: 0}
    - target: {fileID: 1447610124109695662, guid: 9226db53392a5fd4382976301374276d,
        type: 3}
      propertyPath: m_LocalRotation.z
      value: -0
      objectReference: {fileID: 0}
    - target: {fileID: 1447610124109695662, guid: 9226db53392a5fd4382976301374276d,
        type: 3}
      propertyPath: m_LocalEulerAnglesHint.x
      value: 0
      objectReference: {fileID: 0}
    - target: {fileID: 1447610124109695662, guid: 9226db53392a5fd4382976301374276d,
        type: 3}
      propertyPath: m_LocalEulerAnglesHint.y
      value: 180
      objectReference: {fileID: 0}
    - target: {fileID: 1447610124109695662, guid: 9226db53392a5fd4382976301374276d,
        type: 3}
      propertyPath: m_LocalEulerAnglesHint.z
      value: 0
      objectReference: {fileID: 0}
    m_RemovedComponents: []
  m_SourcePrefab: {fileID: 100100000, guid: 9226db53392a5fd4382976301374276d, type: 3}
--- !u!114 &1289154194448872910 stripped
MonoBehaviour:
  m_CorrespondingSourceObject: {fileID: 1447610124109695657, guid: 9226db53392a5fd4382976301374276d,
    type: 3}
  m_PrefabInstance: {fileID: 429266193606852455}
  m_PrefabAsset: {fileID: 0}
  m_GameObject: {fileID: 0}
  m_Enabled: 1
  m_EditorHideFlags: 0
  m_Script: {fileID: 11500000, guid: fd2912613eee9a14eab3862c1f011892, type: 3}
  m_Name: 
  m_EditorClassIdentifier: 
--- !u!4 &1289154194448872905 stripped
Transform:
  m_CorrespondingSourceObject: {fileID: 1447610124109695662, guid: 9226db53392a5fd4382976301374276d,
    type: 3}
  m_PrefabInstance: {fileID: 429266193606852455}
  m_PrefabAsset: {fileID: 0}
--- !u!1001 &429266194070791635
PrefabInstance:
  m_ObjectHideFlags: 0
  serializedVersion: 2
  m_Modification:
    m_TransformParent: {fileID: 429266193469349101}
    m_Modifications:
    - target: {fileID: 2515057412153927080, guid: 27636d52bdabbd34ab87716aa4fd1397,
        type: 3}
      propertyPath: m_Name
      value: LeverSound
      objectReference: {fileID: 0}
    - target: {fileID: 2515057412153927083, guid: 27636d52bdabbd34ab87716aa4fd1397,
        type: 3}
      propertyPath: m_RootOrder
      value: 6
      objectReference: {fileID: 0}
    - target: {fileID: 2515057412153927083, guid: 27636d52bdabbd34ab87716aa4fd1397,
        type: 3}
      propertyPath: m_LocalPosition.x
      value: 3.543
      objectReference: {fileID: 0}
    - target: {fileID: 2515057412153927083, guid: 27636d52bdabbd34ab87716aa4fd1397,
        type: 3}
      propertyPath: m_LocalPosition.y
      value: -4.32132
      objectReference: {fileID: 0}
    - target: {fileID: 2515057412153927083, guid: 27636d52bdabbd34ab87716aa4fd1397,
        type: 3}
      propertyPath: m_LocalPosition.z
      value: -22.781
      objectReference: {fileID: 0}
    - target: {fileID: 2515057412153927083, guid: 27636d52bdabbd34ab87716aa4fd1397,
        type: 3}
      propertyPath: m_LocalRotation.w
      value: 1
      objectReference: {fileID: 0}
    - target: {fileID: 2515057412153927083, guid: 27636d52bdabbd34ab87716aa4fd1397,
        type: 3}
      propertyPath: m_LocalRotation.x
      value: -0
      objectReference: {fileID: 0}
    - target: {fileID: 2515057412153927083, guid: 27636d52bdabbd34ab87716aa4fd1397,
        type: 3}
      propertyPath: m_LocalRotation.y
      value: -0
      objectReference: {fileID: 0}
    - target: {fileID: 2515057412153927083, guid: 27636d52bdabbd34ab87716aa4fd1397,
        type: 3}
      propertyPath: m_LocalRotation.z
      value: -0
      objectReference: {fileID: 0}
    - target: {fileID: 2515057412153927083, guid: 27636d52bdabbd34ab87716aa4fd1397,
        type: 3}
      propertyPath: m_LocalEulerAnglesHint.x
      value: 0
      objectReference: {fileID: 0}
    - target: {fileID: 2515057412153927083, guid: 27636d52bdabbd34ab87716aa4fd1397,
        type: 3}
      propertyPath: m_LocalEulerAnglesHint.y
      value: 0
      objectReference: {fileID: 0}
    - target: {fileID: 2515057412153927083, guid: 27636d52bdabbd34ab87716aa4fd1397,
        type: 3}
      propertyPath: m_LocalEulerAnglesHint.z
      value: 0
      objectReference: {fileID: 0}
    m_RemovedComponents: []
  m_SourcePrefab: {fileID: 100100000, guid: 27636d52bdabbd34ab87716aa4fd1397, type: 3}
--- !u!4 &2815392089574572152 stripped
Transform:
  m_CorrespondingSourceObject: {fileID: 2515057412153927083, guid: 27636d52bdabbd34ab87716aa4fd1397,
    type: 3}
  m_PrefabInstance: {fileID: 429266194070791635}
  m_PrefabAsset: {fileID: 0}
--- !u!114 &2815392089574572153 stripped
MonoBehaviour:
  m_CorrespondingSourceObject: {fileID: 2515057412153927082, guid: 27636d52bdabbd34ab87716aa4fd1397,
    type: 3}
  m_PrefabInstance: {fileID: 429266194070791635}
  m_PrefabAsset: {fileID: 0}
  m_GameObject: {fileID: 0}
  m_Enabled: 1
  m_EditorHideFlags: 0
  m_Script: {fileID: 11500000, guid: bca2147f98306d148bb949dbee4b4606, type: 3}
  m_Name: 
  m_EditorClassIdentifier: 
--- !u!1001 &429266194774359911
PrefabInstance:
  m_ObjectHideFlags: 0
  serializedVersion: 2
  m_Modification:
    m_TransformParent: {fileID: 429266193469349101}
    m_Modifications:
    - target: {fileID: 2515057412153927080, guid: 27636d52bdabbd34ab87716aa4fd1397,
        type: 3}
      propertyPath: m_Name
      value: LeverMagnet
      objectReference: {fileID: 0}
    - target: {fileID: 2515057412153927083, guid: 27636d52bdabbd34ab87716aa4fd1397,
        type: 3}
      propertyPath: m_RootOrder
      value: 5
      objectReference: {fileID: 0}
    - target: {fileID: 2515057412153927083, guid: 27636d52bdabbd34ab87716aa4fd1397,
        type: 3}
      propertyPath: m_LocalPosition.x
      value: 4.1462083
      objectReference: {fileID: 0}
    - target: {fileID: 2515057412153927083, guid: 27636d52bdabbd34ab87716aa4fd1397,
        type: 3}
      propertyPath: m_LocalPosition.y
      value: -4.32132
      objectReference: {fileID: 0}
    - target: {fileID: 2515057412153927083, guid: 27636d52bdabbd34ab87716aa4fd1397,
        type: 3}
      propertyPath: m_LocalPosition.z
      value: -22.781
      objectReference: {fileID: 0}
    - target: {fileID: 2515057412153927083, guid: 27636d52bdabbd34ab87716aa4fd1397,
        type: 3}
      propertyPath: m_LocalRotation.w
      value: 1
      objectReference: {fileID: 0}
    - target: {fileID: 2515057412153927083, guid: 27636d52bdabbd34ab87716aa4fd1397,
        type: 3}
      propertyPath: m_LocalRotation.x
      value: -0
      objectReference: {fileID: 0}
    - target: {fileID: 2515057412153927083, guid: 27636d52bdabbd34ab87716aa4fd1397,
        type: 3}
      propertyPath: m_LocalRotation.y
      value: -0
      objectReference: {fileID: 0}
    - target: {fileID: 2515057412153927083, guid: 27636d52bdabbd34ab87716aa4fd1397,
        type: 3}
      propertyPath: m_LocalRotation.z
      value: -0
      objectReference: {fileID: 0}
    - target: {fileID: 2515057412153927083, guid: 27636d52bdabbd34ab87716aa4fd1397,
        type: 3}
      propertyPath: m_LocalEulerAnglesHint.x
      value: 0
      objectReference: {fileID: 0}
    - target: {fileID: 2515057412153927083, guid: 27636d52bdabbd34ab87716aa4fd1397,
        type: 3}
      propertyPath: m_LocalEulerAnglesHint.y
      value: 0
      objectReference: {fileID: 0}
    - target: {fileID: 2515057412153927083, guid: 27636d52bdabbd34ab87716aa4fd1397,
        type: 3}
      propertyPath: m_LocalEulerAnglesHint.z
      value: 0
      objectReference: {fileID: 0}
    m_RemovedComponents: []
  m_SourcePrefab: {fileID: 100100000, guid: 27636d52bdabbd34ab87716aa4fd1397, type: 3}
--- !u!4 &2815392090014227148 stripped
Transform:
  m_CorrespondingSourceObject: {fileID: 2515057412153927083, guid: 27636d52bdabbd34ab87716aa4fd1397,
    type: 3}
  m_PrefabInstance: {fileID: 429266194774359911}
  m_PrefabAsset: {fileID: 0}
--- !u!114 &2815392090014227149 stripped
MonoBehaviour:
  m_CorrespondingSourceObject: {fileID: 2515057412153927082, guid: 27636d52bdabbd34ab87716aa4fd1397,
    type: 3}
  m_PrefabInstance: {fileID: 429266194774359911}
  m_PrefabAsset: {fileID: 0}
  m_GameObject: {fileID: 0}
  m_Enabled: 1
  m_EditorHideFlags: 0
  m_Script: {fileID: 11500000, guid: bca2147f98306d148bb949dbee4b4606, type: 3}
  m_Name: 
  m_EditorClassIdentifier: 
