%YAML 1.1
%TAG !u! tag:unity3d.com,2011:
--- !u!30 &1
GraphicsSettings:
  m_ObjectHideFlags: 0
  serializedVersion: 15
  m_Deferred:
    m_Mode: 2
    m_Shader: {fileID: 4800000, guid: 75b6ab6746adb0c4199be0e23cb185a7, type: 3}
  m_DeferredReflections:
    m_Mode: 2
    m_Shader: {fileID: 4800000, guid: 0fc39d9405f252340b78a7b38be6fa77, type: 3}
  m_ScreenSpaceShadows:
    m_Mode: 2
    m_Shader: {fileID: 4800000, guid: d42da1e69d53bc044ad4a55ce9a410c1, type: 3}
  m_DepthNormals:
    m_Mode: 1
    m_Shader: {fileID: 62, guid: 0000000000000000f000000000000000, type: 0}
  m_MotionVectors:
    m_Mode: 1
    m_Shader: {fileID: 75, guid: 0000000000000000f000000000000000, type: 0}
  m_LightHalo:
    m_Mode: 1
    m_Shader: {fileID: 105, guid: 0000000000000000f000000000000000, type: 0}
  m_LensFlare:
    m_Mode: 1
    m_Shader: {fileID: 102, guid: 0000000000000000f000000000000000, type: 0}
  m_VideoShadersIncludeMode: 2
  m_AlwaysIncludedShaders:
  - {fileID: 7, guid: 0000000000000000f000000000000000, type: 0}
  - {fileID: 15104, guid: 0000000000000000f000000000000000, type: 0}
  - {fileID: 15105, guid: 0000000000000000f000000000000000, type: 0}
  - {fileID: 15106, guid: 0000000000000000f000000000000000, type: 0}
  - {fileID: 10753, guid: 0000000000000000f000000000000000, type: 0}
  - {fileID: 10770, guid: 0000000000000000f000000000000000, type: 0}
  - {fileID: 10783, guid: 0000000000000000f000000000000000, type: 0}
  - {fileID: 16000, guid: 0000000000000000f000000000000000, type: 0}
  - {fileID: 17000, guid: 0000000000000000f000000000000000, type: 0}
  - {fileID: 16001, guid: 0000000000000000f000000000000000, type: 0}
  - {fileID: 4800000, guid: c1279a2fad1b93c4d8b5f3922dc18d8e, type: 3}
  - {fileID: 4800000, guid: 0fc39d9405f252340b78a7b38be6fa77, type: 3}
  - {fileID: 4800000, guid: 43fb42e45c70b9549a984520f5d8dad2, type: 3}
  - {fileID: 4800000, guid: acaefa2af7a9c974faf5968249ee0e64, type: 3}
  - {fileID: 4800000, guid: 4b7de004e50a1784595cce21f3d2a5f6, type: 3}
  m_PreloadedShaders:
  - {fileID: 20000000, guid: 865e472bf34b76341a52ee7a84fd8e54, type: 2}
  m_PreloadShadersBatchTimeLimit: -1
  m_SpritesDefaultMaterial: {fileID: 10754, guid: 0000000000000000f000000000000000,
    type: 0}
  m_CustomRenderPipeline: {fileID: 0}
  m_TransparencySortMode: 0
  m_TransparencySortAxis: {x: 0, y: 0, z: 1}
  m_DefaultRenderingPath: 1
  m_DefaultMobileRenderingPath: 1
  m_TierSettings:
  - serializedVersion: 5
    m_BuildTarget: 1
    m_Tier: 1
    m_Settings:
      standardShaderQuality: 2
      renderingPath: 3
      hdrMode: 1
      realtimeGICPUUsage: 25
      useReflectionProbeBoxProjection: 1
      useReflectionProbeBlending: 0
      useHDR: 1
      useDetailNormalMap: 0
      useCascadedShadowMaps: 1
      prefer32BitShadowMaps: 1
      enableLPPV: 0
      useDitherMaskForAlphaBlendedShadows: 0
    m_Automatic: 0
  - serializedVersion: 5
    m_BuildTarget: 1
    m_Tier: 0
    m_Settings:
      standardShaderQuality: 2
      renderingPath: 3
      hdrMode: 1
      realtimeGICPUUsage: 25
      useReflectionProbeBoxProjection: 1
      useReflectionProbeBlending: 0
      useHDR: 1
      useDetailNormalMap: 0
      useCascadedShadowMaps: 1
      prefer32BitShadowMaps: 1
      enableLPPV: 0
      useDitherMaskForAlphaBlendedShadows: 0
    m_Automatic: 0
  - serializedVersion: 5
    m_BuildTarget: 1
    m_Tier: 2
    m_Settings:
      standardShaderQuality: 2
      renderingPath: 3
      hdrMode: 1
      realtimeGICPUUsage: 25
      useReflectionProbeBoxProjection: 1
      useReflectionProbeBlending: 0
      useHDR: 1
      useDetailNormalMap: 0
      useCascadedShadowMaps: 1
      prefer32BitShadowMaps: 1
      enableLPPV: 0
      useDitherMaskForAlphaBlendedShadows: 0
    m_Automatic: 0
  m_LightmapStripping: 1
  m_FogStripping: 1
  m_InstancingStripping: 0
  m_BrgStripping: 0
  m_LightmapKeepPlain: 1
  m_LightmapKeepDirCombined: 1
  m_LightmapKeepDynamicPlain: 0
  m_LightmapKeepDynamicDirCombined: 0
  m_LightmapKeepShadowMask: 0
  m_LightmapKeepSubtractive: 0
  m_FogKeepLinear: 1
  m_FogKeepExp: 1
  m_FogKeepExp2: 0
  m_AlbedoSwatchInfos: []
  m_LightsUseLinearIntensity: 0
  m_LightsUseColorTemperature: 0
  m_DefaultRenderingLayerMask: 1
  m_LogWhenShaderIsCompiled: 0
  m_SRPDefaultSettings: {}
  m_LightProbeOutsideHullStrategy: 0
  m_CameraRelativeLightCulling: 0
  m_CameraRelativeShadowCulling: 0
