%YAML 1.1
%TAG !u! tag:unity3d.com,2011:
--- !u!1 &5398215193174721595
GameObject:
  m_ObjectHideFlags: 0
  m_CorrespondingSourceObject: {fileID: 0}
  m_PrefabInstance: {fileID: 0}
  m_PrefabAsset: {fileID: 0}
  serializedVersion: 6
  m_Component:
  - component: {fileID: 5398215193174721596}
  - component: {fileID: 5398215193174721597}
  m_Layer: 0
  m_Name: Event_106_Victim
  m_TagString: Untagged
  m_Icon: {fileID: 0}
  m_NavMeshLayer: 0
  m_StaticEditorFlags: 0
  m_IsActive: 1
--- !u!4 &5398215193174721596
Transform:
  m_ObjectHideFlags: 0
  m_CorrespondingSourceObject: {fileID: 0}
  m_PrefabInstance: {fileID: 0}
  m_PrefabAsset: {fileID: 0}
  m_GameObject: {fileID: 5398215193174721595}
  m_LocalRotation: {x: 0, y: 0, z: 0, w: 1}
  m_LocalPosition: {x: 0, y: 0, z: 0}
  m_LocalScale: {x: 1, y: 1, z: 1}
  m_Children:
  - {fileID: 5398215193193215030}
  - {fileID: 493225638939925191}
  m_Father: {fileID: 0}
  m_RootOrder: 0
  m_LocalEulerAnglesHint: {x: 0, y: 0, z: 0}
--- !u!114 &5398215193174721597
MonoBehaviour:
  m_ObjectHideFlags: 0
  m_CorrespondingSourceObject: {fileID: 0}
  m_PrefabInstance: {fileID: 0}
  m_PrefabAsset: {fileID: 0}
  m_GameObject: {fileID: 5398215193174721595}
  m_Enabled: 1
  m_EditorHideFlags: 0
  m_Script: {fileID: 11500000, guid: a1a73358c9695be4fa728913b69caa32, type: 3}
  m_Name: 
  m_EditorClassIdentifier: 
  isStarted: 0
  x: 0
  y: 0
  state: 0
  decal: {fileID: 5398215193193215030}
  victim: {fileID: 7189571494447744520}
  hit: {fileID: 8300000, guid: dc2359b8253e65646972fb12186a92b5, type: 3}
  corrosion: {fileID: 8300000, guid: 974341061de48804f8671eb1a83a8541, type: 3}
  horror: {fileID: 8300000, guid: d138ec7688e420d47b5c9d34c91015ba, type: 3}
--- !u!1 &5398215193193215029
GameObject:
  m_ObjectHideFlags: 0
  m_CorrespondingSourceObject: {fileID: 0}
  m_PrefabInstance: {fileID: 0}
  m_PrefabAsset: {fileID: 0}
  serializedVersion: 6
  m_Component:
  - component: {fileID: 5398215193193215030}
  m_Layer: 0
  m_Name: decal
  m_TagString: Untagged
  m_Icon: {fileID: 0}
  m_NavMeshLayer: 0
  m_StaticEditorFlags: 0
  m_IsActive: 1
--- !u!4 &5398215193193215030
Transform:
  m_ObjectHideFlags: 0
  m_CorrespondingSourceObject: {fileID: 0}
  m_PrefabInstance: {fileID: 0}
  m_PrefabAsset: {fileID: 0}
  m_GameObject: {fileID: 5398215193193215029}
  m_LocalRotation: {x: 1, y: 0, z: 0, w: 0}
  m_LocalPosition: {x: 0, y: 6.033, z: 0}
  m_LocalScale: {x: 1, y: 1, z: 1}
  m_Children: []
  m_Father: {fileID: 5398215193174721596}
  m_RootOrder: 0
  m_LocalEulerAnglesHint: {x: 180, y: 0, z: 0}
--- !u!1001 &5398215193988790267
PrefabInstance:
  m_ObjectHideFlags: 0
  serializedVersion: 2
  m_Modification:
    m_TransformParent: {fileID: 5398215193174721596}
    m_Modifications:
    - target: {fileID: 2966795941245645299, guid: a2f6365f6e8f4c841a3e76b9db2bf55e,
        type: 3}
      propertyPath: Gravity
      value: 6
      objectReference: {fileID: 0}
    - target: {fileID: 3759828465966539633, guid: a2f6365f6e8f4c841a3e76b9db2bf55e,
        type: 3}
      propertyPath: segments.Array.data[0].responsiveness
      value: 0
      objectReference: {fileID: 0}
    - target: {fileID: 3759828465966539633, guid: a2f6365f6e8f4c841a3e76b9db2bf55e,
        type: 3}
      propertyPath: segments.Array.data[1].responsiveness
      value: 0
      objectReference: {fileID: 0}
    - target: {fileID: 5459058066096163281, guid: a2f6365f6e8f4c841a3e76b9db2bf55e,
        type: 3}
      propertyPath: m_Materials.Array.data[0]
      value: 
      objectReference: {fileID: 2100000, guid: 12acaf15eb5e14544a3380f2d73ad04c, type: 2}
    - target: {fileID: 5459058066096163281, guid: a2f6365f6e8f4c841a3e76b9db2bf55e,
        type: 3}
      propertyPath: m_Materials.Array.data[1]
      value: 
      objectReference: {fileID: 2100000, guid: 12acaf15eb5e14544a3380f2d73ad04c, type: 2}
    - target: {fileID: 5490479503588224316, guid: a2f6365f6e8f4c841a3e76b9db2bf55e,
        type: 3}
      propertyPath: m_RootOrder
      value: 1
      objectReference: {fileID: 0}
    - target: {fileID: 5490479503588224316, guid: a2f6365f6e8f4c841a3e76b9db2bf55e,
        type: 3}
      propertyPath: m_LocalPosition.x
      value: 0
      objectReference: {fileID: 0}
    - target: {fileID: 5490479503588224316, guid: a2f6365f6e8f4c841a3e76b9db2bf55e,
        type: 3}
      propertyPath: m_LocalPosition.y
      value: 8.045
      objectReference: {fileID: 0}
    - target: {fileID: 5490479503588224316, guid: a2f6365f6e8f4c841a3e76b9db2bf55e,
        type: 3}
      propertyPath: m_LocalPosition.z
      value: 0
      objectReference: {fileID: 0}
    - target: {fileID: 5490479503588224316, guid: a2f6365f6e8f4c841a3e76b9db2bf55e,
        type: 3}
      propertyPath: m_LocalRotation.w
      value: 1
      objectReference: {fileID: 0}
    - target: {fileID: 5490479503588224316, guid: a2f6365f6e8f4c841a3e76b9db2bf55e,
        type: 3}
      propertyPath: m_LocalRotation.x
      value: -0
      objectReference: {fileID: 0}
    - target: {fileID: 5490479503588224316, guid: a2f6365f6e8f4c841a3e76b9db2bf55e,
        type: 3}
      propertyPath: m_LocalRotation.y
      value: -0
      objectReference: {fileID: 0}
    - target: {fileID: 5490479503588224316, guid: a2f6365f6e8f4c841a3e76b9db2bf55e,
        type: 3}
      propertyPath: m_LocalRotation.z
      value: -0
      objectReference: {fileID: 0}
    - target: {fileID: 5490479503588224316, guid: a2f6365f6e8f4c841a3e76b9db2bf55e,
        type: 3}
      propertyPath: m_LocalEulerAnglesHint.x
      value: 0
      objectReference: {fileID: 0}
    - target: {fileID: 5490479503588224316, guid: a2f6365f6e8f4c841a3e76b9db2bf55e,
        type: 3}
      propertyPath: m_LocalEulerAnglesHint.y
      value: 0
      objectReference: {fileID: 0}
    - target: {fileID: 5490479503588224316, guid: a2f6365f6e8f4c841a3e76b9db2bf55e,
        type: 3}
      propertyPath: m_LocalEulerAnglesHint.z
      value: 0
      objectReference: {fileID: 0}
    - target: {fileID: 8027007907175263004, guid: a2f6365f6e8f4c841a3e76b9db2bf55e,
        type: 3}
      propertyPath: m_Materials.Array.data[0]
      value: 
      objectReference: {fileID: 2100000, guid: 12acaf15eb5e14544a3380f2d73ad04c, type: 2}
    - target: {fileID: 8237749848068822969, guid: a2f6365f6e8f4c841a3e76b9db2bf55e,
        type: 3}
      propertyPath: m_Name
      value: Puppet_Human
      objectReference: {fileID: 0}
    - target: {fileID: 8237749848068822969, guid: a2f6365f6e8f4c841a3e76b9db2bf55e,
        type: 3}
      propertyPath: m_IsActive
      value: 0
      objectReference: {fileID: 0}
    m_RemovedComponents: []
  m_SourcePrefab: {fileID: 100100000, guid: a2f6365f6e8f4c841a3e76b9db2bf55e, type: 3}
--- !u!4 &493225638939925191 stripped
Transform:
  m_CorrespondingSourceObject: {fileID: 5490479503588224316, guid: a2f6365f6e8f4c841a3e76b9db2bf55e,
    type: 3}
  m_PrefabInstance: {fileID: 5398215193988790267}
  m_PrefabAsset: {fileID: 0}
--- !u!114 &7189571494447744520 stripped
MonoBehaviour:
  m_CorrespondingSourceObject: {fileID: 2966795941245645299, guid: a2f6365f6e8f4c841a3e76b9db2bf55e,
    type: 3}
  m_PrefabInstance: {fileID: 5398215193988790267}
  m_PrefabAsset: {fileID: 0}
  m_GameObject: {fileID: 0}
  m_Enabled: 1
  m_EditorHideFlags: 0
  m_Script: {fileID: 11500000, guid: 7c324e6716888544da1e863b7deecaa3, type: 3}
  m_Name: 
  m_EditorClassIdentifier: 
