%YAML 1.1
%TAG !u! tag:unity3d.com,2011:
--- !u!1 &470470467224064067
GameObject:
  m_ObjectHideFlags: 0
  m_CorrespondingSourceObject: {fileID: 0}
  m_PrefabInstance: {fileID: 0}
  m_PrefabAsset: {fileID: 0}
  serializedVersion: 6
  m_Component:
  - component: {fileID: 2744289491228237086}
  m_Layer: 0
  m_Name: Spawn
  m_TagString: Untagged
  m_Icon: {fileID: 0}
  m_NavMeshLayer: 0
  m_StaticEditorFlags: 0
  m_IsActive: 1
--- !u!4 &2744289491228237086
Transform:
  m_ObjectHideFlags: 0
  m_CorrespondingSourceObject: {fileID: 0}
  m_PrefabInstance: {fileID: 0}
  m_PrefabAsset: {fileID: 0}
  m_GameObject: {fileID: 470470467224064067}
  m_LocalRotation: {x: 0, y: 0, z: 0, w: 1}
  m_LocalPosition: {x: 4.52, y: 0, z: -5.85}
  m_LocalScale: {x: 1, y: 1, z: 1}
  m_Children: []
  m_Father: {fileID: 665723464858488862}
  m_RootOrder: 9
  m_LocalEulerAnglesHint: {x: 0, y: 0, z: 0}
--- !u!1 &665723464858979390
GameObject:
  m_ObjectHideFlags: 0
  m_CorrespondingSourceObject: {fileID: 0}
  m_PrefabInstance: {fileID: 0}
  m_PrefabAsset: {fileID: 0}
  serializedVersion: 6
  m_Component:
  - component: {fileID: 665723464858488862}
  - component: {fileID: 1759887808494466870}
  - component: {fileID: 3791452270587978235}
  - component: {fileID: 7576356964475866705}
  m_Layer: 0
  m_Name: Light_2-Way_TESTROOM
  m_TagString: Untagged
  m_Icon: {fileID: 0}
  m_NavMeshLayer: 0
  m_StaticEditorFlags: 0
  m_IsActive: 1
--- !u!4 &665723464858488862
Transform:
  m_ObjectHideFlags: 0
  m_CorrespondingSourceObject: {fileID: 0}
  m_PrefabInstance: {fileID: 0}
  m_PrefabAsset: {fileID: 0}
  m_GameObject: {fileID: 665723464858979390}
  m_LocalRotation: {x: 0, y: 0, z: 0, w: 1}
  m_LocalPosition: {x: 0, y: 0, z: 0}
  m_LocalScale: {x: 1, y: 1, z: 1}
  m_Children:
  - {fileID: 5910119540929638222}
  - {fileID: 2575777248385470309}
  - {fileID: 4287557137592332583}
  - {fileID: 7393192326872207321}
  - {fileID: 7393192326741796401}
  - {fileID: 3851281905621517977}
  - {fileID: 2433947104858234657}
  - {fileID: 1392386346384554269}
  - {fileID: 7917992429938030936}
  - {fileID: 2744289491228237086}
  m_Father: {fileID: 0}
  m_RootOrder: 0
  m_LocalEulerAnglesHint: {x: 0, y: 0, z: 0}
--- !u!114 &1759887808494466870
MonoBehaviour:
  m_ObjectHideFlags: 0
  m_CorrespondingSourceObject: {fileID: 0}
  m_PrefabInstance: {fileID: 0}
  m_PrefabAsset: {fileID: 0}
  m_GameObject: {fileID: 665723464858979390}
  m_Enabled: 1
  m_EditorHideFlags: 0
  m_Script: {fileID: 11500000, guid: 2244201d5ad243e4a9c5a3705c01d400, type: 3}
  m_Name: 
  m_EditorClassIdentifier: 
  EventList: []
  UniqueHandler: Event_173testroom
  Spawned: 0
  SpecialName: testroom_173
  UniquePos: {fileID: 0}
  EventChosen: 0
--- !u!114 &3791452270587978235
MonoBehaviour:
  m_ObjectHideFlags: 0
  m_CorrespondingSourceObject: {fileID: 0}
  m_PrefabInstance: {fileID: 0}
  m_PrefabAsset: {fileID: 0}
  m_GameObject: {fileID: 665723464858979390}
  m_Enabled: 1
  m_EditorHideFlags: 0
  m_Script: {fileID: 11500000, guid: 6215951d905737c4bb517c7925091a74, type: 3}
  m_Name: 
  m_EditorClassIdentifier: 
  table:
  - items:
    - Spawn: {fileID: 11400000, guid: d68bd58e8715013468aad9d947b760e0, type: 2}
      SpawnName: 
      Rate: 100
  - items:
    - Spawn: {fileID: 11400000, guid: 375f6a1ef6ad03a41ab36a43972d74e4, type: 2}
      SpawnName: 
      Rate: 100
  - items:
    - Spawn: {fileID: 11400000, guid: 30caa0a4dfff0b24db46784dcbb0a316, type: 2}
      SpawnName: 
      Rate: 100
  positions:
  - {fileID: 3851281905621517977}
  - {fileID: 2433947104858234657}
  - {fileID: 1392386346384554269}
--- !u!114 &7576356964475866705
MonoBehaviour:
  m_ObjectHideFlags: 0
  m_CorrespondingSourceObject: {fileID: 0}
  m_PrefabInstance: {fileID: 0}
  m_PrefabAsset: {fileID: 0}
  m_GameObject: {fileID: 665723464858979390}
  m_Enabled: 1
  m_EditorHideFlags: 0
  m_Script: {fileID: 11500000, guid: 8d9f07e349283d0419aa34d36023dc38, type: 3}
  m_Name: 
  m_EditorClassIdentifier: 
  Room: {fileID: 6970373209188848442}
  Lights: {fileID: 5191710160486912509}
  Probes: {fileID: 4772653287942703225}
  cutsceneReferences: []
  spawn: {fileID: 470470467224064067}
--- !u!1 &2523712828639487511
GameObject:
  m_ObjectHideFlags: 0
  m_CorrespondingSourceObject: {fileID: 0}
  m_PrefabInstance: {fileID: 0}
  m_PrefabAsset: {fileID: 0}
  serializedVersion: 6
  m_Component:
  - component: {fileID: 5910119540929638222}
  - component: {fileID: 6528562002447474263}
  m_Layer: 0
  m_Name: NavMesh Surface
  m_TagString: Untagged
  m_Icon: {fileID: 0}
  m_NavMeshLayer: 0
  m_StaticEditorFlags: 0
  m_IsActive: 1
--- !u!4 &5910119540929638222
Transform:
  m_ObjectHideFlags: 0
  m_CorrespondingSourceObject: {fileID: 0}
  m_PrefabInstance: {fileID: 0}
  m_PrefabAsset: {fileID: 0}
  m_GameObject: {fileID: 2523712828639487511}
  m_LocalRotation: {x: -0, y: -0, z: -0, w: 1}
  m_LocalPosition: {x: 0, y: 0, z: 0}
  m_LocalScale: {x: 1, y: 1, z: 1}
  m_Children:
  - {fileID: 6970373209189142298}
  - {fileID: 7488228440566210837}
  m_Father: {fileID: 665723464858488862}
  m_RootOrder: 0
  m_LocalEulerAnglesHint: {x: 0, y: 0, z: 0}
--- !u!114 &6528562002447474263
MonoBehaviour:
  m_ObjectHideFlags: 0
  m_CorrespondingSourceObject: {fileID: 0}
  m_PrefabInstance: {fileID: 0}
  m_PrefabAsset: {fileID: 0}
  m_GameObject: {fileID: 2523712828639487511}
  m_Enabled: 1
  m_EditorHideFlags: 0
  m_Script: {fileID: 11500000, guid: 7a5ac11cc976e418e8d13136b07e1f52, type: 3}
  m_Name: 
  m_EditorClassIdentifier: 
  m_AgentTypeID: 0
  m_CollectObjects: 2
  m_Size: {x: 10, y: 10, z: 10}
  m_Center: {x: 0, y: 2, z: 0}
  m_LayerMask:
    serializedVersion: 2
    m_Bits: 4294967295
  m_UseGeometry: 1
  m_DefaultArea: 0
  m_IgnoreNavMeshAgent: 1
  m_IgnoreNavMeshObstacle: 1
  m_OverrideTileSize: 0
  m_TileSize: 256
  m_OverrideVoxelSize: 0
  m_VoxelSize: 0.13333334
  m_MinRegionArea: 2
  m_NavMeshData: {fileID: 23800000, guid: 0e152ac67fac4a94cb53d9c88384115e, type: 2}
  m_BuildHeightMesh: 0
--- !u!1 &2715894659229993063
GameObject:
  m_ObjectHideFlags: 0
  m_CorrespondingSourceObject: {fileID: 0}
  m_PrefabInstance: {fileID: 0}
  m_PrefabAsset: {fileID: 0}
  serializedVersion: 6
  m_Component:
  - component: {fileID: 7917992429938030936}
  - component: {fileID: 5475648310656768968}
  m_Layer: 13
  m_Name: Cube
  m_TagString: Scramble
  m_Icon: {fileID: 0}
  m_NavMeshLayer: 0
  m_StaticEditorFlags: 0
  m_IsActive: 1
--- !u!4 &7917992429938030936
Transform:
  m_ObjectHideFlags: 0
  m_CorrespondingSourceObject: {fileID: 0}
  m_PrefabInstance: {fileID: 0}
  m_PrefabAsset: {fileID: 0}
  m_GameObject: {fileID: 2715894659229993063}
  m_LocalRotation: {x: 0, y: 0, z: 0, w: 1}
  m_LocalPosition: {x: 5.28, y: 0.446, z: 5.216}
  m_LocalScale: {x: 1, y: 1, z: 1}
  m_Children: []
  m_Father: {fileID: 665723464858488862}
  m_RootOrder: 8
  m_LocalEulerAnglesHint: {x: 0, y: 0, z: 0}
--- !u!65 &5475648310656768968
BoxCollider:
  m_ObjectHideFlags: 0
  m_CorrespondingSourceObject: {fileID: 0}
  m_PrefabInstance: {fileID: 0}
  m_PrefabAsset: {fileID: 0}
  m_GameObject: {fileID: 2715894659229993063}
  m_Material: {fileID: 0}
  m_IsTrigger: 0
  m_Enabled: 1
  serializedVersion: 2
  m_Size: {x: 5.464193, y: 3.0715709, z: 6.083689}
  m_Center: {x: -0.42789102, y: 1.0357854, z: -0.3600099}
--- !u!1 &3272880054832835836
GameObject:
  m_ObjectHideFlags: 0
  m_CorrespondingSourceObject: {fileID: 0}
  m_PrefabInstance: {fileID: 0}
  m_PrefabAsset: {fileID: 0}
  serializedVersion: 6
  m_Component:
  - component: {fileID: 3851281905621517977}
  m_Layer: 0
  m_Name: itemSpawn
  m_TagString: Untagged
  m_Icon: {fileID: 0}
  m_NavMeshLayer: 0
  m_StaticEditorFlags: 0
  m_IsActive: 1
--- !u!4 &3851281905621517977
Transform:
  m_ObjectHideFlags: 0
  m_CorrespondingSourceObject: {fileID: 0}
  m_PrefabInstance: {fileID: 0}
  m_PrefabAsset: {fileID: 0}
  m_GameObject: {fileID: 3272880054832835836}
  m_LocalRotation: {x: -0, y: -0, z: -0, w: 1}
  m_LocalPosition: {x: 2.499, y: 0.899, z: -0.383}
  m_LocalScale: {x: 1, y: 1, z: 1}
  m_Children: []
  m_Father: {fileID: 665723464858488862}
  m_RootOrder: 5
  m_LocalEulerAnglesHint: {x: 0, y: 0, z: 0}
--- !u!1 &4030896016520779727
GameObject:
  m_ObjectHideFlags: 0
  m_CorrespondingSourceObject: {fileID: 0}
  m_PrefabInstance: {fileID: 0}
  m_PrefabAsset: {fileID: 0}
  serializedVersion: 6
  m_Component:
  - component: {fileID: 4030896016520779712}
  - component: {fileID: 4030896016520779713}
  - component: {fileID: 8404110178304104751}
  m_Layer: 0
  m_Name: Reflection Probe (1)
  m_TagString: Untagged
  m_Icon: {fileID: 0}
  m_NavMeshLayer: 0
  m_StaticEditorFlags: 0
  m_IsActive: 1
--- !u!4 &4030896016520779712
Transform:
  m_ObjectHideFlags: 0
  m_CorrespondingSourceObject: {fileID: 0}
  m_PrefabInstance: {fileID: 0}
  m_PrefabAsset: {fileID: 0}
  m_GameObject: {fileID: 4030896016520779727}
  m_LocalRotation: {x: -0, y: -0, z: -0, w: 1}
  m_LocalPosition: {x: 4.69, y: 1.11, z: -4.62}
  m_LocalScale: {x: 1, y: 1, z: 1}
  m_Children: []
  m_Father: {fileID: 4287557137592332583}
  m_RootOrder: 1
  m_LocalEulerAnglesHint: {x: 0, y: 0, z: 0}
--- !u!215 &4030896016520779713
ReflectionProbe:
  m_ObjectHideFlags: 0
  m_CorrespondingSourceObject: {fileID: 0}
  m_PrefabInstance: {fileID: 0}
  m_PrefabAsset: {fileID: 0}
  m_GameObject: {fileID: 4030896016520779727}
  m_Enabled: 1
  serializedVersion: 2
  m_Type: 0
  m_Mode: 1
  m_RefreshMode: 2
  m_TimeSlicingMode: 1
  m_Resolution: 64
  m_UpdateFrequency: 0
  m_BoxSize: {x: 5.788157, y: 3.0216684, z: 3.8385692}
  m_BoxOffset: {x: 0.047363043, y: 0.3354059, z: -0.19407344}
  m_NearClip: 0.3
  m_FarClip: 100
  m_ShadowDistance: 0
  m_ClearFlags: 1
  m_BackGroundColor: {r: 0, g: 0, b: 0, a: 0}
  m_CullingMask:
    serializedVersion: 2
    m_Bits: 16495927
  m_IntensityMultiplier: 1
  m_BlendDistance: 0.5
  m_HDR: 1
  m_BoxProjection: 1
  m_RenderDynamicObjects: 0
  m_UseOcclusionCulling: 0
  m_Importance: 1
  m_CustomBakedTexture: {fileID: 0}
--- !u!114 &8404110178304104751
MonoBehaviour:
  m_ObjectHideFlags: 0
  m_CorrespondingSourceObject: {fileID: 0}
  m_PrefabInstance: {fileID: 0}
  m_PrefabAsset: {fileID: 0}
  m_GameObject: {fileID: 4030896016520779727}
  m_Enabled: 1
  m_EditorHideFlags: 0
  m_Script: {fileID: 11500000, guid: ecff7081915771c499a1aebc0ba57a2f, type: 3}
  m_Name: 
  m_EditorClassIdentifier: 
  angle: -2
--- !u!1 &4030896017479832093
GameObject:
  m_ObjectHideFlags: 0
  m_CorrespondingSourceObject: {fileID: 0}
  m_PrefabInstance: {fileID: 0}
  m_PrefabAsset: {fileID: 0}
  serializedVersion: 6
  m_Component:
  - component: {fileID: 4030896017479832094}
  - component: {fileID: 4030896017479832095}
  m_Layer: 0
  m_Name: Point Light (4)
  m_TagString: Untagged
  m_Icon: {fileID: 0}
  m_NavMeshLayer: 0
  m_StaticEditorFlags: 0
  m_IsActive: 1
--- !u!4 &4030896017479832094
Transform:
  m_ObjectHideFlags: 0
  m_CorrespondingSourceObject: {fileID: 0}
  m_PrefabInstance: {fileID: 0}
  m_PrefabAsset: {fileID: 0}
  m_GameObject: {fileID: 4030896017479832093}
  m_LocalRotation: {x: -0, y: -0, z: -0, w: 1}
  m_LocalPosition: {x: 2.875, y: 2.655, z: 0.323}
  m_LocalScale: {x: 1, y: 1, z: 1}
  m_Children: []
  m_Father: {fileID: 2575777248385470309}
  m_RootOrder: 0
  m_LocalEulerAnglesHint: {x: 0, y: 0, z: 0}
--- !u!108 &4030896017479832095
Light:
  m_ObjectHideFlags: 0
  m_CorrespondingSourceObject: {fileID: 0}
  m_PrefabInstance: {fileID: 0}
  m_PrefabAsset: {fileID: 0}
  m_GameObject: {fileID: 4030896017479832093}
  m_Enabled: 1
  serializedVersion: 10
  m_Type: 2
  m_Shape: 0
  m_Color: {r: 1, g: 1, b: 1, a: 1}
  m_Intensity: 4.73
  m_Range: 7.122509
  m_SpotAngle: 30
  m_InnerSpotAngle: 21.80208
  m_CookieSize: 10
  m_Shadows:
    m_Type: 1
    m_Resolution: -1
    m_CustomResolution: -1
    m_Strength: 1
    m_Bias: 0.05
    m_NormalBias: 0.4
    m_NearPlane: 0.2
    m_CullingMatrixOverride:
      e00: 1
      e01: 0
      e02: 0
      e03: 0
      e10: 0
      e11: 1
      e12: 0
      e13: 0
      e20: 0
      e21: 0
      e22: 1
      e23: 0
      e30: 0
      e31: 0
      e32: 0
      e33: 1
    m_UseCullingMatrixOverride: 0
  m_Cookie: {fileID: 8900000, guid: bb0be0108583003469a7044f10aad058, type: 2}
  m_DrawHalo: 0
  m_Flare: {fileID: 0}
  m_RenderMode: 1
  m_CullingMask:
    serializedVersion: 2
    m_Bits: 4294967295
  m_RenderingLayerMask: 1
  m_Lightmapping: 4
  m_LightShadowCasterMode: 0
  m_AreaSize: {x: 1, y: 1}
  m_BounceIntensity: 1
  m_ColorTemperature: 6570
  m_UseColorTemperature: 0
  m_BoundingSphereOverride: {x: 0, y: 0, z: 0, w: 0}
  m_UseBoundingSphereOverride: 0
  m_UseViewFrustumForShadowCasterCull: 1
  m_ShadowRadius: 0
  m_ShadowAngle: 0
--- !u!1 &4030896017826467161
GameObject:
  m_ObjectHideFlags: 0
  m_CorrespondingSourceObject: {fileID: 0}
  m_PrefabInstance: {fileID: 0}
  m_PrefabAsset: {fileID: 0}
  serializedVersion: 6
  m_Component:
  - component: {fileID: 4030896017826467162}
  - component: {fileID: 4030896017826467163}
  m_Layer: 0
  m_Name: Point Light (1)
  m_TagString: Untagged
  m_Icon: {fileID: 0}
  m_NavMeshLayer: 0
  m_StaticEditorFlags: 0
  m_IsActive: 1
--- !u!4 &4030896017826467162
Transform:
  m_ObjectHideFlags: 0
  m_CorrespondingSourceObject: {fileID: 0}
  m_PrefabInstance: {fileID: 0}
  m_PrefabAsset: {fileID: 0}
  m_GameObject: {fileID: 4030896017826467161}
  m_LocalRotation: {x: -0, y: -0, z: -0, w: 1}
  m_LocalPosition: {x: 0, y: 2.65, z: -1.9400002}
  m_LocalScale: {x: 1, y: 1, z: 1}
  m_Children: []
  m_Father: {fileID: 2575777248385470309}
  m_RootOrder: 2
  m_LocalEulerAnglesHint: {x: 0, y: 0, z: 0}
--- !u!108 &4030896017826467163
Light:
  m_ObjectHideFlags: 0
  m_CorrespondingSourceObject: {fileID: 0}
  m_PrefabInstance: {fileID: 0}
  m_PrefabAsset: {fileID: 0}
  m_GameObject: {fileID: 4030896017826467161}
  m_Enabled: 1
  serializedVersion: 10
  m_Type: 2
  m_Shape: 0
  m_Color: {r: 1, g: 1, b: 1, a: 1}
  m_Intensity: 3.93
  m_Range: 7.93
  m_SpotAngle: 30
  m_InnerSpotAngle: 21.80208
  m_CookieSize: 10
  m_Shadows:
    m_Type: 0
    m_Resolution: -1
    m_CustomResolution: -1
    m_Strength: 1
    m_Bias: 0.05
    m_NormalBias: 0.4
    m_NearPlane: 0.2
    m_CullingMatrixOverride:
      e00: 1
      e01: 0
      e02: 0
      e03: 0
      e10: 0
      e11: 1
      e12: 0
      e13: 0
      e20: 0
      e21: 0
      e22: 1
      e23: 0
      e30: 0
      e31: 0
      e32: 0
      e33: 1
    m_UseCullingMatrixOverride: 0
  m_Cookie: {fileID: 8900000, guid: bb0be0108583003469a7044f10aad058, type: 2}
  m_DrawHalo: 0
  m_Flare: {fileID: 0}
  m_RenderMode: 2
  m_CullingMask:
    serializedVersion: 2
    m_Bits: 4294967295
  m_RenderingLayerMask: 1
  m_Lightmapping: 4
  m_LightShadowCasterMode: 0
  m_AreaSize: {x: 1, y: 1}
  m_BounceIntensity: 1
  m_ColorTemperature: 6570
  m_UseColorTemperature: 0
  m_BoundingSphereOverride: {x: 0, y: 0, z: 0, w: 0}
  m_UseBoundingSphereOverride: 0
  m_UseViewFrustumForShadowCasterCull: 1
  m_ShadowRadius: 0
  m_ShadowAngle: 0
--- !u!1 &4030896017829068894
GameObject:
  m_ObjectHideFlags: 0
  m_CorrespondingSourceObject: {fileID: 0}
  m_PrefabInstance: {fileID: 0}
  m_PrefabAsset: {fileID: 0}
  serializedVersion: 6
  m_Component:
  - component: {fileID: 4030896017829068895}
  - component: {fileID: 4030896017829068880}
  - component: {fileID: 2386185202107600063}
  m_Layer: 0
  m_Name: Reflection Probe (2)
  m_TagString: Untagged
  m_Icon: {fileID: 0}
  m_NavMeshLayer: 0
  m_StaticEditorFlags: 0
  m_IsActive: 1
--- !u!4 &4030896017829068895
Transform:
  m_ObjectHideFlags: 0
  m_CorrespondingSourceObject: {fileID: 0}
  m_PrefabInstance: {fileID: 0}
  m_PrefabAsset: {fileID: 0}
  m_GameObject: {fileID: 4030896017829068894}
  m_LocalRotation: {x: -0, y: -0, z: -0, w: 1}
  m_LocalPosition: {x: 0, y: 1.11, z: 0}
  m_LocalScale: {x: 1, y: 1, z: 1}
  m_Children: []
  m_Father: {fileID: 4287557137592332583}
  m_RootOrder: 2
  m_LocalEulerAnglesHint: {x: 0, y: 0, z: 0}
--- !u!215 &4030896017829068880
ReflectionProbe:
  m_ObjectHideFlags: 0
  m_CorrespondingSourceObject: {fileID: 0}
  m_PrefabInstance: {fileID: 0}
  m_PrefabAsset: {fileID: 0}
  m_GameObject: {fileID: 4030896017829068894}
  m_Enabled: 1
  serializedVersion: 2
  m_Type: 0
  m_Mode: 1
  m_RefreshMode: 2
  m_TimeSlicingMode: 1
  m_Resolution: 64
  m_UpdateFrequency: 0
  m_BoxSize: {x: 3.6069975, y: 3.1216993, z: 15.140105}
  m_BoxOffset: {x: 0.0924499, y: 0.2703166, z: -0.010674953}
  m_NearClip: 0.3
  m_FarClip: 100
  m_ShadowDistance: 0
  m_ClearFlags: 1
  m_BackGroundColor: {r: 0, g: 0, b: 0, a: 0}
  m_CullingMask:
    serializedVersion: 2
    m_Bits: 16495927
  m_IntensityMultiplier: 1
  m_BlendDistance: 0.125
  m_HDR: 1
  m_BoxProjection: 1
  m_RenderDynamicObjects: 0
  m_UseOcclusionCulling: 0
  m_Importance: 1
  m_CustomBakedTexture: {fileID: 0}
--- !u!114 &2386185202107600063
MonoBehaviour:
  m_ObjectHideFlags: 0
  m_CorrespondingSourceObject: {fileID: 0}
  m_PrefabInstance: {fileID: 0}
  m_PrefabAsset: {fileID: 0}
  m_GameObject: {fileID: 4030896017829068894}
  m_Enabled: 1
  m_EditorHideFlags: 0
  m_Script: {fileID: 11500000, guid: ecff7081915771c499a1aebc0ba57a2f, type: 3}
  m_Name: 
  m_EditorClassIdentifier: 
  angle: -2
--- !u!1 &4030896018304393417
GameObject:
  m_ObjectHideFlags: 0
  m_CorrespondingSourceObject: {fileID: 0}
  m_PrefabInstance: {fileID: 0}
  m_PrefabAsset: {fileID: 0}
  serializedVersion: 6
  m_Component:
  - component: {fileID: 4030896018304393418}
  - component: {fileID: 4030896018304393419}
  m_Layer: 0
  m_Name: Point Light
  m_TagString: Untagged
  m_Icon: {fileID: 0}
  m_NavMeshLayer: 0
  m_StaticEditorFlags: 0
  m_IsActive: 1
--- !u!4 &4030896018304393418
Transform:
  m_ObjectHideFlags: 0
  m_CorrespondingSourceObject: {fileID: 0}
  m_PrefabInstance: {fileID: 0}
  m_PrefabAsset: {fileID: 0}
  m_GameObject: {fileID: 4030896018304393417}
  m_LocalRotation: {x: -0, y: -0, z: -0, w: 1}
  m_LocalPosition: {x: 0, y: 2.65, z: 1.919}
  m_LocalScale: {x: 1, y: 1, z: 1}
  m_Children: []
  m_Father: {fileID: 2575777248385470309}
  m_RootOrder: 4
  m_LocalEulerAnglesHint: {x: 0, y: 0, z: 0}
--- !u!108 &4030896018304393419
Light:
  m_ObjectHideFlags: 0
  m_CorrespondingSourceObject: {fileID: 0}
  m_PrefabInstance: {fileID: 0}
  m_PrefabAsset: {fileID: 0}
  m_GameObject: {fileID: 4030896018304393417}
  m_Enabled: 1
  serializedVersion: 10
  m_Type: 2
  m_Shape: 0
  m_Color: {r: 1, g: 1, b: 1, a: 1}
  m_Intensity: 3.93
  m_Range: 7.93
  m_SpotAngle: 30
  m_InnerSpotAngle: 21.80208
  m_CookieSize: 10
  m_Shadows:
    m_Type: 0
    m_Resolution: -1
    m_CustomResolution: -1
    m_Strength: 1
    m_Bias: 0.05
    m_NormalBias: 0.4
    m_NearPlane: 0.2
    m_CullingMatrixOverride:
      e00: 1
      e01: 0
      e02: 0
      e03: 0
      e10: 0
      e11: 1
      e12: 0
      e13: 0
      e20: 0
      e21: 0
      e22: 1
      e23: 0
      e30: 0
      e31: 0
      e32: 0
      e33: 1
    m_UseCullingMatrixOverride: 0
  m_Cookie: {fileID: 8900000, guid: bb0be0108583003469a7044f10aad058, type: 2}
  m_DrawHalo: 0
  m_Flare: {fileID: 0}
  m_RenderMode: 2
  m_CullingMask:
    serializedVersion: 2
    m_Bits: 4294967295
  m_RenderingLayerMask: 1
  m_Lightmapping: 4
  m_LightShadowCasterMode: 0
  m_AreaSize: {x: 1, y: 1}
  m_BounceIntensity: 1
  m_ColorTemperature: 6570
  m_UseColorTemperature: 0
  m_BoundingSphereOverride: {x: 0, y: 0, z: 0, w: 0}
  m_UseBoundingSphereOverride: 0
  m_UseViewFrustumForShadowCasterCull: 1
  m_ShadowRadius: 0
  m_ShadowAngle: 0
--- !u!1 &4030896018477862101
GameObject:
  m_ObjectHideFlags: 0
  m_CorrespondingSourceObject: {fileID: 0}
  m_PrefabInstance: {fileID: 0}
  m_PrefabAsset: {fileID: 0}
  serializedVersion: 6
  m_Component:
  - component: {fileID: 4030896018477862102}
  - component: {fileID: 4030896018477862103}
  m_Layer: 0
  m_Name: Point Light (3)
  m_TagString: Untagged
  m_Icon: {fileID: 0}
  m_NavMeshLayer: 0
  m_StaticEditorFlags: 0
  m_IsActive: 1
--- !u!4 &4030896018477862102
Transform:
  m_ObjectHideFlags: 0
  m_CorrespondingSourceObject: {fileID: 0}
  m_PrefabInstance: {fileID: 0}
  m_PrefabAsset: {fileID: 0}
  m_GameObject: {fileID: 4030896018477862101}
  m_LocalRotation: {x: -0, y: -0, z: -0, w: 1}
  m_LocalPosition: {x: 4.726, y: 2.81, z: 4.75}
  m_LocalScale: {x: 1, y: 1, z: 1}
  m_Children: []
  m_Father: {fileID: 2575777248385470309}
  m_RootOrder: 1
  m_LocalEulerAnglesHint: {x: 0, y: 0, z: 0}
--- !u!108 &4030896018477862103
Light:
  m_ObjectHideFlags: 0
  m_CorrespondingSourceObject: {fileID: 0}
  m_PrefabInstance: {fileID: 0}
  m_PrefabAsset: {fileID: 0}
  m_GameObject: {fileID: 4030896018477862101}
  m_Enabled: 1
  serializedVersion: 10
  m_Type: 2
  m_Shape: 0
  m_Color: {r: 1, g: 1, b: 1, a: 1}
  m_Intensity: 1.21
  m_Range: 7.122509
  m_SpotAngle: 30
  m_InnerSpotAngle: 21.80208
  m_CookieSize: 10
  m_Shadows:
    m_Type: 0
    m_Resolution: -1
    m_CustomResolution: -1
    m_Strength: 1
    m_Bias: 0.05
    m_NormalBias: 0.4
    m_NearPlane: 0.2
    m_CullingMatrixOverride:
      e00: 1
      e01: 0
      e02: 0
      e03: 0
      e10: 0
      e11: 1
      e12: 0
      e13: 0
      e20: 0
      e21: 0
      e22: 1
      e23: 0
      e30: 0
      e31: 0
      e32: 0
      e33: 1
    m_UseCullingMatrixOverride: 0
  m_Cookie: {fileID: 0}
  m_DrawHalo: 0
  m_Flare: {fileID: 0}
  m_RenderMode: 2
  m_CullingMask:
    serializedVersion: 2
    m_Bits: 4294967295
  m_RenderingLayerMask: 1
  m_Lightmapping: 4
  m_LightShadowCasterMode: 0
  m_AreaSize: {x: 1, y: 1}
  m_BounceIntensity: 1
  m_ColorTemperature: 6570
  m_UseColorTemperature: 0
  m_BoundingSphereOverride: {x: 0, y: 0, z: 0, w: 0}
  m_UseBoundingSphereOverride: 0
  m_UseViewFrustumForShadowCasterCull: 1
  m_ShadowRadius: 0
  m_ShadowAngle: 0
--- !u!1 &4030896018491497861
GameObject:
  m_ObjectHideFlags: 0
  m_CorrespondingSourceObject: {fileID: 0}
  m_PrefabInstance: {fileID: 0}
  m_PrefabAsset: {fileID: 0}
  serializedVersion: 6
  m_Component:
  - component: {fileID: 4030896018491497862}
  - component: {fileID: 4030896018491497863}
  - component: {fileID: 7064147226081890735}
  m_Layer: 0
  m_Name: Reflection Probe
  m_TagString: Untagged
  m_Icon: {fileID: 0}
  m_NavMeshLayer: 0
  m_StaticEditorFlags: 0
  m_IsActive: 1
--- !u!4 &4030896018491497862
Transform:
  m_ObjectHideFlags: 0
  m_CorrespondingSourceObject: {fileID: 0}
  m_PrefabInstance: {fileID: 0}
  m_PrefabAsset: {fileID: 0}
  m_GameObject: {fileID: 4030896018491497861}
  m_LocalRotation: {x: -0, y: -0, z: -0, w: 1}
  m_LocalPosition: {x: 4.69, y: 1.11, z: 0}
  m_LocalScale: {x: 1, y: 1, z: 1}
  m_Children: []
  m_Father: {fileID: 4287557137592332583}
  m_RootOrder: 0
  m_LocalEulerAnglesHint: {x: 0, y: 0, z: 0}
--- !u!215 &4030896018491497863
ReflectionProbe:
  m_ObjectHideFlags: 0
  m_CorrespondingSourceObject: {fileID: 0}
  m_PrefabInstance: {fileID: 0}
  m_PrefabAsset: {fileID: 0}
  m_GameObject: {fileID: 4030896018491497861}
  m_Enabled: 1
  serializedVersion: 2
  m_Type: 0
  m_Mode: 1
  m_RefreshMode: 2
  m_TimeSlicingMode: 1
  m_Resolution: 64
  m_UpdateFrequency: 0
  m_BoxSize: {x: 5.662274, y: 2.9982576, z: 4.555751}
  m_BoxOffset: {x: 0.07200265, y: 0.3389697, z: -0.6950674}
  m_NearClip: 0.3
  m_FarClip: 100
  m_ShadowDistance: 0
  m_ClearFlags: 1
  m_BackGroundColor: {r: 0, g: 0, b: 0, a: 0}
  m_CullingMask:
    serializedVersion: 2
    m_Bits: 16495927
  m_IntensityMultiplier: 1
  m_BlendDistance: 0.5
  m_HDR: 1
  m_BoxProjection: 1
  m_RenderDynamicObjects: 0
  m_UseOcclusionCulling: 0
  m_Importance: 2
  m_CustomBakedTexture: {fileID: 0}
--- !u!114 &7064147226081890735
MonoBehaviour:
  m_ObjectHideFlags: 0
  m_CorrespondingSourceObject: {fileID: 0}
  m_PrefabInstance: {fileID: 0}
  m_PrefabAsset: {fileID: 0}
  m_GameObject: {fileID: 4030896018491497861}
  m_Enabled: 1
  m_EditorHideFlags: 0
  m_Script: {fileID: 11500000, guid: ecff7081915771c499a1aebc0ba57a2f, type: 3}
  m_Name: 
  m_EditorClassIdentifier: 
  angle: -2
--- !u!1 &4030896018522352583
GameObject:
  m_ObjectHideFlags: 0
  m_CorrespondingSourceObject: {fileID: 0}
  m_PrefabInstance: {fileID: 0}
  m_PrefabAsset: {fileID: 0}
  serializedVersion: 6
  m_Component:
  - component: {fileID: 4030896018522352568}
  - component: {fileID: 4030896018522352569}
  m_Layer: 0
  m_Name: Point Light (2)
  m_TagString: Untagged
  m_Icon: {fileID: 0}
  m_NavMeshLayer: 0
  m_StaticEditorFlags: 0
  m_IsActive: 1
--- !u!4 &4030896018522352568
Transform:
  m_ObjectHideFlags: 0
  m_CorrespondingSourceObject: {fileID: 0}
  m_PrefabInstance: {fileID: 0}
  m_PrefabAsset: {fileID: 0}
  m_GameObject: {fileID: 4030896018522352583}
  m_LocalRotation: {x: -0, y: -0, z: -0, w: 1}
  m_LocalPosition: {x: 2.851, y: 2.722, z: -4.77}
  m_LocalScale: {x: 1, y: 1, z: 1}
  m_Children: []
  m_Father: {fileID: 2575777248385470309}
  m_RootOrder: 3
  m_LocalEulerAnglesHint: {x: 0, y: 0, z: 0}
--- !u!108 &4030896018522352569
Light:
  m_ObjectHideFlags: 0
  m_CorrespondingSourceObject: {fileID: 0}
  m_PrefabInstance: {fileID: 0}
  m_PrefabAsset: {fileID: 0}
  m_GameObject: {fileID: 4030896018522352583}
  m_Enabled: 1
  serializedVersion: 10
  m_Type: 2
  m_Shape: 0
  m_Color: {r: 1, g: 1, b: 1, a: 1}
  m_Intensity: 1
  m_Range: 7.122509
  m_SpotAngle: 30
  m_InnerSpotAngle: 21.80208
  m_CookieSize: 10
  m_Shadows:
    m_Type: 1
    m_Resolution: -1
    m_CustomResolution: -1
    m_Strength: 1
    m_Bias: 0.05
    m_NormalBias: 0.4
    m_NearPlane: 0.2
    m_CullingMatrixOverride:
      e00: 1
      e01: 0
      e02: 0
      e03: 0
      e10: 0
      e11: 1
      e12: 0
      e13: 0
      e20: 0
      e21: 0
      e22: 1
      e23: 0
      e30: 0
      e31: 0
      e32: 0
      e33: 1
    m_UseCullingMatrixOverride: 0
  m_Cookie: {fileID: 8900000, guid: bb0be0108583003469a7044f10aad058, type: 2}
  m_DrawHalo: 0
  m_Flare: {fileID: 0}
  m_RenderMode: 2
  m_CullingMask:
    serializedVersion: 2
    m_Bits: 4294967295
  m_RenderingLayerMask: 1
  m_Lightmapping: 4
  m_LightShadowCasterMode: 0
  m_AreaSize: {x: 1, y: 1}
  m_BounceIntensity: 1
  m_ColorTemperature: 6570
  m_UseColorTemperature: 0
  m_BoundingSphereOverride: {x: 0, y: 0, z: 0, w: 0}
  m_UseBoundingSphereOverride: 0
  m_UseViewFrustumForShadowCasterCull: 1
  m_ShadowRadius: 0
  m_ShadowAngle: 0
--- !u!1 &4772653287942703225
GameObject:
  m_ObjectHideFlags: 0
  m_CorrespondingSourceObject: {fileID: 0}
  m_PrefabInstance: {fileID: 0}
  m_PrefabAsset: {fileID: 0}
  serializedVersion: 6
  m_Component:
  - component: {fileID: 4287557137592332583}
  m_Layer: 0
  m_Name: Probe
  m_TagString: Untagged
  m_Icon: {fileID: 0}
  m_NavMeshLayer: 0
  m_StaticEditorFlags: 0
  m_IsActive: 0
--- !u!4 &4287557137592332583
Transform:
  m_ObjectHideFlags: 0
  m_CorrespondingSourceObject: {fileID: 0}
  m_PrefabInstance: {fileID: 0}
  m_PrefabAsset: {fileID: 0}
  m_GameObject: {fileID: 4772653287942703225}
  m_LocalRotation: {x: 0, y: 0, z: 0, w: 1}
  m_LocalPosition: {x: 0, y: 0, z: 0}
  m_LocalScale: {x: 1, y: 1, z: 1}
  m_Children:
  - {fileID: 4030896018491497862}
  - {fileID: 4030896016520779712}
  - {fileID: 4030896017829068895}
  m_Father: {fileID: 665723464858488862}
  m_RootOrder: 2
  m_LocalEulerAnglesHint: {x: 0, y: 0, z: 0}
--- !u!1 &5191710160486912509
GameObject:
  m_ObjectHideFlags: 0
  m_CorrespondingSourceObject: {fileID: 0}
  m_PrefabInstance: {fileID: 0}
  m_PrefabAsset: {fileID: 0}
  serializedVersion: 6
  m_Component:
  - component: {fileID: 2575777248385470309}
  m_Layer: 0
  m_Name: LightContainer
  m_TagString: Untagged
  m_Icon: {fileID: 0}
  m_NavMeshLayer: 0
  m_StaticEditorFlags: 0
  m_IsActive: 0
--- !u!4 &2575777248385470309
Transform:
  m_ObjectHideFlags: 0
  m_CorrespondingSourceObject: {fileID: 0}
  m_PrefabInstance: {fileID: 0}
  m_PrefabAsset: {fileID: 0}
  m_GameObject: {fileID: 5191710160486912509}
  m_LocalRotation: {x: -0, y: -0, z: -0, w: 1}
  m_LocalPosition: {x: 0, y: 0, z: 0}
  m_LocalScale: {x: 1, y: 1, z: 1}
  m_Children:
  - {fileID: 4030896017479832094}
  - {fileID: 4030896018477862102}
  - {fileID: 4030896017826467162}
  - {fileID: 4030896018522352568}
  - {fileID: 4030896018304393418}
  m_Father: {fileID: 665723464858488862}
  m_RootOrder: 1
  m_LocalEulerAnglesHint: {x: 0, y: 0, z: 0}
--- !u!1 &5978311303461627548
GameObject:
  m_ObjectHideFlags: 0
  m_CorrespondingSourceObject: {fileID: 0}
  m_PrefabInstance: {fileID: 0}
  m_PrefabAsset: {fileID: 0}
  serializedVersion: 6
  m_Component:
  - component: {fileID: 1392386346384554269}
  m_Layer: 0
  m_Name: itemSpawn (2)
  m_TagString: Untagged
  m_Icon: {fileID: 0}
  m_NavMeshLayer: 0
  m_StaticEditorFlags: 0
  m_IsActive: 1
--- !u!4 &1392386346384554269
Transform:
  m_ObjectHideFlags: 0
  m_CorrespondingSourceObject: {fileID: 0}
  m_PrefabInstance: {fileID: 0}
  m_PrefabAsset: {fileID: 0}
  m_GameObject: {fileID: 5978311303461627548}
  m_LocalRotation: {x: -0, y: -0, z: -0, w: 1}
  m_LocalPosition: {x: 2.634, y: 1.078, z: 0.377}
  m_LocalScale: {x: 1, y: 1, z: 1}
  m_Children: []
  m_Father: {fileID: 665723464858488862}
  m_RootOrder: 7
  m_LocalEulerAnglesHint: {x: 0, y: 0, z: 0}
--- !u!1 &6996697626800032093
GameObject:
  m_ObjectHideFlags: 0
  m_CorrespondingSourceObject: {fileID: 0}
  m_PrefabInstance: {fileID: 0}
  m_PrefabAsset: {fileID: 0}
  serializedVersion: 6
  m_Component:
  - component: {fileID: 7488228440566210837}
  - component: {fileID: 1136082451978037948}
  m_Layer: 0
  m_Name: NavMesh Modifier Volume
  m_TagString: Untagged
  m_Icon: {fileID: 0}
  m_NavMeshLayer: 0
  m_StaticEditorFlags: 0
  m_IsActive: 1
--- !u!4 &7488228440566210837
Transform:
  m_ObjectHideFlags: 0
  m_CorrespondingSourceObject: {fileID: 0}
  m_PrefabInstance: {fileID: 0}
  m_PrefabAsset: {fileID: 0}
  m_GameObject: {fileID: 6996697626800032093}
  m_LocalRotation: {x: 0, y: 0, z: 0, w: 1}
  m_LocalPosition: {x: 5.01, y: 0, z: 2.91}
  m_LocalScale: {x: 1, y: 1, z: 1}
  m_Children: []
  m_Father: {fileID: 5910119540929638222}
  m_RootOrder: 1
  m_LocalEulerAnglesHint: {x: 0, y: 0, z: 0}
--- !u!114 &1136082451978037948
MonoBehaviour:
  m_ObjectHideFlags: 0
  m_CorrespondingSourceObject: {fileID: 0}
  m_PrefabInstance: {fileID: 0}
  m_PrefabAsset: {fileID: 0}
  m_GameObject: {fileID: 6996697626800032093}
  m_Enabled: 1
  m_EditorHideFlags: 0
  m_Script: {fileID: 11500000, guid: 35e95dc5ff2b64380880dd7ac5922847, type: 3}
  m_Name: 
  m_EditorClassIdentifier: 
  m_Size: {x: 6.3530946, y: 3, z: 0.6585953}
  m_Center: {x: -0.11059785, y: 1, z: -1.0729727}
  m_Area: 1
  m_AffectedAgents: ffffffff
--- !u!1 &8534458896413500464
GameObject:
  m_ObjectHideFlags: 0
  m_CorrespondingSourceObject: {fileID: 0}
  m_PrefabInstance: {fileID: 0}
  m_PrefabAsset: {fileID: 0}
  serializedVersion: 6
  m_Component:
  - component: {fileID: 2433947104858234657}
  m_Layer: 0
  m_Name: itemSpawn (1)
  m_TagString: Untagged
  m_Icon: {fileID: 0}
  m_NavMeshLayer: 0
  m_StaticEditorFlags: 0
  m_IsActive: 1
--- !u!4 &2433947104858234657
Transform:
  m_ObjectHideFlags: 0
  m_CorrespondingSourceObject: {fileID: 0}
  m_PrefabInstance: {fileID: 0}
  m_PrefabAsset: {fileID: 0}
  m_GameObject: {fileID: 8534458896413500464}
  m_LocalRotation: {x: -0, y: -0, z: -0, w: 1}
  m_LocalPosition: {x: 5.756, y: 0.699, z: -2.247}
  m_LocalScale: {x: 1, y: 1, z: 1}
  m_Children: []
  m_Father: {fileID: 665723464858488862}
  m_RootOrder: 6
  m_LocalEulerAnglesHint: {x: 0, y: 0, z: 0}
--- !u!1001 &2869183375356834216
PrefabInstance:
  m_ObjectHideFlags: 0
  serializedVersion: 2
  m_Modification:
    m_TransformParent: {fileID: 665723464858488862}
    m_Modifications:
    - target: {fileID: 3253926415715605622, guid: 8b117d26e8560c2458ce6465ec63e1cf,
        type: 3}
      propertyPath: scp173
      value: 0
      objectReference: {fileID: 0}
    - target: {fileID: 3509292714356296820, guid: 8b117d26e8560c2458ce6465ec63e1cf,
        type: 3}
      propertyPath: m_LocalPosition.z
      value: -0.316
      objectReference: {fileID: 0}
    - target: {fileID: 4321894189022098867, guid: 8b117d26e8560c2458ce6465ec63e1cf,
        type: 3}
      propertyPath: m_IsActive
      value: 0
      objectReference: {fileID: 0}
    - target: {fileID: 4416237426726756766, guid: 8b117d26e8560c2458ce6465ec63e1cf,
        type: 3}
      propertyPath: m_LocalPosition.z
      value: 0.317
      objectReference: {fileID: 0}
    - target: {fileID: 4704157506594609049, guid: 8b117d26e8560c2458ce6465ec63e1cf,
        type: 3}
      propertyPath: m_RootOrder
      value: 4
      objectReference: {fileID: 0}
    - target: {fileID: 4704157506594609049, guid: 8b117d26e8560c2458ce6465ec63e1cf,
        type: 3}
      propertyPath: m_LocalPosition.x
      value: 1.812
      objectReference: {fileID: 0}
    - target: {fileID: 4704157506594609049, guid: 8b117d26e8560c2458ce6465ec63e1cf,
        type: 3}
      propertyPath: m_LocalPosition.y
      value: 0
      objectReference: {fileID: 0}
    - target: {fileID: 4704157506594609049, guid: 8b117d26e8560c2458ce6465ec63e1cf,
        type: 3}
      propertyPath: m_LocalPosition.z
      value: -4.81
      objectReference: {fileID: 0}
    - target: {fileID: 4704157506594609049, guid: 8b117d26e8560c2458ce6465ec63e1cf,
        type: 3}
      propertyPath: m_LocalRotation.w
      value: 0.7071068
      objectReference: {fileID: 0}
    - target: {fileID: 4704157506594609049, guid: 8b117d26e8560c2458ce6465ec63e1cf,
        type: 3}
      propertyPath: m_LocalRotation.x
      value: -0
      objectReference: {fileID: 0}
    - target: {fileID: 4704157506594609049, guid: 8b117d26e8560c2458ce6465ec63e1cf,
        type: 3}
      propertyPath: m_LocalRotation.y
      value: 0.7071068
      objectReference: {fileID: 0}
    - target: {fileID: 4704157506594609049, guid: 8b117d26e8560c2458ce6465ec63e1cf,
        type: 3}
      propertyPath: m_LocalRotation.z
      value: -0
      objectReference: {fileID: 0}
    - target: {fileID: 4704157506594609049, guid: 8b117d26e8560c2458ce6465ec63e1cf,
        type: 3}
      propertyPath: m_LocalEulerAnglesHint.x
      value: 0
      objectReference: {fileID: 0}
    - target: {fileID: 4704157506594609049, guid: 8b117d26e8560c2458ce6465ec63e1cf,
        type: 3}
      propertyPath: m_LocalEulerAnglesHint.y
      value: 90
      objectReference: {fileID: 0}
    - target: {fileID: 4704157506594609049, guid: 8b117d26e8560c2458ce6465ec63e1cf,
        type: 3}
      propertyPath: m_LocalEulerAnglesHint.z
      value: 0
      objectReference: {fileID: 0}
    - target: {fileID: 8844315487564344749, guid: 8b117d26e8560c2458ce6465ec63e1cf,
        type: 3}
      propertyPath: m_Name
      value: KeyDoor_def
      objectReference: {fileID: 0}
    m_RemovedComponents: []
  m_SourcePrefab: {fileID: 100100000, guid: 8b117d26e8560c2458ce6465ec63e1cf, type: 3}
--- !u!4 &7393192326741796401 stripped
Transform:
  m_CorrespondingSourceObject: {fileID: 4704157506594609049, guid: 8b117d26e8560c2458ce6465ec63e1cf,
    type: 3}
  m_PrefabInstance: {fileID: 2869183375356834216}
  m_PrefabAsset: {fileID: 0}
--- !u!1001 &3313267664517092216
PrefabInstance:
  m_ObjectHideFlags: 0
  serializedVersion: 2
  m_Modification:
    m_TransformParent: {fileID: 6970373209189142298}
    m_Modifications:
    - target: {fileID: 4474999009241768552, guid: 5a3fc441e9390a943bc914bafb1d9373,
        type: 3}
      propertyPath: m_Name
      value: LightDoor_Fake
      objectReference: {fileID: 0}
    - target: {fileID: 4474999009241768554, guid: 5a3fc441e9390a943bc914bafb1d9373,
        type: 3}
      propertyPath: m_RootOrder
      value: 2
      objectReference: {fileID: 0}
    - target: {fileID: 4474999009241768554, guid: 5a3fc441e9390a943bc914bafb1d9373,
        type: 3}
      propertyPath: m_LocalScale.x
      value: 1.3333334
      objectReference: {fileID: 0}
    - target: {fileID: 4474999009241768554, guid: 5a3fc441e9390a943bc914bafb1d9373,
        type: 3}
      propertyPath: m_LocalScale.y
      value: 1.3333334
      objectReference: {fileID: 0}
    - target: {fileID: 4474999009241768554, guid: 5a3fc441e9390a943bc914bafb1d9373,
        type: 3}
      propertyPath: m_LocalScale.z
      value: 1.3333334
      objectReference: {fileID: 0}
    - target: {fileID: 4474999009241768554, guid: 5a3fc441e9390a943bc914bafb1d9373,
        type: 3}
      propertyPath: m_LocalPosition.x
      value: 8.169333
      objectReference: {fileID: 0}
    - target: {fileID: 4474999009241768554, guid: 5a3fc441e9390a943bc914bafb1d9373,
        type: 3}
      propertyPath: m_LocalPosition.y
      value: 0.004000358
      objectReference: {fileID: 0}
    - target: {fileID: 4474999009241768554, guid: 5a3fc441e9390a943bc914bafb1d9373,
        type: 3}
      propertyPath: m_LocalPosition.z
      value: 2.1946669
      objectReference: {fileID: 0}
    - target: {fileID: 4474999009241768554, guid: 5a3fc441e9390a943bc914bafb1d9373,
        type: 3}
      propertyPath: m_LocalRotation.w
      value: 1
      objectReference: {fileID: 0}
    - target: {fileID: 4474999009241768554, guid: 5a3fc441e9390a943bc914bafb1d9373,
        type: 3}
      propertyPath: m_LocalRotation.x
      value: -0.000000081460335
      objectReference: {fileID: 0}
    - target: {fileID: 4474999009241768554, guid: 5a3fc441e9390a943bc914bafb1d9373,
        type: 3}
      propertyPath: m_LocalRotation.y
      value: -0
      objectReference: {fileID: 0}
    - target: {fileID: 4474999009241768554, guid: 5a3fc441e9390a943bc914bafb1d9373,
        type: 3}
      propertyPath: m_LocalRotation.z
      value: -0
      objectReference: {fileID: 0}
    - target: {fileID: 4474999009241768554, guid: 5a3fc441e9390a943bc914bafb1d9373,
        type: 3}
      propertyPath: m_LocalEulerAnglesHint.x
      value: 0
      objectReference: {fileID: 0}
    - target: {fileID: 4474999009241768554, guid: 5a3fc441e9390a943bc914bafb1d9373,
        type: 3}
      propertyPath: m_LocalEulerAnglesHint.y
      value: 0
      objectReference: {fileID: 0}
    - target: {fileID: 4474999009241768554, guid: 5a3fc441e9390a943bc914bafb1d9373,
        type: 3}
      propertyPath: m_LocalEulerAnglesHint.z
      value: 0
      objectReference: {fileID: 0}
    m_RemovedComponents: []
  m_SourcePrefab: {fileID: 100100000, guid: 5a3fc441e9390a943bc914bafb1d9373, type: 3}
--- !u!1001 &4030896016788186457
PrefabInstance:
  m_ObjectHideFlags: 0
  serializedVersion: 2
  m_Modification:
    m_TransformParent: {fileID: 665723464858488862}
    m_Modifications:
    - target: {fileID: 575005292292672094, guid: e975ec10717902d498e734f0817b70d3,
        type: 3}
      propertyPath: m_LocalPosition.x
      value: 1.389
      objectReference: {fileID: 0}
    - target: {fileID: 575005292292672094, guid: e975ec10717902d498e734f0817b70d3,
        type: 3}
      propertyPath: m_LocalPosition.z
      value: -0.256
      objectReference: {fileID: 0}
    - target: {fileID: 575005292613307448, guid: e975ec10717902d498e734f0817b70d3,
        type: 3}
      propertyPath: m_LocalPosition.z
      value: 0.314
      objectReference: {fileID: 0}
    - target: {fileID: 5866356131641617024, guid: e975ec10717902d498e734f0817b70d3,
        type: 3}
      propertyPath: m_RootOrder
      value: 3
      objectReference: {fileID: 0}
    - target: {fileID: 5866356131641617024, guid: e975ec10717902d498e734f0817b70d3,
        type: 3}
      propertyPath: m_LocalPosition.x
      value: 3.834
      objectReference: {fileID: 0}
    - target: {fileID: 5866356131641617024, guid: e975ec10717902d498e734f0817b70d3,
        type: 3}
      propertyPath: m_LocalPosition.y
      value: 0
      objectReference: {fileID: 0}
    - target: {fileID: 5866356131641617024, guid: e975ec10717902d498e734f0817b70d3,
        type: 3}
      propertyPath: m_LocalPosition.z
      value: -2.899
      objectReference: {fileID: 0}
    - target: {fileID: 5866356131641617024, guid: e975ec10717902d498e734f0817b70d3,
        type: 3}
      propertyPath: m_LocalRotation.w
      value: 1
      objectReference: {fileID: 0}
    - target: {fileID: 5866356131641617024, guid: e975ec10717902d498e734f0817b70d3,
        type: 3}
      propertyPath: m_LocalRotation.x
      value: -0
      objectReference: {fileID: 0}
    - target: {fileID: 5866356131641617024, guid: e975ec10717902d498e734f0817b70d3,
        type: 3}
      propertyPath: m_LocalRotation.y
      value: -0
      objectReference: {fileID: 0}
    - target: {fileID: 5866356131641617024, guid: e975ec10717902d498e734f0817b70d3,
        type: 3}
      propertyPath: m_LocalRotation.z
      value: -0
      objectReference: {fileID: 0}
    - target: {fileID: 5866356131641617024, guid: e975ec10717902d498e734f0817b70d3,
        type: 3}
      propertyPath: m_LocalEulerAnglesHint.x
      value: 0
      objectReference: {fileID: 0}
    - target: {fileID: 5866356131641617024, guid: e975ec10717902d498e734f0817b70d3,
        type: 3}
      propertyPath: m_LocalEulerAnglesHint.y
      value: 0
      objectReference: {fileID: 0}
    - target: {fileID: 5866356131641617024, guid: e975ec10717902d498e734f0817b70d3,
        type: 3}
      propertyPath: m_LocalEulerAnglesHint.z
      value: 0
      objectReference: {fileID: 0}
    - target: {fileID: 7682208121852514484, guid: e975ec10717902d498e734f0817b70d3,
        type: 3}
      propertyPath: m_Name
      value: LightDoor_def (1)
      objectReference: {fileID: 0}
    m_RemovedComponents: []
  m_SourcePrefab: {fileID: 100100000, guid: e975ec10717902d498e734f0817b70d3, type: 3}
--- !u!4 &7393192326872207321 stripped
Transform:
  m_CorrespondingSourceObject: {fileID: 5866356131641617024, guid: e975ec10717902d498e734f0817b70d3,
    type: 3}
  m_PrefabInstance: {fileID: 4030896016788186457}
  m_PrefabAsset: {fileID: 0}
--- !u!1001 &6970373209188750744
PrefabInstance:
  m_ObjectHideFlags: 0
  serializedVersion: 2
  m_Modification:
    m_TransformParent: {fileID: 5910119540929638222}
    m_Modifications:
    - target: {fileID: -6277873661758113603, guid: 2522303d6cb81e249ba3c2505999fae4,
        type: 3}
      propertyPath: m_Layer
      value: 10
      objectReference: {fileID: 0}
    - target: {fileID: -4943744016313211207, guid: 2522303d6cb81e249ba3c2505999fae4,
        type: 3}
      propertyPath: m_Materials.Array.data[0]
      value: 
      objectReference: {fileID: 2100000, guid: 7d6390302bd777b47895a59ecf77a2ba, type: 2}
    - target: {fileID: 100000, guid: 2522303d6cb81e249ba3c2505999fae4, type: 3}
      propertyPath: m_Layer
      value: 10
      objectReference: {fileID: 0}
    - target: {fileID: 100000, guid: 2522303d6cb81e249ba3c2505999fae4, type: 3}
      propertyPath: m_TagString
      value: Concrete
      objectReference: {fileID: 0}
    - target: {fileID: 100002, guid: 2522303d6cb81e249ba3c2505999fae4, type: 3}
      propertyPath: m_Name
      value: room2testroom2_opt
      objectReference: {fileID: 0}
    - target: {fileID: 100002, guid: 2522303d6cb81e249ba3c2505999fae4, type: 3}
      propertyPath: m_Layer
      value: 10
      objectReference: {fileID: 0}
    - target: {fileID: 100002, guid: 2522303d6cb81e249ba3c2505999fae4, type: 3}
      propertyPath: m_TagString
      value: Metal
      objectReference: {fileID: 0}
    - target: {fileID: 400002, guid: 2522303d6cb81e249ba3c2505999fae4, type: 3}
      propertyPath: m_RootOrder
      value: 0
      objectReference: {fileID: 0}
    - target: {fileID: 400002, guid: 2522303d6cb81e249ba3c2505999fae4, type: 3}
      propertyPath: m_LocalScale.x
      value: 0.75
      objectReference: {fileID: 0}
    - target: {fileID: 400002, guid: 2522303d6cb81e249ba3c2505999fae4, type: 3}
      propertyPath: m_LocalScale.y
      value: 0.75
      objectReference: {fileID: 0}
    - target: {fileID: 400002, guid: 2522303d6cb81e249ba3c2505999fae4, type: 3}
      propertyPath: m_LocalScale.z
      value: 0.75
      objectReference: {fileID: 0}
    - target: {fileID: 400002, guid: 2522303d6cb81e249ba3c2505999fae4, type: 3}
      propertyPath: m_LocalPosition.x
      value: -0
      objectReference: {fileID: 0}
    - target: {fileID: 400002, guid: 2522303d6cb81e249ba3c2505999fae4, type: 3}
      propertyPath: m_LocalPosition.y
      value: 0
      objectReference: {fileID: 0}
    - target: {fileID: 400002, guid: 2522303d6cb81e249ba3c2505999fae4, type: 3}
      propertyPath: m_LocalPosition.z
      value: 0
      objectReference: {fileID: 0}
    - target: {fileID: 400002, guid: 2522303d6cb81e249ba3c2505999fae4, type: 3}
      propertyPath: m_LocalRotation.w
      value: 1
      objectReference: {fileID: 0}
    - target: {fileID: 400002, guid: 2522303d6cb81e249ba3c2505999fae4, type: 3}
      propertyPath: m_LocalRotation.x
      value: 0.000000081460335
      objectReference: {fileID: 0}
    - target: {fileID: 400002, guid: 2522303d6cb81e249ba3c2505999fae4, type: 3}
      propertyPath: m_LocalRotation.y
      value: 0
      objectReference: {fileID: 0}
    - target: {fileID: 400002, guid: 2522303d6cb81e249ba3c2505999fae4, type: 3}
      propertyPath: m_LocalRotation.z
      value: -0
      objectReference: {fileID: 0}
    - target: {fileID: 400002, guid: 2522303d6cb81e249ba3c2505999fae4, type: 3}
      propertyPath: m_LocalEulerAnglesHint.x
      value: 0
      objectReference: {fileID: 0}
    - target: {fileID: 400002, guid: 2522303d6cb81e249ba3c2505999fae4, type: 3}
      propertyPath: m_LocalEulerAnglesHint.y
      value: 0
      objectReference: {fileID: 0}
    - target: {fileID: 400002, guid: 2522303d6cb81e249ba3c2505999fae4, type: 3}
      propertyPath: m_LocalEulerAnglesHint.z
      value: 0
      objectReference: {fileID: 0}
    - target: {fileID: 2300000, guid: 2522303d6cb81e249ba3c2505999fae4, type: 3}
      propertyPath: m_StitchLightmapSeams
      value: 0
      objectReference: {fileID: 0}
    - target: {fileID: 2300000, guid: 2522303d6cb81e249ba3c2505999fae4, type: 3}
      propertyPath: m_Materials.Array.data[0]
      value: 
      objectReference: {fileID: 2100000, guid: 97beeec20f524664c9832c911888889e, type: 2}
    - target: {fileID: 2300000, guid: 2522303d6cb81e249ba3c2505999fae4, type: 3}
      propertyPath: m_Materials.Array.data[1]
      value: 
      objectReference: {fileID: 2100000, guid: 7b6269bde3ce71f44bbb88849d4f2a3e, type: 2}
    - target: {fileID: 2300000, guid: 2522303d6cb81e249ba3c2505999fae4, type: 3}
      propertyPath: m_Materials.Array.data[2]
      value: 
      objectReference: {fileID: 2100000, guid: aabb3e1c0fb181b45bf28f093648a5dc, type: 2}
    - target: {fileID: 2300000, guid: 2522303d6cb81e249ba3c2505999fae4, type: 3}
      propertyPath: m_Materials.Array.data[3]
      value: 
      objectReference: {fileID: 2100000, guid: c593b65254059d040a57ffc9cb795815, type: 2}
    - target: {fileID: 2300000, guid: 2522303d6cb81e249ba3c2505999fae4, type: 3}
      propertyPath: m_Materials.Array.data[4]
      value: 
      objectReference: {fileID: 2100000, guid: 1d2181fd871f9954ab9fc95e462dafc4, type: 2}
    - target: {fileID: 2300000, guid: 2522303d6cb81e249ba3c2505999fae4, type: 3}
      propertyPath: m_Materials.Array.data[5]
      value: 
      objectReference: {fileID: 2100000, guid: b3989d814692c754ca2522036ff6f35e, type: 2}
    - target: {fileID: 2300000, guid: 2522303d6cb81e249ba3c2505999fae4, type: 3}
      propertyPath: m_Materials.Array.data[6]
      value: 
      objectReference: {fileID: 2100000, guid: 83c7db492918f29478b8d7accfd8010e, type: 2}
    - target: {fileID: 2300000, guid: 2522303d6cb81e249ba3c2505999fae4, type: 3}
      propertyPath: m_Materials.Array.data[7]
      value: 
      objectReference: {fileID: 2100000, guid: 2b6a701188708634da4c9863cab0a92f, type: 2}
    - target: {fileID: 2300000, guid: 2522303d6cb81e249ba3c2505999fae4, type: 3}
      propertyPath: m_Materials.Array.data[8]
      value: 
      objectReference: {fileID: 2100000, guid: 1d2181fd871f9954ab9fc95e462dafc4, type: 2}
    - target: {fileID: 2300000, guid: 2522303d6cb81e249ba3c2505999fae4, type: 3}
      propertyPath: m_Materials.Array.data[9]
      value: 
      objectReference: {fileID: 2100000, guid: af0e2388367184241a0a4759ca53421d, type: 2}
    - target: {fileID: 2300000, guid: 2522303d6cb81e249ba3c2505999fae4, type: 3}
      propertyPath: m_Materials.Array.data[10]
      value: 
      objectReference: {fileID: 2100000, guid: 787e92e4705ac2f4185bc49761d3f5d8, type: 2}
    - target: {fileID: 2300000, guid: 2522303d6cb81e249ba3c2505999fae4, type: 3}
      propertyPath: m_Materials.Array.data[11]
      value: 
      objectReference: {fileID: 2100000, guid: 1d2181fd871f9954ab9fc95e462dafc4, type: 2}
    - target: {fileID: 2300000, guid: 2522303d6cb81e249ba3c2505999fae4, type: 3}
      propertyPath: m_Materials.Array.data[12]
      value: 
      objectReference: {fileID: 2100000, guid: f0be23482e55aac48909b1198b0ddb3a, type: 2}
    - target: {fileID: 2300000, guid: 2522303d6cb81e249ba3c2505999fae4, type: 3}
      propertyPath: m_Materials.Array.data[13]
      value: 
      objectReference: {fileID: 2100000, guid: 1e1fbcfa4933a3040b45a5dbc14e9ca5, type: 2}
    m_RemovedComponents: []
  m_SourcePrefab: {fileID: 100100000, guid: 2522303d6cb81e249ba3c2505999fae4, type: 3}
--- !u!1 &6970373209188848442 stripped
GameObject:
  m_CorrespondingSourceObject: {fileID: 100002, guid: 2522303d6cb81e249ba3c2505999fae4,
    type: 3}
  m_PrefabInstance: {fileID: 6970373209188750744}
  m_PrefabAsset: {fileID: 0}
--- !u!4 &6970373209189142298 stripped
Transform:
  m_CorrespondingSourceObject: {fileID: 400002, guid: 2522303d6cb81e249ba3c2505999fae4,
    type: 3}
  m_PrefabInstance: {fileID: 6970373209188750744}
  m_PrefabAsset: {fileID: 0}
