%YAML 1.1
%TAG !u! tag:unity3d.com,2011:
--- !u!114 &11400000
MonoBehaviour:
  m_ObjectHideFlags: 0
  m_CorrespondingSourceObject: {fileID: 0}
  m_PrefabInstance: {fileID: 0}
  m_PrefabAsset: {fileID: 0}
  m_GameObject: {fileID: 0}
  m_Enabled: 1
  m_EditorHideFlags: 0
  m_Script: {fileID: 11500000, guid: 1d6b71342f24acd489409bc763b48b92, type: 3}
  m_Name: Keycard 2
  m_EditorClassIdentifier: Assembly-CSharp::Equipable_Key
  colCenter: {x: -0.0010363907, y: 0.0051007606, z: -0.0013471171}
  colSize: {x: 0.34071395, y: 0.018859543, z: 0.24053614}
  mass: 1
  itemName: key2
  icon: {fileID: 21300000, guid: 9a26e2c6a3105b149b02ad72696ee3d7, type: 3}
  deleteUse: 0
  hasEffect: 0
  isFem: 0
  isUnique: 0
  keepInv: 0
  Effects:
  - affected: 0
    effect:
      permanent: 0
      time: 0
      max: 0
      min: 0
      value: 0
      multiplier: 0
  - affected: 0
    effect:
      permanent: 0
      time: 0
      max: 0
      min: 0
      value: 0
      multiplier: 0
  ItemModel: {fileID: 3860097337076901359, guid: 426b9d1b2c37e2641a64567e0940da57,
    type: 3}
  valueFloat: 0
  valueInt: 0
  SFX: 1
  useTime: 0
  Overlay: {fileID: 21300000, guid: 9a26e2c6a3105b149b02ad72696ee3d7, type: 3}
  protectGas: 0
  protectCogn: 0
  autoEquip: 0
  part: 2
  level: 2
