%YAML 1.1
%TAG !u! tag:unity3d.com,2011:
--- !u!114 &11400000
MonoBehaviour:
  m_ObjectHideFlags: 0
  m_CorrespondingSourceObject: {fileID: 0}
  m_PrefabInstance: {fileID: 0}
  m_PrefabAsset: {fileID: 0}
  m_GameObject: {fileID: 0}
  m_Enabled: 1
  m_EditorHideFlags: 0
  m_Script: {fileID: 11500000, guid: 212984bd537ceae4d9be38226d17bba7, type: 3}
  m_Name: Eyedrops
  m_EditorClassIdentifier: 
  colCenter: {x: 0.000000007450581, y: 0.0949794, z: 0.000672102}
  colSize: {x: 0.079815015, y: 0.19148783, z: 0.079057485}
  mass: 1
  itemName: eye
  icon: {fileID: 21300000, guid: 93dfdd4d4eb11dd4d9abae911708a0d0, type: 3}
  deleteUse: 1
  hasEffect: 1
  isFem: 0
  isUnique: 0
  keepInv: 0
  Effects:
  - affected: 0
    effect:
      permanent: 0
      time: 10
      max: 0
      min: 0
      value: 10
      multiplier: 0.5
  ItemModel: {fileID: 100000, guid: 3bcb4c71cafe0e343929e84d901469dd, type: 3}
  valueFloat: 0
  valueInt: 0
  SFX: 2
  useTime: 1
