%YAML 1.1
%TAG !u! tag:unity3d.com,2011:
--- !u!1 &1801361403652738036
GameObject:
  m_ObjectHideFlags: 0
  m_CorrespondingSourceObject: {fileID: 0}
  m_PrefabInstance: {fileID: 0}
  m_PrefabAsset: {fileID: 0}
  serializedVersion: 6
  m_Component:
  - component: {fileID: 1225442949786159636}
  - component: {fileID: 2872566912411261639}
  m_Layer: 0
  m_Name: NavMesh Link
  m_TagString: Untagged
  m_Icon: {fileID: 0}
  m_NavMeshLayer: 0
  m_StaticEditorFlags: 0
  m_IsActive: 1
--- !u!4 &1225442949786159636
Transform:
  m_ObjectHideFlags: 0
  m_CorrespondingSourceObject: {fileID: 0}
  m_PrefabInstance: {fileID: 0}
  m_PrefabAsset: {fileID: 0}
  m_GameObject: {fileID: 1801361403652738036}
  m_LocalRotation: {x: -0, y: -0, z: -0, w: 1}
  m_LocalPosition: {x: 0, y: 0, z: 0}
  m_LocalScale: {x: 1, y: 1, z: 1}
  m_Children: []
  m_Father: {fileID: 5404534713671246811}
  m_RootOrder: 0
  m_LocalEulerAnglesHint: {x: 0, y: 0, z: 0}
--- !u!114 &2872566912411261639
MonoBehaviour:
  m_ObjectHideFlags: 0
  m_CorrespondingSourceObject: {fileID: 0}
  m_PrefabInstance: {fileID: 0}
  m_PrefabAsset: {fileID: 0}
  m_GameObject: {fileID: 1801361403652738036}
  m_Enabled: 1
  m_EditorHideFlags: 0
  m_Script: {fileID: 11500000, guid: 6eeb5dc026fdf4b488bc7ae0138ab719, type: 3}
  m_Name: 
  m_EditorClassIdentifier: 
  m_AgentTypeID: 0
  m_StartPoint: {x: 0, y: 0, z: -0.5}
  m_EndPoint: {x: 0, y: 0, z: 0.5}
  m_Width: 0
  m_CostModifier: -1
  m_Bidirectional: 1
  m_AutoUpdatePosition: 0
  m_Area: 0
--- !u!1 &2573640454366300296
GameObject:
  m_ObjectHideFlags: 0
  m_CorrespondingSourceObject: {fileID: 0}
  m_PrefabInstance: {fileID: 0}
  m_PrefabAsset: {fileID: 0}
  serializedVersion: 6
  m_Component:
  - component: {fileID: 2661849929538559481}
  m_Layer: 0
  m_Name: DoorObjects
  m_TagString: Untagged
  m_Icon: {fileID: 0}
  m_NavMeshLayer: 0
  m_StaticEditorFlags: 0
  m_IsActive: 0
--- !u!4 &2661849929538559481
Transform:
  m_ObjectHideFlags: 0
  m_CorrespondingSourceObject: {fileID: 0}
  m_PrefabInstance: {fileID: 0}
  m_PrefabAsset: {fileID: 0}
  m_GameObject: {fileID: 2573640454366300296}
  m_LocalRotation: {x: 0, y: 0, z: 0, w: 1}
  m_LocalPosition: {x: 0, y: 0, z: 0}
  m_LocalScale: {x: 1, y: 1, z: 1}
  m_Children:
  - {fileID: 6120768201087941404}
  - {fileID: 8588532748917080716}
  - {fileID: 8588532747338656773}
  m_Father: {fileID: 5404534713671246811}
  m_RootOrder: 3
  m_LocalEulerAnglesHint: {x: 0, y: 0, z: 0}
--- !u!1 &2837269078720538677
GameObject:
  m_ObjectHideFlags: 0
  m_CorrespondingSourceObject: {fileID: 0}
  m_PrefabInstance: {fileID: 0}
  m_PrefabAsset: {fileID: 0}
  serializedVersion: 6
  m_Component:
  - component: {fileID: 2837269078720538679}
  - component: {fileID: 2837269078720538676}
  - component: {fileID: 1823262703323532336}
  - component: {fileID: 5425150631691332392}
  - component: {fileID: 4279304436903676836}
  m_Layer: 9
  m_Name: Light_Door
  m_TagString: Untagged
  m_Icon: {fileID: 0}
  m_NavMeshLayer: 0
  m_StaticEditorFlags: 0
  m_IsActive: 1
--- !u!4 &2837269078720538679
Transform:
  m_ObjectHideFlags: 0
  m_CorrespondingSourceObject: {fileID: 0}
  m_PrefabInstance: {fileID: 0}
  m_PrefabAsset: {fileID: 0}
  m_GameObject: {fileID: 2837269078720538677}
  m_LocalRotation: {x: -0, y: -0, z: -0, w: 1}
  m_LocalPosition: {x: 0, y: 0, z: 0}
  m_LocalScale: {x: 0.75, y: 0.75, z: 0.75}
  m_Children: []
  m_Father: {fileID: 5404534713671246811}
  m_RootOrder: 1
  m_LocalEulerAnglesHint: {x: 0, y: 0, z: 0}
--- !u!114 &2837269078720538676
MonoBehaviour:
  m_ObjectHideFlags: 0
  m_CorrespondingSourceObject: {fileID: 0}
  m_PrefabInstance: {fileID: 0}
  m_PrefabAsset: {fileID: 0}
  m_GameObject: {fileID: 2837269078720538677}
  m_Enabled: 1
  m_EditorHideFlags: 0
  m_Script: {fileID: 11500000, guid: fd3b7ec2d9ca287468ffa0e795e730d6, type: 3}
  m_Name: 
  m_EditorClassIdentifier: 
  Door01: {fileID: 8588532748917080717}
  Door02: {fileID: 8588532747338656778}
  OpenSpeed: 0.5
  DoorEndPos: 0.65
  DoorTime: 0
  Open_AUD:
  - {fileID: 8300000, guid: 36bf2ffdcaa4ec241892b1109841fe75, type: 3}
  - {fileID: 8300000, guid: 0043e69fcd0640540a6d9ef7db7477e6, type: 3}
  - {fileID: 8300000, guid: f5d2925f1d67c2640a7cd2f26faa2105, type: 3}
  - {fileID: 8300000, guid: 25b64b37cd5eb5745bb25eb9662717dc, type: 3}
  SCP_AUD:
  - {fileID: 8300000, guid: 3284860a2232a7a4ea10427a52de1644, type: 3}
  Close_AUD:
  - {fileID: 8300000, guid: 9d276cfa9748a8448bc9614cc2faf18b, type: 3}
  - {fileID: 8300000, guid: 1e5b8b9923d06d943a419bb927b9c427, type: 3}
  - {fileID: 8300000, guid: a8642befb708ab04da0277bf69833bd5, type: 3}
  AUD: {fileID: 1823262703323532336}
  carveMesh: {fileID: 4279304436903676836}
  doorLink: {fileID: 2872566912411261639}
  UseParticle: 0
  switchOpen: 0
  scp173: 1
  ignoreSave: 1
  isDisabled: 0
--- !u!82 &1823262703323532336
AudioSource:
  m_ObjectHideFlags: 0
  m_CorrespondingSourceObject: {fileID: 0}
  m_PrefabInstance: {fileID: 0}
  m_PrefabAsset: {fileID: 0}
  m_GameObject: {fileID: 2837269078720538677}
  m_Enabled: 1
  serializedVersion: 4
  OutputAudioMixerGroup: {fileID: 243188032471989292, guid: 4cdd06a97de31484aa0429062392c9f2,
    type: 2}
  m_audioClip: {fileID: 0}
  m_PlayOnAwake: 1
  m_Volume: 0.4
  m_Pitch: 1
  Loop: 0
  Mute: 0
  Spatialize: 0
  SpatializePostEffects: 0
  Priority: 128
  DopplerLevel: 1
  MinDistance: 5
  MaxDistance: 30
  Pan2D: 0
  rolloffMode: 2
  BypassEffects: 0
  BypassListenerEffects: 0
  BypassReverbZones: 0
  rolloffCustomCurve:
    serializedVersion: 2
    m_Curve:
    - serializedVersion: 3
      time: 0.106090546
      value: 0.9999962
      inSlope: -4.0016
      outSlope: -4.0016
      tangentMode: 0
      weightedMode: 0
      inWeight: 0
      outWeight: 0
    - serializedVersion: 3
      time: 0.47785187
      value: 0.2767334
      inSlope: -1.0004
      outSlope: -1.0004
      tangentMode: 0
      weightedMode: 0
      inWeight: 0
      outWeight: 0
    - serializedVersion: 3
      time: 0.6863011
      value: 0.1407054
      inSlope: -0.14275254
      outSlope: -0.14275254
      tangentMode: 0
      weightedMode: 0
      inWeight: 0.33333334
      outWeight: 0.33333334
    - serializedVersion: 3
      time: 0.9127197
      value: 0.1100444
      inSlope: -0.059241056
      outSlope: -0.059241056
      tangentMode: 0
      weightedMode: 0
      inWeight: 0.33333334
      outWeight: 0.33333334
    - serializedVersion: 3
      time: 0.9381846
      value: 0
      inSlope: 0
      outSlope: 0
      tangentMode: 0
      weightedMode: 0
      inWeight: 0.33333334
      outWeight: 0.33333334
    m_PreInfinity: 2
    m_PostInfinity: 2
    m_RotationOrder: 4
  panLevelCustomCurve:
    serializedVersion: 2
    m_Curve:
    - serializedVersion: 3
      time: 0
      value: 1
      inSlope: 0
      outSlope: 0
      tangentMode: 0
      weightedMode: 0
      inWeight: 0.33333334
      outWeight: 0.33333334
    m_PreInfinity: 2
    m_PostInfinity: 2
    m_RotationOrder: 4
  spreadCustomCurve:
    serializedVersion: 2
    m_Curve:
    - serializedVersion: 3
      time: 0
      value: 0
      inSlope: 0
      outSlope: 0
      tangentMode: 0
      weightedMode: 0
      inWeight: 0.33333334
      outWeight: 0.33333334
    m_PreInfinity: 2
    m_PostInfinity: 2
    m_RotationOrder: 4
  reverbZoneMixCustomCurve:
    serializedVersion: 2
    m_Curve:
    - serializedVersion: 3
      time: 0
      value: 1
      inSlope: 0
      outSlope: 0
      tangentMode: 0
      weightedMode: 0
      inWeight: 0.33333334
      outWeight: 0.33333334
    m_PreInfinity: 2
    m_PostInfinity: 2
    m_RotationOrder: 4
--- !u!65 &5425150631691332392
BoxCollider:
  m_ObjectHideFlags: 0
  m_CorrespondingSourceObject: {fileID: 0}
  m_PrefabInstance: {fileID: 0}
  m_PrefabAsset: {fileID: 0}
  m_GameObject: {fileID: 2837269078720538677}
  m_Material: {fileID: 0}
  m_IsTrigger: 1
  m_Enabled: 1
  serializedVersion: 2
  m_Size: {x: 2, y: 3.33, z: 0.3}
  m_Center: {x: 0, y: 1.59, z: 0}
--- !u!208 &4279304436903676836
NavMeshObstacle:
  m_ObjectHideFlags: 0
  m_CorrespondingSourceObject: {fileID: 0}
  m_PrefabInstance: {fileID: 0}
  m_PrefabAsset: {fileID: 0}
  m_GameObject: {fileID: 2837269078720538677}
  m_Enabled: 1
  serializedVersion: 3
  m_Shape: 1
  m_Extents: {x: 1, y: 1.665, z: 0.15}
  m_MoveThreshold: 0.1
  m_Carve: 1
  m_CarveOnlyStationary: 1
  m_Center: {x: 0, y: 1.59, z: 0}
  m_TimeToStationary: 0.5
--- !u!1 &8139438254142872047
GameObject:
  m_ObjectHideFlags: 0
  m_CorrespondingSourceObject: {fileID: 0}
  m_PrefabInstance: {fileID: 0}
  m_PrefabAsset: {fileID: 0}
  serializedVersion: 6
  m_Component:
  - component: {fileID: 5404534713671246811}
  m_Layer: 0
  m_Name: ElevDoor_def
  m_TagString: Untagged
  m_Icon: {fileID: 0}
  m_NavMeshLayer: 0
  m_StaticEditorFlags: 0
  m_IsActive: 1
--- !u!4 &5404534713671246811
Transform:
  m_ObjectHideFlags: 0
  m_CorrespondingSourceObject: {fileID: 0}
  m_PrefabInstance: {fileID: 0}
  m_PrefabAsset: {fileID: 0}
  m_GameObject: {fileID: 8139438254142872047}
  m_LocalRotation: {x: 0, y: 0, z: 0, w: 1}
  m_LocalPosition: {x: 1.911, y: 0, z: 0.45568633}
  m_LocalScale: {x: 1, y: 1, z: 1}
  m_Children:
  - {fileID: 1225442949786159636}
  - {fileID: 2837269078720538679}
  - {fileID: 3425180759506200518}
  - {fileID: 2661849929538559481}
  m_Father: {fileID: 0}
  m_RootOrder: 0
  m_LocalEulerAnglesHint: {x: 0, y: 0, z: 0}
--- !u!1 &8588532747338656778
GameObject:
  m_ObjectHideFlags: 0
  m_CorrespondingSourceObject: {fileID: 0}
  m_PrefabInstance: {fileID: 0}
  m_PrefabAsset: {fileID: 0}
  serializedVersion: 6
  m_Component:
  - component: {fileID: 8588532747338656773}
  - component: {fileID: 4953664812803205313}
  m_Layer: 10
  m_Name: DoorCont2
  m_TagString: Untagged
  m_Icon: {fileID: 0}
  m_NavMeshLayer: 0
  m_StaticEditorFlags: 0
  m_IsActive: 1
--- !u!4 &8588532747338656773
Transform:
  m_ObjectHideFlags: 0
  m_CorrespondingSourceObject: {fileID: 0}
  m_PrefabInstance: {fileID: 0}
  m_PrefabAsset: {fileID: 0}
  m_GameObject: {fileID: 8588532747338656778}
  m_LocalRotation: {x: 0, y: 0, z: 0, w: 1}
  m_LocalPosition: {x: 0.006, y: 0, z: 0}
  m_LocalScale: {x: 0.75, y: 0.75, z: 0.75}
  m_Children:
  - {fileID: 7036977266588048218}
  m_Father: {fileID: 2661849929538559481}
  m_RootOrder: 2
  m_LocalEulerAnglesHint: {x: 0, y: 0, z: 0}
--- !u!65 &4953664812803205313
BoxCollider:
  m_ObjectHideFlags: 0
  m_CorrespondingSourceObject: {fileID: 0}
  m_PrefabInstance: {fileID: 0}
  m_PrefabAsset: {fileID: 0}
  m_GameObject: {fileID: 8588532747338656778}
  m_Material: {fileID: 0}
  m_IsTrigger: 0
  m_Enabled: 1
  serializedVersion: 2
  m_Size: {x: 0.9868145, y: 3.1876495, z: 0.31743252}
  m_Center: {x: -0.5065928, y: 1.5438251, z: -0.0044704876}
--- !u!1 &8588532748917080717
GameObject:
  m_ObjectHideFlags: 0
  m_CorrespondingSourceObject: {fileID: 0}
  m_PrefabInstance: {fileID: 0}
  m_PrefabAsset: {fileID: 0}
  serializedVersion: 6
  m_Component:
  - component: {fileID: 8588532748917080716}
  - component: {fileID: 5812842800838483223}
  m_Layer: 10
  m_Name: DoorCont1
  m_TagString: Untagged
  m_Icon: {fileID: 0}
  m_NavMeshLayer: 0
  m_StaticEditorFlags: 0
  m_IsActive: 1
--- !u!4 &8588532748917080716
Transform:
  m_ObjectHideFlags: 0
  m_CorrespondingSourceObject: {fileID: 0}
  m_PrefabInstance: {fileID: 0}
  m_PrefabAsset: {fileID: 0}
  m_GameObject: {fileID: 8588532748917080717}
  m_LocalRotation: {x: 0, y: 1, z: 0, w: 0}
  m_LocalPosition: {x: -0.006, y: 0, z: 0}
  m_LocalScale: {x: 0.75, y: 0.75, z: 0.75}
  m_Children:
  - {fileID: 7036977266772228496}
  m_Father: {fileID: 2661849929538559481}
  m_RootOrder: 1
  m_LocalEulerAnglesHint: {x: 0, y: 180, z: 0}
--- !u!65 &5812842800838483223
BoxCollider:
  m_ObjectHideFlags: 0
  m_CorrespondingSourceObject: {fileID: 0}
  m_PrefabInstance: {fileID: 0}
  m_PrefabAsset: {fileID: 0}
  m_GameObject: {fileID: 8588532748917080717}
  m_Material: {fileID: 0}
  m_IsTrigger: 0
  m_Enabled: 1
  serializedVersion: 2
  m_Size: {x: 0.9933772, y: 3.1876495, z: 0.31743252}
  m_Center: {x: -0.5033116, y: 1.543825, z: 0.004470488}
--- !u!1001 &3950292919017122599
PrefabInstance:
  m_ObjectHideFlags: 0
  serializedVersion: 2
  m_Modification:
    m_TransformParent: {fileID: 5404534713671246811}
    m_Modifications:
    - target: {fileID: 225344393597093137, guid: f03c9da0555287f42b4a99a37d66d188,
        type: 3}
      propertyPath: m_Name
      value: DistanceShut
      objectReference: {fileID: 0}
    - target: {fileID: 1827033982661758177, guid: f03c9da0555287f42b4a99a37d66d188,
        type: 3}
      propertyPath: m_RootOrder
      value: 2
      objectReference: {fileID: 0}
    - target: {fileID: 1827033982661758177, guid: f03c9da0555287f42b4a99a37d66d188,
        type: 3}
      propertyPath: m_LocalPosition.x
      value: 0
      objectReference: {fileID: 0}
    - target: {fileID: 1827033982661758177, guid: f03c9da0555287f42b4a99a37d66d188,
        type: 3}
      propertyPath: m_LocalPosition.y
      value: 0
      objectReference: {fileID: 0}
    - target: {fileID: 1827033982661758177, guid: f03c9da0555287f42b4a99a37d66d188,
        type: 3}
      propertyPath: m_LocalPosition.z
      value: 0
      objectReference: {fileID: 0}
    - target: {fileID: 1827033982661758177, guid: f03c9da0555287f42b4a99a37d66d188,
        type: 3}
      propertyPath: m_LocalRotation.w
      value: 1
      objectReference: {fileID: 0}
    - target: {fileID: 1827033982661758177, guid: f03c9da0555287f42b4a99a37d66d188,
        type: 3}
      propertyPath: m_LocalRotation.x
      value: 0
      objectReference: {fileID: 0}
    - target: {fileID: 1827033982661758177, guid: f03c9da0555287f42b4a99a37d66d188,
        type: 3}
      propertyPath: m_LocalRotation.y
      value: 0
      objectReference: {fileID: 0}
    - target: {fileID: 1827033982661758177, guid: f03c9da0555287f42b4a99a37d66d188,
        type: 3}
      propertyPath: m_LocalRotation.z
      value: 0
      objectReference: {fileID: 0}
    - target: {fileID: 1827033982661758177, guid: f03c9da0555287f42b4a99a37d66d188,
        type: 3}
      propertyPath: m_LocalEulerAnglesHint.x
      value: 0
      objectReference: {fileID: 0}
    - target: {fileID: 1827033982661758177, guid: f03c9da0555287f42b4a99a37d66d188,
        type: 3}
      propertyPath: m_LocalEulerAnglesHint.y
      value: 0
      objectReference: {fileID: 0}
    - target: {fileID: 1827033982661758177, guid: f03c9da0555287f42b4a99a37d66d188,
        type: 3}
      propertyPath: m_LocalEulerAnglesHint.z
      value: 0
      objectReference: {fileID: 0}
    - target: {fileID: 3276537589267162220, guid: f03c9da0555287f42b4a99a37d66d188,
        type: 3}
      propertyPath: Contains
      value: 
      objectReference: {fileID: 2573640454366300296}
    m_RemovedComponents: []
  m_SourcePrefab: {fileID: 100100000, guid: f03c9da0555287f42b4a99a37d66d188, type: 3}
--- !u!4 &3425180759506200518 stripped
Transform:
  m_CorrespondingSourceObject: {fileID: 1827033982661758177, guid: f03c9da0555287f42b4a99a37d66d188,
    type: 3}
  m_PrefabInstance: {fileID: 3950292919017122599}
  m_PrefabAsset: {fileID: 0}
--- !u!1001 &6120768201088065996
PrefabInstance:
  m_ObjectHideFlags: 0
  serializedVersion: 2
  m_Modification:
    m_TransformParent: {fileID: 2661849929538559481}
    m_Modifications:
    - target: {fileID: 100080, guid: 3e8341fa8b353d0429a688b000f50ed7, type: 3}
      propertyPath: m_Name
      value: DoorFrame
      objectReference: {fileID: 0}
    - target: {fileID: 400080, guid: 3e8341fa8b353d0429a688b000f50ed7, type: 3}
      propertyPath: m_RootOrder
      value: 0
      objectReference: {fileID: 0}
    - target: {fileID: 400080, guid: 3e8341fa8b353d0429a688b000f50ed7, type: 3}
      propertyPath: m_LocalScale.x
      value: 0.75
      objectReference: {fileID: 0}
    - target: {fileID: 400080, guid: 3e8341fa8b353d0429a688b000f50ed7, type: 3}
      propertyPath: m_LocalScale.y
      value: 0.75
      objectReference: {fileID: 0}
    - target: {fileID: 400080, guid: 3e8341fa8b353d0429a688b000f50ed7, type: 3}
      propertyPath: m_LocalScale.z
      value: 0.75
      objectReference: {fileID: 0}
    - target: {fileID: 400080, guid: 3e8341fa8b353d0429a688b000f50ed7, type: 3}
      propertyPath: m_LocalPosition.x
      value: 0
      objectReference: {fileID: 0}
    - target: {fileID: 400080, guid: 3e8341fa8b353d0429a688b000f50ed7, type: 3}
      propertyPath: m_LocalPosition.y
      value: 0
      objectReference: {fileID: 0}
    - target: {fileID: 400080, guid: 3e8341fa8b353d0429a688b000f50ed7, type: 3}
      propertyPath: m_LocalPosition.z
      value: 0
      objectReference: {fileID: 0}
    - target: {fileID: 400080, guid: 3e8341fa8b353d0429a688b000f50ed7, type: 3}
      propertyPath: m_LocalRotation.w
      value: 1
      objectReference: {fileID: 0}
    - target: {fileID: 400080, guid: 3e8341fa8b353d0429a688b000f50ed7, type: 3}
      propertyPath: m_LocalRotation.x
      value: -0
      objectReference: {fileID: 0}
    - target: {fileID: 400080, guid: 3e8341fa8b353d0429a688b000f50ed7, type: 3}
      propertyPath: m_LocalRotation.y
      value: -0
      objectReference: {fileID: 0}
    - target: {fileID: 400080, guid: 3e8341fa8b353d0429a688b000f50ed7, type: 3}
      propertyPath: m_LocalRotation.z
      value: -0
      objectReference: {fileID: 0}
    - target: {fileID: 400080, guid: 3e8341fa8b353d0429a688b000f50ed7, type: 3}
      propertyPath: m_LocalEulerAnglesHint.x
      value: 0
      objectReference: {fileID: 0}
    - target: {fileID: 400080, guid: 3e8341fa8b353d0429a688b000f50ed7, type: 3}
      propertyPath: m_LocalEulerAnglesHint.y
      value: 0
      objectReference: {fileID: 0}
    - target: {fileID: 400080, guid: 3e8341fa8b353d0429a688b000f50ed7, type: 3}
      propertyPath: m_LocalEulerAnglesHint.z
      value: 0
      objectReference: {fileID: 0}
    m_RemovedComponents: []
  m_SourcePrefab: {fileID: 100100000, guid: 3e8341fa8b353d0429a688b000f50ed7, type: 3}
--- !u!4 &6120768201087941404 stripped
Transform:
  m_CorrespondingSourceObject: {fileID: 400080, guid: 3e8341fa8b353d0429a688b000f50ed7,
    type: 3}
  m_PrefabInstance: {fileID: 6120768201088065996}
  m_PrefabAsset: {fileID: 0}
--- !u!1001 &7036977266588172762
PrefabInstance:
  m_ObjectHideFlags: 0
  serializedVersion: 2
  m_Modification:
    m_TransformParent: {fileID: 8588532747338656773}
    m_Modifications:
    - target: {fileID: 100000, guid: 1a351bf486878e8478dd572bc4fb27eb, type: 3}
      propertyPath: m_Name
      value: elevatordoor
      objectReference: {fileID: 0}
    - target: {fileID: 400000, guid: 1a351bf486878e8478dd572bc4fb27eb, type: 3}
      propertyPath: m_RootOrder
      value: 0
      objectReference: {fileID: 0}
    - target: {fileID: 400000, guid: 1a351bf486878e8478dd572bc4fb27eb, type: 3}
      propertyPath: m_LocalPosition.x
      value: -0
      objectReference: {fileID: 0}
    - target: {fileID: 400000, guid: 1a351bf486878e8478dd572bc4fb27eb, type: 3}
      propertyPath: m_LocalPosition.y
      value: 0
      objectReference: {fileID: 0}
    - target: {fileID: 400000, guid: 1a351bf486878e8478dd572bc4fb27eb, type: 3}
      propertyPath: m_LocalPosition.z
      value: 0
      objectReference: {fileID: 0}
    - target: {fileID: 400000, guid: 1a351bf486878e8478dd572bc4fb27eb, type: 3}
      propertyPath: m_LocalRotation.w
      value: 0
      objectReference: {fileID: 0}
    - target: {fileID: 400000, guid: 1a351bf486878e8478dd572bc4fb27eb, type: 3}
      propertyPath: m_LocalRotation.x
      value: 0
      objectReference: {fileID: 0}
    - target: {fileID: 400000, guid: 1a351bf486878e8478dd572bc4fb27eb, type: 3}
      propertyPath: m_LocalRotation.y
      value: 1
      objectReference: {fileID: 0}
    - target: {fileID: 400000, guid: 1a351bf486878e8478dd572bc4fb27eb, type: 3}
      propertyPath: m_LocalRotation.z
      value: 0
      objectReference: {fileID: 0}
    - target: {fileID: 400000, guid: 1a351bf486878e8478dd572bc4fb27eb, type: 3}
      propertyPath: m_LocalEulerAnglesHint.x
      value: 0
      objectReference: {fileID: 0}
    - target: {fileID: 400000, guid: 1a351bf486878e8478dd572bc4fb27eb, type: 3}
      propertyPath: m_LocalEulerAnglesHint.y
      value: 180
      objectReference: {fileID: 0}
    - target: {fileID: 400000, guid: 1a351bf486878e8478dd572bc4fb27eb, type: 3}
      propertyPath: m_LocalEulerAnglesHint.z
      value: 0
      objectReference: {fileID: 0}
    m_RemovedComponents: []
  m_SourcePrefab: {fileID: 100100000, guid: 1a351bf486878e8478dd572bc4fb27eb, type: 3}
--- !u!4 &7036977266588048218 stripped
Transform:
  m_CorrespondingSourceObject: {fileID: 400000, guid: 1a351bf486878e8478dd572bc4fb27eb,
    type: 3}
  m_PrefabInstance: {fileID: 7036977266588172762}
  m_PrefabAsset: {fileID: 0}
--- !u!1001 &7036977266772091664
PrefabInstance:
  m_ObjectHideFlags: 0
  serializedVersion: 2
  m_Modification:
    m_TransformParent: {fileID: 8588532748917080716}
    m_Modifications:
    - target: {fileID: 100000, guid: 1a351bf486878e8478dd572bc4fb27eb, type: 3}
      propertyPath: m_Name
      value: elevatordoor
      objectReference: {fileID: 0}
    - target: {fileID: 400000, guid: 1a351bf486878e8478dd572bc4fb27eb, type: 3}
      propertyPath: m_RootOrder
      value: 0
      objectReference: {fileID: 0}
    - target: {fileID: 400000, guid: 1a351bf486878e8478dd572bc4fb27eb, type: 3}
      propertyPath: m_LocalPosition.x
      value: -0
      objectReference: {fileID: 0}
    - target: {fileID: 400000, guid: 1a351bf486878e8478dd572bc4fb27eb, type: 3}
      propertyPath: m_LocalPosition.y
      value: 0
      objectReference: {fileID: 0}
    - target: {fileID: 400000, guid: 1a351bf486878e8478dd572bc4fb27eb, type: 3}
      propertyPath: m_LocalPosition.z
      value: 0
      objectReference: {fileID: 0}
    - target: {fileID: 400000, guid: 1a351bf486878e8478dd572bc4fb27eb, type: 3}
      propertyPath: m_LocalRotation.w
      value: 0
      objectReference: {fileID: 0}
    - target: {fileID: 400000, guid: 1a351bf486878e8478dd572bc4fb27eb, type: 3}
      propertyPath: m_LocalRotation.x
      value: 0
      objectReference: {fileID: 0}
    - target: {fileID: 400000, guid: 1a351bf486878e8478dd572bc4fb27eb, type: 3}
      propertyPath: m_LocalRotation.y
      value: 1
      objectReference: {fileID: 0}
    - target: {fileID: 400000, guid: 1a351bf486878e8478dd572bc4fb27eb, type: 3}
      propertyPath: m_LocalRotation.z
      value: 0
      objectReference: {fileID: 0}
    - target: {fileID: 400000, guid: 1a351bf486878e8478dd572bc4fb27eb, type: 3}
      propertyPath: m_LocalEulerAnglesHint.x
      value: 0
      objectReference: {fileID: 0}
    - target: {fileID: 400000, guid: 1a351bf486878e8478dd572bc4fb27eb, type: 3}
      propertyPath: m_LocalEulerAnglesHint.y
      value: 180
      objectReference: {fileID: 0}
    - target: {fileID: 400000, guid: 1a351bf486878e8478dd572bc4fb27eb, type: 3}
      propertyPath: m_LocalEulerAnglesHint.z
      value: 0
      objectReference: {fileID: 0}
    m_RemovedComponents: []
  m_SourcePrefab: {fileID: 100100000, guid: 1a351bf486878e8478dd572bc4fb27eb, type: 3}
--- !u!4 &7036977266772228496 stripped
Transform:
  m_CorrespondingSourceObject: {fileID: 400000, guid: 1a351bf486878e8478dd572bc4fb27eb,
    type: 3}
  m_PrefabInstance: {fileID: 7036977266772091664}
  m_PrefabAsset: {fileID: 0}
