%YAML 1.1
%TAG !u! tag:unity3d.com,2011:
--- !u!114 &11400000
MonoBehaviour:
  m_ObjectHideFlags: 0
  m_CorrespondingSourceObject: {fileID: 0}
  m_PrefabInstance: {fileID: 0}
  m_PrefabAsset: {fileID: 0}
  m_GameObject: {fileID: 0}
  m_Enabled: 1
  m_EditorHideFlags: 0
  m_Script: {fileID: 11500000, guid: 1895ea64f7a9fab4ca4aef18fe09fb0f, type: 3}
  m_Name: DOC_SCP1048
  m_EditorClassIdentifier: 
  colCenter: {x: 0.00023879111, y: 0.0051007606, z: 0.0024784505}
  colSize: {x: 0.49118653, y: 0.018859543, z: 0.6664501}
  mass: 1
  itemName: doc1048
  icon: {fileID: 21300000, guid: 6384ac8a73f6e0a45b8e4a8abd446ef4, type: 3}
  deleteUse: 0
  hasEffect: 0
  isFem: 0
  isUnique: 1
  keepInv: 0
  Effects:
  - affected: 0
    effect:
      permanent: 0
      time: 0
      max: 0
      min: 0
      value: 0
      multiplier: 0
  - affected: 0
    effect:
      permanent: 0
      time: 0
      max: 0
      min: 0
      value: 0
      multiplier: 0
  ItemModel: {fileID: 100002, guid: 89ab7a504d47aea42b6e9a8a4a18bbfd, type: 3}
  valueFloat: 0
  valueInt: 0
  SFX: 0
  useTime: 0
  Overlay: {fileID: 0}
  protectGas: 0
  protectCogn: 0
  autoEquip: 0
  part: 0
  filename: doc1048
