%YAML 1.1
%TAG !u! tag:unity3d.com,2011:
--- !u!114 &11400000
MonoBehaviour:
  m_ObjectHideFlags: 0
  m_CorrespondingSourceObject: {fileID: 0}
  m_PrefabInstance: {fileID: 0}
  m_PrefabAsset: {fileID: 0}
  m_GameObject: {fileID: 0}
  m_Enabled: 1
  m_EditorHideFlags: 0
  m_Script: {fileID: 11500000, guid: c57386a160ab2e541893d65f49ad28d0, type: 3}
  m_Name: SuperGasMask
  m_EditorClassIdentifier: 
  colCenter: {x: 0.0019891, y: 0.07459114, z: -0.004300624}
  colSize: {x: 0.1971717, y: 0.1288313, z: 0.2859235}
  mass: 1
  itemName: gasmask2
  icon: {fileID: 21300000, guid: 899c7119eaff67b43ab861249f1428ca, type: 3}
  deleteUse: 0
  hasEffect: 1
  isFem: 1
  isUnique: 0
  keepInv: 0
  Effects:
  - affected: 1
    effect:
      permanent: 0
      time: -1
      max: -1
      min: 2
      value: -1
      multiplier: -1
  ItemModel: {fileID: 100000, guid: 92c0dcd075b999f41a4a862f510335ee, type: 3}
  valueFloat: 0
  valueInt: 0
  SFX: 2
  useTime: 1
  Overlay: {fileID: 21300000, guid: 6a6274d5470782742a737d067fa8fac9, type: 3}
  protectGas: 1
  protectCogn: 0
  autoEquip: 0
  part: 0
