%YAML 1.1
%TAG !u! tag:unity3d.com,2011:
--- !u!1 &2102817942501629058
GameObject:
  m_ObjectHideFlags: 0
  m_CorrespondingSourceObject: {fileID: 0}
  m_PrefabInstance: {fileID: 0}
  m_PrefabAsset: {fileID: 0}
  serializedVersion: 6
  m_Component:
  - component: {fileID: 5203765555836095934}
  m_Layer: 11
  m_Name: SpawnHazmat
  m_TagString: Untagged
  m_Icon: {fileID: 0}
  m_NavMeshLayer: 0
  m_StaticEditorFlags: 0
  m_IsActive: 1
--- !u!4 &5203765555836095934
Transform:
  m_ObjectHideFlags: 0
  m_CorrespondingSourceObject: {fileID: 0}
  m_PrefabInstance: {fileID: 0}
  m_PrefabAsset: {fileID: 0}
  m_GameObject: {fileID: 2102817942501629058}
  m_LocalRotation: {x: 0, y: 0.7071068, z: 0, w: 0.7071068}
  m_LocalPosition: {x: 0.167, y: -37.825, z: 2.955}
  m_LocalScale: {x: 10, y: 10, z: 10}
  m_Children: []
  m_Father: {fileID: 8215106919649264068}
  m_RootOrder: 9
  m_LocalEulerAnglesHint: {x: 0, y: 90, z: 0}
--- !u!1 &5195664099760974846
GameObject:
  m_ObjectHideFlags: 0
  m_CorrespondingSourceObject: {fileID: 0}
  m_PrefabInstance: {fileID: 0}
  m_PrefabAsset: {fileID: 0}
  serializedVersion: 6
  m_Component:
  - component: {fileID: 7351726453823431690}
  - component: {fileID: 2944275780802755207}
  m_Layer: 0
  m_Name: Point Light (9)
  m_TagString: Untagged
  m_Icon: {fileID: 0}
  m_NavMeshLayer: 0
  m_StaticEditorFlags: 0
  m_IsActive: 1
--- !u!4 &7351726453823431690
Transform:
  m_ObjectHideFlags: 0
  m_CorrespondingSourceObject: {fileID: 0}
  m_PrefabInstance: {fileID: 0}
  m_PrefabAsset: {fileID: 0}
  m_GameObject: {fileID: 5195664099760974846}
  m_LocalRotation: {x: 0, y: 0.7071068, z: 0, w: 0.7071068}
  m_LocalPosition: {x: 0, y: 3.223, z: -5.887}
  m_LocalScale: {x: 1, y: 1, z: 1}
  m_Children: []
  m_Father: {fileID: 8215106919924017903}
  m_RootOrder: 10
  m_LocalEulerAnglesHint: {x: 0, y: 90, z: 0}
--- !u!108 &2944275780802755207
Light:
  m_ObjectHideFlags: 0
  m_CorrespondingSourceObject: {fileID: 0}
  m_PrefabInstance: {fileID: 0}
  m_PrefabAsset: {fileID: 0}
  m_GameObject: {fileID: 5195664099760974846}
  m_Enabled: 1
  serializedVersion: 10
  m_Type: 2
  m_Shape: 0
  m_Color: {r: 1, g: 1, b: 1, a: 1}
  m_Intensity: 1.42
  m_Range: 10.56
  m_SpotAngle: 30
  m_InnerSpotAngle: 21.80208
  m_CookieSize: 10
  m_Shadows:
    m_Type: 0
    m_Resolution: 0
    m_CustomResolution: -1
    m_Strength: 1
    m_Bias: 0.13
    m_NormalBias: 0.4
    m_NearPlane: 0.2
    m_CullingMatrixOverride:
      e00: 1
      e01: 0
      e02: 0
      e03: 0
      e10: 0
      e11: 1
      e12: 0
      e13: 0
      e20: 0
      e21: 0
      e22: 1
      e23: 0
      e30: 0
      e31: 0
      e32: 0
      e33: 1
    m_UseCullingMatrixOverride: 0
  m_Cookie: {fileID: 8900000, guid: 93ed0b8d7e1b4d143a0e8549ee0a977a, type: 2}
  m_DrawHalo: 0
  m_Flare: {fileID: 12100000, guid: deb58512da518644ab6ecdf2035b37b1, type: 2}
  m_RenderMode: 2
  m_CullingMask:
    serializedVersion: 2
    m_Bits: 4294967295
  m_RenderingLayerMask: 1
  m_Lightmapping: 4
  m_LightShadowCasterMode: 0
  m_AreaSize: {x: 1, y: 1}
  m_BounceIntensity: 1
  m_ColorTemperature: 6570
  m_UseColorTemperature: 0
  m_BoundingSphereOverride: {x: 0, y: 0, z: 0, w: 0}
  m_UseBoundingSphereOverride: 0
  m_UseViewFrustumForShadowCasterCull: 1
  m_ShadowRadius: 0
  m_ShadowAngle: 0
--- !u!1 &6639366575293754623
GameObject:
  m_ObjectHideFlags: 0
  m_CorrespondingSourceObject: {fileID: 0}
  m_PrefabInstance: {fileID: 0}
  m_PrefabAsset: {fileID: 0}
  serializedVersion: 6
  m_Component:
  - component: {fileID: 318175616852589204}
  - component: {fileID: 7526752441805661970}
  m_Layer: 0
  m_Name: Point Light (8)
  m_TagString: Untagged
  m_Icon: {fileID: 0}
  m_NavMeshLayer: 0
  m_StaticEditorFlags: 0
  m_IsActive: 1
--- !u!4 &318175616852589204
Transform:
  m_ObjectHideFlags: 0
  m_CorrespondingSourceObject: {fileID: 0}
  m_PrefabInstance: {fileID: 0}
  m_PrefabAsset: {fileID: 0}
  m_GameObject: {fileID: 6639366575293754623}
  m_LocalRotation: {x: 0, y: 0.7071068, z: 0, w: 0.7071068}
  m_LocalPosition: {x: 0, y: 3.223, z: 5.887}
  m_LocalScale: {x: 1, y: 1, z: 1}
  m_Children: []
  m_Father: {fileID: 8215106919924017903}
  m_RootOrder: 9
  m_LocalEulerAnglesHint: {x: 0, y: 90, z: 0}
--- !u!108 &7526752441805661970
Light:
  m_ObjectHideFlags: 0
  m_CorrespondingSourceObject: {fileID: 0}
  m_PrefabInstance: {fileID: 0}
  m_PrefabAsset: {fileID: 0}
  m_GameObject: {fileID: 6639366575293754623}
  m_Enabled: 1
  serializedVersion: 10
  m_Type: 2
  m_Shape: 0
  m_Color: {r: 1, g: 1, b: 1, a: 1}
  m_Intensity: 1.42
  m_Range: 10.56
  m_SpotAngle: 30
  m_InnerSpotAngle: 21.80208
  m_CookieSize: 10
  m_Shadows:
    m_Type: 0
    m_Resolution: 0
    m_CustomResolution: -1
    m_Strength: 1
    m_Bias: 0.13
    m_NormalBias: 0.4
    m_NearPlane: 0.2
    m_CullingMatrixOverride:
      e00: 1
      e01: 0
      e02: 0
      e03: 0
      e10: 0
      e11: 1
      e12: 0
      e13: 0
      e20: 0
      e21: 0
      e22: 1
      e23: 0
      e30: 0
      e31: 0
      e32: 0
      e33: 1
    m_UseCullingMatrixOverride: 0
  m_Cookie: {fileID: 8900000, guid: 93ed0b8d7e1b4d143a0e8549ee0a977a, type: 2}
  m_DrawHalo: 0
  m_Flare: {fileID: 12100000, guid: deb58512da518644ab6ecdf2035b37b1, type: 2}
  m_RenderMode: 2
  m_CullingMask:
    serializedVersion: 2
    m_Bits: 4294967295
  m_RenderingLayerMask: 1
  m_Lightmapping: 4
  m_LightShadowCasterMode: 0
  m_AreaSize: {x: 1, y: 1}
  m_BounceIntensity: 1
  m_ColorTemperature: 6570
  m_UseColorTemperature: 0
  m_BoundingSphereOverride: {x: 0, y: 0, z: 0, w: 0}
  m_UseBoundingSphereOverride: 0
  m_UseViewFrustumForShadowCasterCull: 1
  m_ShadowRadius: 0
  m_ShadowAngle: 0
--- !u!1 &8215106918440725618
GameObject:
  m_ObjectHideFlags: 0
  m_CorrespondingSourceObject: {fileID: 0}
  m_PrefabInstance: {fileID: 0}
  m_PrefabAsset: {fileID: 0}
  serializedVersion: 6
  m_Component:
  - component: {fileID: 8215106918440725619}
  - component: {fileID: 8215106918440725628}
  m_Layer: 0
  m_Name: Point Light
  m_TagString: Untagged
  m_Icon: {fileID: 0}
  m_NavMeshLayer: 0
  m_StaticEditorFlags: 0
  m_IsActive: 1
--- !u!4 &8215106918440725619
Transform:
  m_ObjectHideFlags: 0
  m_CorrespondingSourceObject: {fileID: 0}
  m_PrefabInstance: {fileID: 0}
  m_PrefabAsset: {fileID: 0}
  m_GameObject: {fileID: 8215106918440725618}
  m_LocalRotation: {x: 0, y: 0.7071068, z: 0, w: 0.7071068}
  m_LocalPosition: {x: 0, y: 3.203, z: 0}
  m_LocalScale: {x: 1, y: 1, z: 1}
  m_Children: []
  m_Father: {fileID: 8215106919924017903}
  m_RootOrder: 1
  m_LocalEulerAnglesHint: {x: 0, y: 90, z: 0}
--- !u!108 &8215106918440725628
Light:
  m_ObjectHideFlags: 0
  m_CorrespondingSourceObject: {fileID: 0}
  m_PrefabInstance: {fileID: 0}
  m_PrefabAsset: {fileID: 0}
  m_GameObject: {fileID: 8215106918440725618}
  m_Enabled: 1
  serializedVersion: 10
  m_Type: 2
  m_Shape: 0
  m_Color: {r: 1, g: 1, b: 1, a: 1}
  m_Intensity: 1.42
  m_Range: 10.56
  m_SpotAngle: 30
  m_InnerSpotAngle: 21.80208
  m_CookieSize: 10
  m_Shadows:
    m_Type: 0
    m_Resolution: 0
    m_CustomResolution: -1
    m_Strength: 1
    m_Bias: 0.13
    m_NormalBias: 0.4
    m_NearPlane: 0.2
    m_CullingMatrixOverride:
      e00: 1
      e01: 0
      e02: 0
      e03: 0
      e10: 0
      e11: 1
      e12: 0
      e13: 0
      e20: 0
      e21: 0
      e22: 1
      e23: 0
      e30: 0
      e31: 0
      e32: 0
      e33: 1
    m_UseCullingMatrixOverride: 0
  m_Cookie: {fileID: 8900000, guid: 93ed0b8d7e1b4d143a0e8549ee0a977a, type: 2}
  m_DrawHalo: 0
  m_Flare: {fileID: 12100000, guid: deb58512da518644ab6ecdf2035b37b1, type: 2}
  m_RenderMode: 2
  m_CullingMask:
    serializedVersion: 2
    m_Bits: 4294967295
  m_RenderingLayerMask: 1
  m_Lightmapping: 4
  m_LightShadowCasterMode: 0
  m_AreaSize: {x: 1, y: 1}
  m_BounceIntensity: 1
  m_ColorTemperature: 6570
  m_UseColorTemperature: 0
  m_BoundingSphereOverride: {x: 0, y: 0, z: 0, w: 0}
  m_UseBoundingSphereOverride: 0
  m_UseViewFrustumForShadowCasterCull: 1
  m_ShadowRadius: 0
  m_ShadowAngle: 0
--- !u!1 &8215106918641684650
GameObject:
  m_ObjectHideFlags: 0
  m_CorrespondingSourceObject: {fileID: 0}
  m_PrefabInstance: {fileID: 0}
  m_PrefabAsset: {fileID: 0}
  serializedVersion: 6
  m_Component:
  - component: {fileID: 8215106918641684651}
  - component: {fileID: 8215106918641684692}
  m_Layer: 0
  m_Name: Point Light (6)
  m_TagString: Untagged
  m_Icon: {fileID: 0}
  m_NavMeshLayer: 0
  m_StaticEditorFlags: 0
  m_IsActive: 1
--- !u!4 &8215106918641684651
Transform:
  m_ObjectHideFlags: 0
  m_CorrespondingSourceObject: {fileID: 0}
  m_PrefabInstance: {fileID: 0}
  m_PrefabAsset: {fileID: 0}
  m_GameObject: {fileID: 8215106918641684650}
  m_LocalRotation: {x: -0, y: -0, z: -0, w: 1}
  m_LocalPosition: {x: 2.868, y: -35.026, z: -0.241}
  m_LocalScale: {x: 1, y: 1, z: 1}
  m_Children: []
  m_Father: {fileID: 8215106919924017903}
  m_RootOrder: 7
  m_LocalEulerAnglesHint: {x: 0, y: 0, z: 0}
--- !u!108 &8215106918641684692
Light:
  m_ObjectHideFlags: 0
  m_CorrespondingSourceObject: {fileID: 0}
  m_PrefabInstance: {fileID: 0}
  m_PrefabAsset: {fileID: 0}
  m_GameObject: {fileID: 8215106918641684650}
  m_Enabled: 1
  serializedVersion: 10
  m_Type: 2
  m_Shape: 0
  m_Color: {r: 1, g: 1, b: 1, a: 1}
  m_Intensity: 1.69
  m_Range: 7.32
  m_SpotAngle: 30
  m_InnerSpotAngle: 21.80208
  m_CookieSize: 10
  m_Shadows:
    m_Type: 2
    m_Resolution: -1
    m_CustomResolution: -1
    m_Strength: 0.604
    m_Bias: 0.02
    m_NormalBias: 0.4
    m_NearPlane: 0.2
    m_CullingMatrixOverride:
      e00: 1
      e01: 0
      e02: 0
      e03: 0
      e10: 0
      e11: 1
      e12: 0
      e13: 0
      e20: 0
      e21: 0
      e22: 1
      e23: 0
      e30: 0
      e31: 0
      e32: 0
      e33: 1
    m_UseCullingMatrixOverride: 0
  m_Cookie: {fileID: 0}
  m_DrawHalo: 0
  m_Flare: {fileID: 12100000, guid: deb58512da518644ab6ecdf2035b37b1, type: 2}
  m_RenderMode: 1
  m_CullingMask:
    serializedVersion: 2
    m_Bits: 4294967295
  m_RenderingLayerMask: 1
  m_Lightmapping: 4
  m_LightShadowCasterMode: 0
  m_AreaSize: {x: 1, y: 1}
  m_BounceIntensity: 1
  m_ColorTemperature: 6570
  m_UseColorTemperature: 0
  m_BoundingSphereOverride: {x: 0, y: 0, z: 0, w: 0}
  m_UseBoundingSphereOverride: 0
  m_UseViewFrustumForShadowCasterCull: 1
  m_ShadowRadius: 0
  m_ShadowAngle: 0
--- !u!1 &8215106918812465123
GameObject:
  m_ObjectHideFlags: 0
  m_CorrespondingSourceObject: {fileID: 0}
  m_PrefabInstance: {fileID: 0}
  m_PrefabAsset: {fileID: 0}
  serializedVersion: 6
  m_Component:
  - component: {fileID: 8215106918812465132}
  - component: {fileID: 8215106918812465133}
  m_Layer: 0
  m_Name: NavMesh Modifier Volume
  m_TagString: Untagged
  m_Icon: {fileID: 0}
  m_NavMeshLayer: 0
  m_StaticEditorFlags: 0
  m_IsActive: 1
--- !u!4 &8215106918812465132
Transform:
  m_ObjectHideFlags: 0
  m_CorrespondingSourceObject: {fileID: 0}
  m_PrefabInstance: {fileID: 0}
  m_PrefabAsset: {fileID: 0}
  m_GameObject: {fileID: 8215106918812465123}
  m_LocalRotation: {x: -0, y: -0, z: -0, w: 1}
  m_LocalPosition: {x: 0, y: 5.61, z: 0}
  m_LocalScale: {x: 1, y: 1, z: 1}
  m_Children: []
  m_Father: {fileID: 8215106919812141901}
  m_RootOrder: 1
  m_LocalEulerAnglesHint: {x: 0, y: 0, z: 0}
--- !u!114 &8215106918812465133
MonoBehaviour:
  m_ObjectHideFlags: 0
  m_CorrespondingSourceObject: {fileID: 0}
  m_PrefabInstance: {fileID: 0}
  m_PrefabAsset: {fileID: 0}
  m_GameObject: {fileID: 8215106918812465123}
  m_Enabled: 1
  m_EditorHideFlags: 0
  m_Script: {fileID: 11500000, guid: 35e95dc5ff2b64380880dd7ac5922847, type: 3}
  m_Name: 
  m_EditorClassIdentifier: 
  m_Size: {x: 7.35, y: 5.49, z: 11.11}
  m_Center: {x: 0, y: 1, z: 0}
  m_Area: 1
  m_AffectedAgents: ffffffff
--- !u!1 &8215106918915368657
GameObject:
  m_ObjectHideFlags: 0
  m_CorrespondingSourceObject: {fileID: 0}
  m_PrefabInstance: {fileID: 0}
  m_PrefabAsset: {fileID: 0}
  serializedVersion: 6
  m_Component:
  - component: {fileID: 8215106918915368658}
  - component: {fileID: 8215106918915368659}
  m_Layer: 0
  m_Name: Point Light (4)
  m_TagString: Untagged
  m_Icon: {fileID: 0}
  m_NavMeshLayer: 0
  m_StaticEditorFlags: 0
  m_IsActive: 1
--- !u!4 &8215106918915368658
Transform:
  m_ObjectHideFlags: 0
  m_CorrespondingSourceObject: {fileID: 0}
  m_PrefabInstance: {fileID: 0}
  m_PrefabAsset: {fileID: 0}
  m_GameObject: {fileID: 8215106918915368657}
  m_LocalRotation: {x: 0, y: 0, z: 0, w: 1}
  m_LocalPosition: {x: -4.68, y: -35.3, z: 4.483}
  m_LocalScale: {x: 1, y: 1, z: 1}
  m_Children: []
  m_Father: {fileID: 8215106919924017903}
  m_RootOrder: 5
  m_LocalEulerAnglesHint: {x: 0, y: 0, z: 0}
--- !u!108 &8215106918915368659
Light:
  m_ObjectHideFlags: 0
  m_CorrespondingSourceObject: {fileID: 0}
  m_PrefabInstance: {fileID: 0}
  m_PrefabAsset: {fileID: 0}
  m_GameObject: {fileID: 8215106918915368657}
  m_Enabled: 1
  serializedVersion: 10
  m_Type: 2
  m_Shape: 0
  m_Color: {r: 1, g: 1, b: 1, a: 1}
  m_Intensity: 1
  m_Range: 6.04
  m_SpotAngle: 30
  m_InnerSpotAngle: 21.80208
  m_CookieSize: 10
  m_Shadows:
    m_Type: 0
    m_Resolution: 0
    m_CustomResolution: -1
    m_Strength: 0.535
    m_Bias: 0.05
    m_NormalBias: 0.4
    m_NearPlane: 0.2
    m_CullingMatrixOverride:
      e00: 1
      e01: 0
      e02: 0
      e03: 0
      e10: 0
      e11: 1
      e12: 0
      e13: 0
      e20: 0
      e21: 0
      e22: 1
      e23: 0
      e30: 0
      e31: 0
      e32: 0
      e33: 1
    m_UseCullingMatrixOverride: 0
  m_Cookie: {fileID: 8900000, guid: bb0be0108583003469a7044f10aad058, type: 2}
  m_DrawHalo: 0
  m_Flare: {fileID: 0}
  m_RenderMode: 2
  m_CullingMask:
    serializedVersion: 2
    m_Bits: 4294967295
  m_RenderingLayerMask: 1
  m_Lightmapping: 4
  m_LightShadowCasterMode: 0
  m_AreaSize: {x: 1, y: 1}
  m_BounceIntensity: 1
  m_ColorTemperature: 6570
  m_UseColorTemperature: 0
  m_BoundingSphereOverride: {x: 0, y: 0, z: 0, w: 0}
  m_UseBoundingSphereOverride: 0
  m_UseViewFrustumForShadowCasterCull: 1
  m_ShadowRadius: 0
  m_ShadowAngle: 0
--- !u!1 &8215106918952918660
GameObject:
  m_ObjectHideFlags: 0
  m_CorrespondingSourceObject: {fileID: 0}
  m_PrefabInstance: {fileID: 0}
  m_PrefabAsset: {fileID: 0}
  serializedVersion: 6
  m_Component:
  - component: {fileID: 8215106918952918661}
  - component: {fileID: 8215106918952918662}
  m_Layer: 0
  m_Name: NavMesh Modifier Volume (2)
  m_TagString: Untagged
  m_Icon: {fileID: 0}
  m_NavMeshLayer: 0
  m_StaticEditorFlags: 0
  m_IsActive: 1
--- !u!4 &8215106918952918661
Transform:
  m_ObjectHideFlags: 0
  m_CorrespondingSourceObject: {fileID: 0}
  m_PrefabInstance: {fileID: 0}
  m_PrefabAsset: {fileID: 0}
  m_GameObject: {fileID: 8215106918952918660}
  m_LocalRotation: {x: -0, y: -0, z: -0, w: 1}
  m_LocalPosition: {x: -2.57, y: -0.63, z: -5.34}
  m_LocalScale: {x: 1, y: 1, z: 1}
  m_Children: []
  m_Father: {fileID: 8215106919812141901}
  m_RootOrder: 3
  m_LocalEulerAnglesHint: {x: 0, y: 0, z: 0}
--- !u!114 &8215106918952918662
MonoBehaviour:
  m_ObjectHideFlags: 0
  m_CorrespondingSourceObject: {fileID: 0}
  m_PrefabInstance: {fileID: 0}
  m_PrefabAsset: {fileID: 0}
  m_GameObject: {fileID: 8215106918952918660}
  m_Enabled: 1
  m_EditorHideFlags: 0
  m_Script: {fileID: 11500000, guid: 35e95dc5ff2b64380880dd7ac5922847, type: 3}
  m_Name: 
  m_EditorClassIdentifier: 
  m_Size: {x: 1, y: 5.49, z: 3.92}
  m_Center: {x: 0, y: 1, z: 0}
  m_Area: 1
  m_AffectedAgents: ffffffff
--- !u!1 &8215106919015247630
GameObject:
  m_ObjectHideFlags: 0
  m_CorrespondingSourceObject: {fileID: 0}
  m_PrefabInstance: {fileID: 0}
  m_PrefabAsset: {fileID: 0}
  serializedVersion: 6
  m_Component:
  - component: {fileID: 8215106919015247631}
  - component: {fileID: 8215106919015247624}
  - component: {fileID: 8215106919015247625}
  m_Layer: 0
  m_Name: Reflection Probe
  m_TagString: Untagged
  m_Icon: {fileID: 0}
  m_NavMeshLayer: 0
  m_StaticEditorFlags: 0
  m_IsActive: 1
--- !u!4 &8215106919015247631
Transform:
  m_ObjectHideFlags: 0
  m_CorrespondingSourceObject: {fileID: 0}
  m_PrefabInstance: {fileID: 0}
  m_PrefabAsset: {fileID: 0}
  m_GameObject: {fileID: 8215106919015247630}
  m_LocalRotation: {x: 0, y: 0, z: 0, w: 1}
  m_LocalPosition: {x: -2.233, y: -37.22, z: -2.324}
  m_LocalScale: {x: 1, y: 1, z: 1}
  m_Children: []
  m_Father: {fileID: 8215106919521564443}
  m_RootOrder: 0
  m_LocalEulerAnglesHint: {x: 0, y: 0, z: 0}
--- !u!215 &8215106919015247624
ReflectionProbe:
  m_ObjectHideFlags: 0
  m_CorrespondingSourceObject: {fileID: 0}
  m_PrefabInstance: {fileID: 0}
  m_PrefabAsset: {fileID: 0}
  m_GameObject: {fileID: 8215106919015247630}
  m_Enabled: 1
  serializedVersion: 2
  m_Type: 0
  m_Mode: 1
  m_RefreshMode: 2
  m_TimeSlicingMode: 0
  m_Resolution: 128
  m_UpdateFrequency: 0
  m_BoxSize: {x: 7.1586246, y: 4.0048637, z: 7.207078}
  m_BoxOffset: {x: -0.031594276, y: 0.51690865, z: -0.08443928}
  m_NearClip: 0.3
  m_FarClip: 30
  m_ShadowDistance: 0
  m_ClearFlags: 1
  m_BackGroundColor: {r: 0.19215687, g: 0.3019608, b: 0.4745098, a: 0}
  m_CullingMask:
    serializedVersion: 2
    m_Bits: 4294967295
  m_IntensityMultiplier: 1
  m_BlendDistance: 1
  m_HDR: 1
  m_BoxProjection: 1
  m_RenderDynamicObjects: 0
  m_UseOcclusionCulling: 1
  m_Importance: 1
  m_CustomBakedTexture: {fileID: 0}
--- !u!114 &8215106919015247625
MonoBehaviour:
  m_ObjectHideFlags: 0
  m_CorrespondingSourceObject: {fileID: 0}
  m_PrefabInstance: {fileID: 0}
  m_PrefabAsset: {fileID: 0}
  m_GameObject: {fileID: 8215106919015247630}
  m_Enabled: 1
  m_EditorHideFlags: 0
  m_Script: {fileID: 11500000, guid: ecff7081915771c499a1aebc0ba57a2f, type: 3}
  m_Name: 
  m_EditorClassIdentifier: 
  angle: -2
--- !u!1 &8215106919015666784
GameObject:
  m_ObjectHideFlags: 0
  m_CorrespondingSourceObject: {fileID: 0}
  m_PrefabInstance: {fileID: 0}
  m_PrefabAsset: {fileID: 0}
  serializedVersion: 6
  m_Component:
  - component: {fileID: 8215106919015666785}
  - component: {fileID: 8215106919015666786}
  m_Layer: 0
  m_Name: Point Light
  m_TagString: Untagged
  m_Icon: {fileID: 0}
  m_NavMeshLayer: 0
  m_StaticEditorFlags: 0
  m_IsActive: 1
--- !u!4 &8215106919015666785
Transform:
  m_ObjectHideFlags: 0
  m_CorrespondingSourceObject: {fileID: 0}
  m_PrefabInstance: {fileID: 0}
  m_PrefabAsset: {fileID: 0}
  m_GameObject: {fileID: 8215106919015666784}
  m_LocalRotation: {x: -0, y: -0, z: -0, w: 1}
  m_LocalPosition: {x: -1.085, y: -35.01, z: 6.256}
  m_LocalScale: {x: 1, y: 1, z: 1}
  m_Children: []
  m_Father: {fileID: 8215106919924017903}
  m_RootOrder: 0
  m_LocalEulerAnglesHint: {x: 0, y: 0, z: 0}
--- !u!108 &8215106919015666786
Light:
  m_ObjectHideFlags: 0
  m_CorrespondingSourceObject: {fileID: 0}
  m_PrefabInstance: {fileID: 0}
  m_PrefabAsset: {fileID: 0}
  m_GameObject: {fileID: 8215106919015666784}
  m_Enabled: 1
  serializedVersion: 10
  m_Type: 2
  m_Shape: 0
  m_Color: {r: 1, g: 1, b: 1, a: 1}
  m_Intensity: 2.36
  m_Range: 7.32
  m_SpotAngle: 30
  m_InnerSpotAngle: 21.80208
  m_CookieSize: 10
  m_Shadows:
    m_Type: 0
    m_Resolution: -1
    m_CustomResolution: -1
    m_Strength: 1
    m_Bias: 0.05
    m_NormalBias: 0.4
    m_NearPlane: 0.2
    m_CullingMatrixOverride:
      e00: 1
      e01: 0
      e02: 0
      e03: 0
      e10: 0
      e11: 1
      e12: 0
      e13: 0
      e20: 0
      e21: 0
      e22: 1
      e23: 0
      e30: 0
      e31: 0
      e32: 0
      e33: 1
    m_UseCullingMatrixOverride: 0
  m_Cookie: {fileID: 0}
  m_DrawHalo: 0
  m_Flare: {fileID: 12100000, guid: deb58512da518644ab6ecdf2035b37b1, type: 2}
  m_RenderMode: 2
  m_CullingMask:
    serializedVersion: 2
    m_Bits: 4294967295
  m_RenderingLayerMask: 1
  m_Lightmapping: 4
  m_LightShadowCasterMode: 0
  m_AreaSize: {x: 1, y: 1}
  m_BounceIntensity: 1
  m_ColorTemperature: 6570
  m_UseColorTemperature: 0
  m_BoundingSphereOverride: {x: 0, y: 0, z: 0, w: 0}
  m_UseBoundingSphereOverride: 0
  m_UseViewFrustumForShadowCasterCull: 1
  m_ShadowRadius: 0
  m_ShadowAngle: 0
--- !u!1 &8215106919044643826
GameObject:
  m_ObjectHideFlags: 0
  m_CorrespondingSourceObject: {fileID: 0}
  m_PrefabInstance: {fileID: 0}
  m_PrefabAsset: {fileID: 0}
  serializedVersion: 6
  m_Component:
  - component: {fileID: 8215106919044643827}
  - component: {fileID: 8215106919044643836}
  m_Layer: 0
  m_Name: Point Light (7)
  m_TagString: Untagged
  m_Icon: {fileID: 0}
  m_NavMeshLayer: 0
  m_StaticEditorFlags: 0
  m_IsActive: 1
--- !u!4 &8215106919044643827
Transform:
  m_ObjectHideFlags: 0
  m_CorrespondingSourceObject: {fileID: 0}
  m_PrefabInstance: {fileID: 0}
  m_PrefabAsset: {fileID: 0}
  m_GameObject: {fileID: 8215106919044643826}
  m_LocalRotation: {x: -0, y: -0, z: -0, w: 1}
  m_LocalPosition: {x: -2.199, y: -35.026, z: -3.853}
  m_LocalScale: {x: 1, y: 1, z: 1}
  m_Children: []
  m_Father: {fileID: 8215106919924017903}
  m_RootOrder: 8
  m_LocalEulerAnglesHint: {x: 0, y: 0, z: 0}
--- !u!108 &8215106919044643836
Light:
  m_ObjectHideFlags: 0
  m_CorrespondingSourceObject: {fileID: 0}
  m_PrefabInstance: {fileID: 0}
  m_PrefabAsset: {fileID: 0}
  m_GameObject: {fileID: 8215106919044643826}
  m_Enabled: 1
  serializedVersion: 10
  m_Type: 2
  m_Shape: 0
  m_Color: {r: 1, g: 0.7709094, b: 0.6745283, a: 1}
  m_Intensity: 1.55
  m_Range: 10
  m_SpotAngle: 30
  m_InnerSpotAngle: 21.80208
  m_CookieSize: 10
  m_Shadows:
    m_Type: 2
    m_Resolution: -1
    m_CustomResolution: -1
    m_Strength: 0.742
    m_Bias: 0.05
    m_NormalBias: 0.4
    m_NearPlane: 0.2
    m_CullingMatrixOverride:
      e00: 1
      e01: 0
      e02: 0
      e03: 0
      e10: 0
      e11: 1
      e12: 0
      e13: 0
      e20: 0
      e21: 0
      e22: 1
      e23: 0
      e30: 0
      e31: 0
      e32: 0
      e33: 1
    m_UseCullingMatrixOverride: 0
  m_Cookie: {fileID: 0}
  m_DrawHalo: 0
  m_Flare: {fileID: 12100000, guid: 055403e8b723c494a9d89d3e0a8d5da7, type: 2}
  m_RenderMode: 1
  m_CullingMask:
    serializedVersion: 2
    m_Bits: 4294967295
  m_RenderingLayerMask: 1
  m_Lightmapping: 4
  m_LightShadowCasterMode: 0
  m_AreaSize: {x: 1, y: 1}
  m_BounceIntensity: 0
  m_ColorTemperature: 6570
  m_UseColorTemperature: 0
  m_BoundingSphereOverride: {x: 0, y: 0, z: 0, w: 0}
  m_UseBoundingSphereOverride: 0
  m_UseViewFrustumForShadowCasterCull: 1
  m_ShadowRadius: 0
  m_ShadowAngle: 0
--- !u!1 &8215106919286005781
GameObject:
  m_ObjectHideFlags: 0
  m_CorrespondingSourceObject: {fileID: 0}
  m_PrefabInstance: {fileID: 0}
  m_PrefabAsset: {fileID: 0}
  serializedVersion: 6
  m_Component:
  - component: {fileID: 8215106919286005782}
  - component: {fileID: 8215106919286005783}
  m_Layer: 0
  m_Name: Point Light (5)
  m_TagString: Untagged
  m_Icon: {fileID: 0}
  m_NavMeshLayer: 0
  m_StaticEditorFlags: 0
  m_IsActive: 1
--- !u!4 &8215106919286005782
Transform:
  m_ObjectHideFlags: 0
  m_CorrespondingSourceObject: {fileID: 0}
  m_PrefabInstance: {fileID: 0}
  m_PrefabAsset: {fileID: 0}
  m_GameObject: {fileID: 8215106919286005781}
  m_LocalRotation: {x: -0, y: -0, z: -0, w: 1}
  m_LocalPosition: {x: -2.18, y: -35.045, z: 2.181}
  m_LocalScale: {x: 1, y: 1, z: 1}
  m_Children: []
  m_Father: {fileID: 8215106919924017903}
  m_RootOrder: 6
  m_LocalEulerAnglesHint: {x: 0, y: 0, z: 0}
--- !u!108 &8215106919286005783
Light:
  m_ObjectHideFlags: 0
  m_CorrespondingSourceObject: {fileID: 0}
  m_PrefabInstance: {fileID: 0}
  m_PrefabAsset: {fileID: 0}
  m_GameObject: {fileID: 8215106919286005781}
  m_Enabled: 1
  serializedVersion: 10
  m_Type: 2
  m_Shape: 0
  m_Color: {r: 1, g: 1, b: 1, a: 1}
  m_Intensity: 1.57
  m_Range: 6
  m_SpotAngle: 30
  m_InnerSpotAngle: 21.80208
  m_CookieSize: 10
  m_Shadows:
    m_Type: 2
    m_Resolution: 0
    m_CustomResolution: -1
    m_Strength: 0.208
    m_Bias: 0.05
    m_NormalBias: 0.4
    m_NearPlane: 0.2
    m_CullingMatrixOverride:
      e00: 1
      e01: 0
      e02: 0
      e03: 0
      e10: 0
      e11: 1
      e12: 0
      e13: 0
      e20: 0
      e21: 0
      e22: 1
      e23: 0
      e30: 0
      e31: 0
      e32: 0
      e33: 1
    m_UseCullingMatrixOverride: 0
  m_Cookie: {fileID: 0}
  m_DrawHalo: 0
  m_Flare: {fileID: 12100000, guid: deb58512da518644ab6ecdf2035b37b1, type: 2}
  m_RenderMode: 2
  m_CullingMask:
    serializedVersion: 2
    m_Bits: 4294967295
  m_RenderingLayerMask: 1
  m_Lightmapping: 4
  m_LightShadowCasterMode: 0
  m_AreaSize: {x: 1, y: 1}
  m_BounceIntensity: 1
  m_ColorTemperature: 6570
  m_UseColorTemperature: 0
  m_BoundingSphereOverride: {x: 0, y: 0, z: 0, w: 0}
  m_UseBoundingSphereOverride: 0
  m_UseViewFrustumForShadowCasterCull: 1
  m_ShadowRadius: 0
  m_ShadowAngle: 0
--- !u!1 &8215106919420288112
GameObject:
  m_ObjectHideFlags: 0
  m_CorrespondingSourceObject: {fileID: 0}
  m_PrefabInstance: {fileID: 0}
  m_PrefabAsset: {fileID: 0}
  serializedVersion: 6
  m_Component:
  - component: {fileID: 8215106919420288113}
  - component: {fileID: 8215106919420288114}
  m_Layer: 0
  m_Name: Point Light (3)
  m_TagString: Untagged
  m_Icon: {fileID: 0}
  m_NavMeshLayer: 0
  m_StaticEditorFlags: 0
  m_IsActive: 1
--- !u!4 &8215106919420288113
Transform:
  m_ObjectHideFlags: 0
  m_CorrespondingSourceObject: {fileID: 0}
  m_PrefabInstance: {fileID: 0}
  m_PrefabAsset: {fileID: 0}
  m_GameObject: {fileID: 8215106919420288112}
  m_LocalRotation: {x: 0, y: 0, z: 0, w: 1}
  m_LocalPosition: {x: -8.316, y: -34.879, z: 2.16}
  m_LocalScale: {x: 1, y: 1, z: 1}
  m_Children: []
  m_Father: {fileID: 8215106919924017903}
  m_RootOrder: 4
  m_LocalEulerAnglesHint: {x: 0, y: 0, z: 0}
--- !u!108 &8215106919420288114
Light:
  m_ObjectHideFlags: 0
  m_CorrespondingSourceObject: {fileID: 0}
  m_PrefabInstance: {fileID: 0}
  m_PrefabAsset: {fileID: 0}
  m_GameObject: {fileID: 8215106919420288112}
  m_Enabled: 1
  serializedVersion: 10
  m_Type: 2
  m_Shape: 0
  m_Color: {r: 1, g: 1, b: 1, a: 1}
  m_Intensity: 1.39
  m_Range: 5
  m_SpotAngle: 30
  m_InnerSpotAngle: 21.80208
  m_CookieSize: 10
  m_Shadows:
    m_Type: 2
    m_Resolution: 0
    m_CustomResolution: -1
    m_Strength: 0.535
    m_Bias: 0.05
    m_NormalBias: 0.4
    m_NearPlane: 0.2
    m_CullingMatrixOverride:
      e00: 1
      e01: 0
      e02: 0
      e03: 0
      e10: 0
      e11: 1
      e12: 0
      e13: 0
      e20: 0
      e21: 0
      e22: 1
      e23: 0
      e30: 0
      e31: 0
      e32: 0
      e33: 1
    m_UseCullingMatrixOverride: 0
  m_Cookie: {fileID: 8900000, guid: bb0be0108583003469a7044f10aad058, type: 2}
  m_DrawHalo: 0
  m_Flare: {fileID: 12100000, guid: deb58512da518644ab6ecdf2035b37b1, type: 2}
  m_RenderMode: 2
  m_CullingMask:
    serializedVersion: 2
    m_Bits: 4294967295
  m_RenderingLayerMask: 1
  m_Lightmapping: 4
  m_LightShadowCasterMode: 0
  m_AreaSize: {x: 1, y: 1}
  m_BounceIntensity: 1
  m_ColorTemperature: 6570
  m_UseColorTemperature: 0
  m_BoundingSphereOverride: {x: 0, y: 0, z: 0, w: 0}
  m_UseBoundingSphereOverride: 0
  m_UseViewFrustumForShadowCasterCull: 1
  m_ShadowRadius: 0
  m_ShadowAngle: 0
--- !u!1 &8215106919508545329
GameObject:
  m_ObjectHideFlags: 0
  m_CorrespondingSourceObject: {fileID: 0}
  m_PrefabInstance: {fileID: 0}
  m_PrefabAsset: {fileID: 0}
  serializedVersion: 6
  m_Component:
  - component: {fileID: 8215106919508545330}
  - component: {fileID: 8215106919508545331}
  - component: {fileID: 8215106919508545340}
  m_Layer: 0
  m_Name: Reflection Probe (1)
  m_TagString: Untagged
  m_Icon: {fileID: 0}
  m_NavMeshLayer: 0
  m_StaticEditorFlags: 0
  m_IsActive: 1
--- !u!4 &8215106919508545330
Transform:
  m_ObjectHideFlags: 0
  m_CorrespondingSourceObject: {fileID: 0}
  m_PrefabInstance: {fileID: 0}
  m_PrefabAsset: {fileID: 0}
  m_GameObject: {fileID: 8215106919508545329}
  m_LocalRotation: {x: 0, y: 0, z: 0, w: 1}
  m_LocalPosition: {x: 0.47, y: -36.50325, z: 6.1047516}
  m_LocalScale: {x: 1, y: 1, z: 1}
  m_Children: []
  m_Father: {fileID: 8215106919521564443}
  m_RootOrder: 1
  m_LocalEulerAnglesHint: {x: 0, y: 0, z: 0}
--- !u!215 &8215106919508545331
ReflectionProbe:
  m_ObjectHideFlags: 0
  m_CorrespondingSourceObject: {fileID: 0}
  m_PrefabInstance: {fileID: 0}
  m_PrefabAsset: {fileID: 0}
  m_GameObject: {fileID: 8215106919508545329}
  m_Enabled: 1
  serializedVersion: 2
  m_Type: 0
  m_Mode: 1
  m_RefreshMode: 2
  m_TimeSlicingMode: 0
  m_Resolution: 64
  m_UpdateFrequency: 0
  m_BoxSize: {x: 7.697916, y: 4.0048637, z: 6.2802577}
  m_BoxOffset: {x: 0.23805144, y: -0.19984436, z: -1.4426012}
  m_NearClip: 0.3
  m_FarClip: 30
  m_ShadowDistance: 0
  m_ClearFlags: 1
  m_BackGroundColor: {r: 0.19215687, g: 0.3019608, b: 0.4745098, a: 0}
  m_CullingMask:
    serializedVersion: 2
    m_Bits: 4294967295
  m_IntensityMultiplier: 1
  m_BlendDistance: 1
  m_HDR: 1
  m_BoxProjection: 0
  m_RenderDynamicObjects: 0
  m_UseOcclusionCulling: 1
  m_Importance: 1
  m_CustomBakedTexture: {fileID: 0}
--- !u!114 &8215106919508545340
MonoBehaviour:
  m_ObjectHideFlags: 0
  m_CorrespondingSourceObject: {fileID: 0}
  m_PrefabInstance: {fileID: 0}
  m_PrefabAsset: {fileID: 0}
  m_GameObject: {fileID: 8215106919508545329}
  m_Enabled: 1
  m_EditorHideFlags: 0
  m_Script: {fileID: 11500000, guid: ecff7081915771c499a1aebc0ba57a2f, type: 3}
  m_Name: 
  m_EditorClassIdentifier: 
  angle: -2
--- !u!1 &8215106919521564442
GameObject:
  m_ObjectHideFlags: 0
  m_CorrespondingSourceObject: {fileID: 0}
  m_PrefabInstance: {fileID: 0}
  m_PrefabAsset: {fileID: 0}
  serializedVersion: 6
  m_Component:
  - component: {fileID: 8215106919521564443}
  m_Layer: 0
  m_Name: Reflections
  m_TagString: Untagged
  m_Icon: {fileID: 0}
  m_NavMeshLayer: 0
  m_StaticEditorFlags: 0
  m_IsActive: 0
--- !u!4 &8215106919521564443
Transform:
  m_ObjectHideFlags: 0
  m_CorrespondingSourceObject: {fileID: 0}
  m_PrefabInstance: {fileID: 0}
  m_PrefabAsset: {fileID: 0}
  m_GameObject: {fileID: 8215106919521564442}
  m_LocalRotation: {x: 0, y: 0, z: 0, w: 1}
  m_LocalPosition: {x: 0, y: 0, z: 0}
  m_LocalScale: {x: 1, y: 1, z: 1}
  m_Children:
  - {fileID: 8215106919015247631}
  - {fileID: 8215106919508545330}
  - {fileID: 8215106920328417177}
  - {fileID: 8215106919605368591}
  - {fileID: 8215106920426077925}
  - {fileID: 8215106919971730853}
  m_Father: {fileID: 8215106919649264068}
  m_RootOrder: 6
  m_LocalEulerAnglesHint: {x: 0, y: 0, z: 0}
--- !u!1 &8215106919605368590
GameObject:
  m_ObjectHideFlags: 0
  m_CorrespondingSourceObject: {fileID: 0}
  m_PrefabInstance: {fileID: 0}
  m_PrefabAsset: {fileID: 0}
  serializedVersion: 6
  m_Component:
  - component: {fileID: 8215106919605368591}
  - component: {fileID: 8215106919605368584}
  - component: {fileID: 8215106919605368585}
  m_Layer: 0
  m_Name: Reflection Probe (3)
  m_TagString: Untagged
  m_Icon: {fileID: 0}
  m_NavMeshLayer: 0
  m_StaticEditorFlags: 0
  m_IsActive: 1
--- !u!4 &8215106919605368591
Transform:
  m_ObjectHideFlags: 0
  m_CorrespondingSourceObject: {fileID: 0}
  m_PrefabInstance: {fileID: 0}
  m_PrefabAsset: {fileID: 0}
  m_GameObject: {fileID: 8215106919605368590}
  m_LocalRotation: {x: 0, y: 0, z: 0, w: 1}
  m_LocalPosition: {x: -8.46, y: -36.775032, z: 1.94}
  m_LocalScale: {x: 1, y: 1, z: 1}
  m_Children: []
  m_Father: {fileID: 8215106919521564443}
  m_RootOrder: 3
  m_LocalEulerAnglesHint: {x: 0, y: 0, z: 0}
--- !u!215 &8215106919605368584
ReflectionProbe:
  m_ObjectHideFlags: 0
  m_CorrespondingSourceObject: {fileID: 0}
  m_PrefabInstance: {fileID: 0}
  m_PrefabAsset: {fileID: 0}
  m_GameObject: {fileID: 8215106919605368590}
  m_Enabled: 1
  serializedVersion: 2
  m_Type: 0
  m_Mode: 1
  m_RefreshMode: 2
  m_TimeSlicingMode: 0
  m_Resolution: 32
  m_UpdateFrequency: 0
  m_BoxSize: {x: 4.4849663, y: 4.0772, z: 4.3145366}
  m_BoxOffset: {x: 0.14983368, y: 0.108104706, z: 0.1728208}
  m_NearClip: 0.3
  m_FarClip: 30
  m_ShadowDistance: 0
  m_ClearFlags: 1
  m_BackGroundColor: {r: 0.19215687, g: 0.3019608, b: 0.4745098, a: 0}
  m_CullingMask:
    serializedVersion: 2
    m_Bits: 4294967295
  m_IntensityMultiplier: 1
  m_BlendDistance: 1
  m_HDR: 1
  m_BoxProjection: 1
  m_RenderDynamicObjects: 0
  m_UseOcclusionCulling: 1
  m_Importance: 1
  m_CustomBakedTexture: {fileID: 0}
--- !u!114 &8215106919605368585
MonoBehaviour:
  m_ObjectHideFlags: 0
  m_CorrespondingSourceObject: {fileID: 0}
  m_PrefabInstance: {fileID: 0}
  m_PrefabAsset: {fileID: 0}
  m_GameObject: {fileID: 8215106919605368590}
  m_Enabled: 1
  m_EditorHideFlags: 0
  m_Script: {fileID: 11500000, guid: ecff7081915771c499a1aebc0ba57a2f, type: 3}
  m_Name: 
  m_EditorClassIdentifier: 
  angle: -2
--- !u!1 &8215106919649264091
GameObject:
  m_ObjectHideFlags: 0
  m_CorrespondingSourceObject: {fileID: 0}
  m_PrefabInstance: {fileID: 0}
  m_PrefabAsset: {fileID: 0}
  serializedVersion: 6
  m_Component:
  - component: {fileID: 8215106919649264068}
  - component: {fileID: 8215106919649264069}
  - component: {fileID: 8215106919649264070}
  - component: {fileID: 8215106919649264071}
  m_Layer: 0
  m_Name: Heavy_2-Way_008
  m_TagString: Untagged
  m_Icon: {fileID: 0}
  m_NavMeshLayer: 0
  m_StaticEditorFlags: 0
  m_IsActive: 1
--- !u!4 &8215106919649264068
Transform:
  m_ObjectHideFlags: 0
  m_CorrespondingSourceObject: {fileID: 0}
  m_PrefabInstance: {fileID: 0}
  m_PrefabAsset: {fileID: 0}
  m_GameObject: {fileID: 8215106919649264091}
  m_LocalRotation: {x: 0, y: 0, z: 0, w: 1}
  m_LocalPosition: {x: 0, y: 0, z: 0}
  m_LocalScale: {x: 1, y: 1, z: 1}
  m_Children:
  - {fileID: 4905400676239302121}
  - {fileID: 8215106919812141901}
  - {fileID: 4685235972025893363}
  - {fileID: 5536080081989205854}
  - {fileID: 4215927422002585578}
  - {fileID: 8215106919924017903}
  - {fileID: 8215106919521564443}
  - {fileID: 8215106920074608307}
  - {fileID: 915672710010462549}
  - {fileID: 5203765555836095934}
  m_Father: {fileID: 0}
  m_RootOrder: 0
  m_LocalEulerAnglesHint: {x: 0, y: 0, z: 0}
--- !u!114 &8215106919649264069
MonoBehaviour:
  m_ObjectHideFlags: 0
  m_CorrespondingSourceObject: {fileID: 0}
  m_PrefabInstance: {fileID: 0}
  m_PrefabAsset: {fileID: 0}
  m_GameObject: {fileID: 8215106919649264091}
  m_Enabled: 1
  m_EditorHideFlags: 0
  m_Script: {fileID: 11500000, guid: 8d9f07e349283d0419aa34d36023dc38, type: 3}
  m_Name: 
  m_EditorClassIdentifier: 
  Room: {fileID: 81066037962011135}
  Lights: {fileID: 8215106919924017902}
  Probes: {fileID: 8215106919521564442}
  cutsceneReferences:
  - {fileID: 4376469249174201000}
  - {fileID: 6668705045168618368}
--- !u!114 &8215106919649264070
MonoBehaviour:
  m_ObjectHideFlags: 0
  m_CorrespondingSourceObject: {fileID: 0}
  m_PrefabInstance: {fileID: 0}
  m_PrefabAsset: {fileID: 0}
  m_GameObject: {fileID: 8215106919649264091}
  m_Enabled: 1
  m_EditorHideFlags: 0
  m_Script: {fileID: 11500000, guid: 6215951d905737c4bb517c7925091a74, type: 3}
  m_Name: 
  m_EditorClassIdentifier: 
  table:
  - items:
    - Spawn: {fileID: 11400000, guid: 3d0a59cf92c8f6948be26c4162b4533f, type: 2}
      SpawnName: 
      Rate: 100
  - items:
    - Spawn: {fileID: 11400000, guid: 91dc436c5b1ca704897ebda55977952d, type: 2}
      SpawnName: 
      Rate: 100
  positions:
  - {fileID: 8215106920074608307}
  - {fileID: 5203765555836095934}
--- !u!114 &8215106919649264071
MonoBehaviour:
  m_ObjectHideFlags: 0
  m_CorrespondingSourceObject: {fileID: 0}
  m_PrefabInstance: {fileID: 0}
  m_PrefabAsset: {fileID: 0}
  m_GameObject: {fileID: 8215106919649264091}
  m_Enabled: 1
  m_EditorHideFlags: 0
  m_Script: {fileID: 11500000, guid: 2244201d5ad243e4a9c5a3705c01d400, type: 3}
  m_Name: 
  m_EditorClassIdentifier: 
  EventList: []
  UniqueHandler: Event_008Chamber
  Spawned: 0
  SpecialName: 008
  UniquePos: {fileID: 0}
  EventChosen: -1
--- !u!1 &8215106919730514467
GameObject:
  m_ObjectHideFlags: 0
  m_CorrespondingSourceObject: {fileID: 0}
  m_PrefabInstance: {fileID: 0}
  m_PrefabAsset: {fileID: 0}
  serializedVersion: 6
  m_Component:
  - component: {fileID: 8215106919730514476}
  - component: {fileID: 8215106919730514477}
  m_Layer: 0
  m_Name: Point Light (2)
  m_TagString: Untagged
  m_Icon: {fileID: 0}
  m_NavMeshLayer: 0
  m_StaticEditorFlags: 0
  m_IsActive: 1
--- !u!4 &8215106919730514476
Transform:
  m_ObjectHideFlags: 0
  m_CorrespondingSourceObject: {fileID: 0}
  m_PrefabInstance: {fileID: 0}
  m_PrefabAsset: {fileID: 0}
  m_GameObject: {fileID: 8215106919730514467}
  m_LocalRotation: {x: 0, y: 0, z: 0, w: 1}
  m_LocalPosition: {x: -5.672, y: 3.384, z: 0}
  m_LocalScale: {x: 1, y: 1, z: 1}
  m_Children: []
  m_Father: {fileID: 8215106919924017903}
  m_RootOrder: 3
  m_LocalEulerAnglesHint: {x: 0, y: 0, z: 0}
--- !u!108 &8215106919730514477
Light:
  m_ObjectHideFlags: 0
  m_CorrespondingSourceObject: {fileID: 0}
  m_PrefabInstance: {fileID: 0}
  m_PrefabAsset: {fileID: 0}
  m_GameObject: {fileID: 8215106919730514467}
  m_Enabled: 1
  serializedVersion: 10
  m_Type: 2
  m_Shape: 0
  m_Color: {r: 1, g: 1, b: 1, a: 1}
  m_Intensity: 1.39
  m_Range: 5.56
  m_SpotAngle: 30
  m_InnerSpotAngle: 21.80208
  m_CookieSize: 10
  m_Shadows:
    m_Type: 2
    m_Resolution: -1
    m_CustomResolution: -1
    m_Strength: 0.792
    m_Bias: 0.05
    m_NormalBias: 0.4
    m_NearPlane: 0.2
    m_CullingMatrixOverride:
      e00: 1
      e01: 0
      e02: 0
      e03: 0
      e10: 0
      e11: 1
      e12: 0
      e13: 0
      e20: 0
      e21: 0
      e22: 1
      e23: 0
      e30: 0
      e31: 0
      e32: 0
      e33: 1
    m_UseCullingMatrixOverride: 0
  m_Cookie: {fileID: 8900000, guid: bb0be0108583003469a7044f10aad058, type: 2}
  m_DrawHalo: 0
  m_Flare: {fileID: 12100000, guid: deb58512da518644ab6ecdf2035b37b1, type: 2}
  m_RenderMode: 2
  m_CullingMask:
    serializedVersion: 2
    m_Bits: 4294967295
  m_RenderingLayerMask: 1
  m_Lightmapping: 4
  m_LightShadowCasterMode: 0
  m_AreaSize: {x: 1, y: 1}
  m_BounceIntensity: 1
  m_ColorTemperature: 6570
  m_UseColorTemperature: 0
  m_BoundingSphereOverride: {x: 0, y: 0, z: 0, w: 0}
  m_UseBoundingSphereOverride: 0
  m_UseViewFrustumForShadowCasterCull: 1
  m_ShadowRadius: 0
  m_ShadowAngle: 0
--- !u!1 &8215106919812141900
GameObject:
  m_ObjectHideFlags: 0
  m_CorrespondingSourceObject: {fileID: 0}
  m_PrefabInstance: {fileID: 0}
  m_PrefabAsset: {fileID: 0}
  serializedVersion: 6
  m_Component:
  - component: {fileID: 8215106919812141901}
  - component: {fileID: 8215106919812141902}
  m_Layer: 0
  m_Name: NavMesh Surface
  m_TagString: Untagged
  m_Icon: {fileID: 0}
  m_NavMeshLayer: 0
  m_StaticEditorFlags: 0
  m_IsActive: 1
--- !u!4 &8215106919812141901
Transform:
  m_ObjectHideFlags: 0
  m_CorrespondingSourceObject: {fileID: 0}
  m_PrefabInstance: {fileID: 0}
  m_PrefabAsset: {fileID: 0}
  m_GameObject: {fileID: 8215106919812141900}
  m_LocalRotation: {x: -0, y: -0, z: -0, w: 1}
  m_LocalPosition: {x: 0, y: 0, z: 0}
  m_LocalScale: {x: 1, y: 1, z: 1}
  m_Children:
  - {fileID: 3997886921287402476}
  - {fileID: 8215106918812465132}
  - {fileID: 8215106920337968354}
  - {fileID: 8215106918952918661}
  m_Father: {fileID: 8215106919649264068}
  m_RootOrder: 1
  m_LocalEulerAnglesHint: {x: 0, y: 0, z: 0}
--- !u!114 &8215106919812141902
MonoBehaviour:
  m_ObjectHideFlags: 0
  m_CorrespondingSourceObject: {fileID: 0}
  m_PrefabInstance: {fileID: 0}
  m_PrefabAsset: {fileID: 0}
  m_GameObject: {fileID: 8215106919812141900}
  m_Enabled: 1
  m_EditorHideFlags: 0
  m_Script: {fileID: 11500000, guid: 7a5ac11cc976e418e8d13136b07e1f52, type: 3}
  m_Name: 
  m_EditorClassIdentifier: 
  m_AgentTypeID: 0
  m_CollectObjects: 2
  m_Size: {x: 10, y: 10, z: 10}
  m_Center: {x: 0, y: 2, z: 0}
  m_LayerMask:
    serializedVersion: 2
    m_Bits: 4294967295
  m_UseGeometry: 1
  m_DefaultArea: 0
  m_IgnoreNavMeshAgent: 1
  m_IgnoreNavMeshObstacle: 1
  m_OverrideTileSize: 0
  m_TileSize: 256
  m_OverrideVoxelSize: 1
  m_VoxelSize: 0.13333334
  m_MinRegionArea: 2
  m_NavMeshData: {fileID: 23800000, guid: 15a00a141be94014db7b135ce050fc96, type: 2}
  m_BuildHeightMesh: 0
--- !u!1 &8215106919924017902
GameObject:
  m_ObjectHideFlags: 0
  m_CorrespondingSourceObject: {fileID: 0}
  m_PrefabInstance: {fileID: 0}
  m_PrefabAsset: {fileID: 0}
  serializedVersion: 6
  m_Component:
  - component: {fileID: 8215106919924017903}
  m_Layer: 0
  m_Name: Lights
  m_TagString: Untagged
  m_Icon: {fileID: 0}
  m_NavMeshLayer: 0
  m_StaticEditorFlags: 0
  m_IsActive: 0
--- !u!4 &8215106919924017903
Transform:
  m_ObjectHideFlags: 0
  m_CorrespondingSourceObject: {fileID: 0}
  m_PrefabInstance: {fileID: 0}
  m_PrefabAsset: {fileID: 0}
  m_GameObject: {fileID: 8215106919924017902}
  m_LocalRotation: {x: 0, y: 0, z: 0, w: 1}
  m_LocalPosition: {x: 0, y: 0, z: 0}
  m_LocalScale: {x: 1, y: 1, z: 1}
  m_Children:
  - {fileID: 8215106919015666785}
  - {fileID: 8215106918440725619}
  - {fileID: 8215106920340250820}
  - {fileID: 8215106919730514476}
  - {fileID: 8215106919420288113}
  - {fileID: 8215106918915368658}
  - {fileID: 8215106919286005782}
  - {fileID: 8215106918641684651}
  - {fileID: 8215106919044643827}
  - {fileID: 318175616852589204}
  - {fileID: 7351726453823431690}
  m_Father: {fileID: 8215106919649264068}
  m_RootOrder: 5
  m_LocalEulerAnglesHint: {x: 0, y: 0, z: 0}
--- !u!1 &8215106919971730852
GameObject:
  m_ObjectHideFlags: 0
  m_CorrespondingSourceObject: {fileID: 0}
  m_PrefabInstance: {fileID: 0}
  m_PrefabAsset: {fileID: 0}
  serializedVersion: 6
  m_Component:
  - component: {fileID: 8215106919971730853}
  - component: {fileID: 8215106919971730854}
  - component: {fileID: 8215106919971730855}
  m_Layer: 0
  m_Name: Reflection Probe (5)
  m_TagString: Untagged
  m_Icon: {fileID: 0}
  m_NavMeshLayer: 0
  m_StaticEditorFlags: 0
  m_IsActive: 1
--- !u!4 &8215106919971730853
Transform:
  m_ObjectHideFlags: 0
  m_CorrespondingSourceObject: {fileID: 0}
  m_PrefabInstance: {fileID: 0}
  m_PrefabAsset: {fileID: 0}
  m_GameObject: {fileID: 8215106919971730852}
  m_LocalRotation: {x: 0, y: 0, z: 0, w: 1}
  m_LocalPosition: {x: -0.84, y: 1.6808975, z: 0.006}
  m_LocalScale: {x: 1, y: 1, z: 1}
  m_Children: []
  m_Father: {fileID: 8215106919521564443}
  m_RootOrder: 5
  m_LocalEulerAnglesHint: {x: 0, y: 0, z: 0}
--- !u!215 &8215106919971730854
ReflectionProbe:
  m_ObjectHideFlags: 0
  m_CorrespondingSourceObject: {fileID: 0}
  m_PrefabInstance: {fileID: 0}
  m_PrefabAsset: {fileID: 0}
  m_GameObject: {fileID: 8215106919971730852}
  m_Enabled: 1
  serializedVersion: 2
  m_Type: 0
  m_Mode: 1
  m_RefreshMode: 2
  m_TimeSlicingMode: 0
  m_Resolution: 64
  m_UpdateFrequency: 0
  m_BoxSize: {x: 8.97308, y: 4.3371744, z: 15.64}
  m_BoxOffset: {x: 2.049406, y: 0.39608455, z: 0.17282057}
  m_NearClip: 0.3
  m_FarClip: 30
  m_ShadowDistance: 0
  m_ClearFlags: 1
  m_BackGroundColor: {r: 0.19215687, g: 0.3019608, b: 0.4745098, a: 0}
  m_CullingMask:
    serializedVersion: 2
    m_Bits: 4294967295
  m_IntensityMultiplier: 1
  m_BlendDistance: 1
  m_HDR: 1
  m_BoxProjection: 1
  m_RenderDynamicObjects: 0
  m_UseOcclusionCulling: 1
  m_Importance: 1
  m_CustomBakedTexture: {fileID: 0}
--- !u!114 &8215106919971730855
MonoBehaviour:
  m_ObjectHideFlags: 0
  m_CorrespondingSourceObject: {fileID: 0}
  m_PrefabInstance: {fileID: 0}
  m_PrefabAsset: {fileID: 0}
  m_GameObject: {fileID: 8215106919971730852}
  m_Enabled: 1
  m_EditorHideFlags: 0
  m_Script: {fileID: 11500000, guid: ecff7081915771c499a1aebc0ba57a2f, type: 3}
  m_Name: 
  m_EditorClassIdentifier: 
  angle: -2
--- !u!1 &8215106920074608306
GameObject:
  m_ObjectHideFlags: 0
  m_CorrespondingSourceObject: {fileID: 0}
  m_PrefabInstance: {fileID: 0}
  m_PrefabAsset: {fileID: 0}
  serializedVersion: 6
  m_Component:
  - component: {fileID: 8215106920074608307}
  m_Layer: 11
  m_Name: SpawnPaper
  m_TagString: Untagged
  m_Icon: {fileID: 0}
  m_NavMeshLayer: 0
  m_StaticEditorFlags: 0
  m_IsActive: 1
--- !u!4 &8215106920074608307
Transform:
  m_ObjectHideFlags: 0
  m_CorrespondingSourceObject: {fileID: 0}
  m_PrefabInstance: {fileID: 0}
  m_PrefabAsset: {fileID: 0}
  m_GameObject: {fileID: 8215106920074608306}
  m_LocalRotation: {x: -0, y: 1, z: -0, w: 0}
  m_LocalPosition: {x: 1.94, y: -37.287, z: -1.42}
  m_LocalScale: {x: 10, y: 10, z: 10}
  m_Children: []
  m_Father: {fileID: 8215106919649264068}
  m_RootOrder: 7
  m_LocalEulerAnglesHint: {x: 0, y: 0, z: 0}
--- !u!1 &8215106920328417176
GameObject:
  m_ObjectHideFlags: 0
  m_CorrespondingSourceObject: {fileID: 0}
  m_PrefabInstance: {fileID: 0}
  m_PrefabAsset: {fileID: 0}
  serializedVersion: 6
  m_Component:
  - component: {fileID: 8215106920328417177}
  - component: {fileID: 8215106920328417178}
  - component: {fileID: 8215106920328417179}
  m_Layer: 0
  m_Name: Reflection Probe (2)
  m_TagString: Untagged
  m_Icon: {fileID: 0}
  m_NavMeshLayer: 0
  m_StaticEditorFlags: 0
  m_IsActive: 1
--- !u!4 &8215106920328417177
Transform:
  m_ObjectHideFlags: 0
  m_CorrespondingSourceObject: {fileID: 0}
  m_PrefabInstance: {fileID: 0}
  m_PrefabAsset: {fileID: 0}
  m_GameObject: {fileID: 8215106920328417176}
  m_LocalRotation: {x: 0, y: 0, z: 0, w: 1}
  m_LocalPosition: {x: 2.8335562, y: -36.50325, z: -1.765}
  m_LocalScale: {x: 1, y: 1, z: 1}
  m_Children: []
  m_Father: {fileID: 8215106919521564443}
  m_RootOrder: 2
  m_LocalEulerAnglesHint: {x: 0, y: 0, z: 0}
--- !u!215 &8215106920328417178
ReflectionProbe:
  m_ObjectHideFlags: 0
  m_CorrespondingSourceObject: {fileID: 0}
  m_PrefabInstance: {fileID: 0}
  m_PrefabAsset: {fileID: 0}
  m_GameObject: {fileID: 8215106920328417176}
  m_Enabled: 1
  serializedVersion: 2
  m_Type: 0
  m_Mode: 1
  m_RefreshMode: 2
  m_TimeSlicingMode: 0
  m_Resolution: 64
  m_UpdateFrequency: 0
  m_BoxSize: {x: 3.5161247, y: 4.0048637, z: 11.28944}
  m_BoxOffset: {x: 0.251858, y: -0.19984436, z: -0.27137893}
  m_NearClip: 0.3
  m_FarClip: 30
  m_ShadowDistance: 0
  m_ClearFlags: 1
  m_BackGroundColor: {r: 0.19215687, g: 0.3019608, b: 0.4745098, a: 0}
  m_CullingMask:
    serializedVersion: 2
    m_Bits: 4294967295
  m_IntensityMultiplier: 1
  m_BlendDistance: 1
  m_HDR: 1
  m_BoxProjection: 1
  m_RenderDynamicObjects: 0
  m_UseOcclusionCulling: 1
  m_Importance: 10
  m_CustomBakedTexture: {fileID: 0}
--- !u!114 &8215106920328417179
MonoBehaviour:
  m_ObjectHideFlags: 0
  m_CorrespondingSourceObject: {fileID: 0}
  m_PrefabInstance: {fileID: 0}
  m_PrefabAsset: {fileID: 0}
  m_GameObject: {fileID: 8215106920328417176}
  m_Enabled: 1
  m_EditorHideFlags: 0
  m_Script: {fileID: 11500000, guid: ecff7081915771c499a1aebc0ba57a2f, type: 3}
  m_Name: 
  m_EditorClassIdentifier: 
  angle: -2
--- !u!1 &8215106920337968353
GameObject:
  m_ObjectHideFlags: 0
  m_CorrespondingSourceObject: {fileID: 0}
  m_PrefabInstance: {fileID: 0}
  m_PrefabAsset: {fileID: 0}
  serializedVersion: 6
  m_Component:
  - component: {fileID: 8215106920337968354}
  - component: {fileID: 8215106920337968355}
  m_Layer: 0
  m_Name: NavMesh Modifier Volume (1)
  m_TagString: Untagged
  m_Icon: {fileID: 0}
  m_NavMeshLayer: 0
  m_StaticEditorFlags: 0
  m_IsActive: 1
--- !u!4 &8215106920337968354
Transform:
  m_ObjectHideFlags: 0
  m_CorrespondingSourceObject: {fileID: 0}
  m_PrefabInstance: {fileID: 0}
  m_PrefabAsset: {fileID: 0}
  m_GameObject: {fileID: 8215106920337968353}
  m_LocalRotation: {x: -0, y: -0, z: -0, w: 1}
  m_LocalPosition: {x: -2.57, y: -0.63, z: 5.34}
  m_LocalScale: {x: 1, y: 1, z: 1}
  m_Children: []
  m_Father: {fileID: 8215106919812141901}
  m_RootOrder: 2
  m_LocalEulerAnglesHint: {x: 0, y: 0, z: 0}
--- !u!114 &8215106920337968355
MonoBehaviour:
  m_ObjectHideFlags: 0
  m_CorrespondingSourceObject: {fileID: 0}
  m_PrefabInstance: {fileID: 0}
  m_PrefabAsset: {fileID: 0}
  m_GameObject: {fileID: 8215106920337968353}
  m_Enabled: 1
  m_EditorHideFlags: 0
  m_Script: {fileID: 11500000, guid: 35e95dc5ff2b64380880dd7ac5922847, type: 3}
  m_Name: 
  m_EditorClassIdentifier: 
  m_Size: {x: 1, y: 5.49, z: 3.92}
  m_Center: {x: 0, y: 1, z: 0}
  m_Area: 1
  m_AffectedAgents: ffffffff
--- !u!1 &8215106920340250843
GameObject:
  m_ObjectHideFlags: 0
  m_CorrespondingSourceObject: {fileID: 0}
  m_PrefabInstance: {fileID: 0}
  m_PrefabAsset: {fileID: 0}
  serializedVersion: 6
  m_Component:
  - component: {fileID: 8215106920340250820}
  - component: {fileID: 8215106920340250821}
  m_Layer: 0
  m_Name: Point Light (1)
  m_TagString: Untagged
  m_Icon: {fileID: 0}
  m_NavMeshLayer: 0
  m_StaticEditorFlags: 0
  m_IsActive: 1
--- !u!4 &8215106920340250820
Transform:
  m_ObjectHideFlags: 0
  m_CorrespondingSourceObject: {fileID: 0}
  m_PrefabInstance: {fileID: 0}
  m_PrefabAsset: {fileID: 0}
  m_GameObject: {fileID: 8215106920340250843}
  m_LocalRotation: {x: 0, y: 0.7071068, z: 0, w: 0.7071068}
  m_LocalPosition: {x: -2.797, y: 3.203, z: 0}
  m_LocalScale: {x: 1, y: 1, z: 1}
  m_Children: []
  m_Father: {fileID: 8215106919924017903}
  m_RootOrder: 2
  m_LocalEulerAnglesHint: {x: 0, y: 90, z: 0}
--- !u!108 &8215106920340250821
Light:
  m_ObjectHideFlags: 0
  m_CorrespondingSourceObject: {fileID: 0}
  m_PrefabInstance: {fileID: 0}
  m_PrefabAsset: {fileID: 0}
  m_GameObject: {fileID: 8215106920340250843}
  m_Enabled: 1
  serializedVersion: 10
  m_Type: 2
  m_Shape: 0
  m_Color: {r: 1, g: 1, b: 1, a: 1}
  m_Intensity: 1.81
  m_Range: 6
  m_SpotAngle: 30
  m_InnerSpotAngle: 21.80208
  m_CookieSize: 10
  m_Shadows:
    m_Type: 0
    m_Resolution: -1
    m_CustomResolution: -1
    m_Strength: 0.553
    m_Bias: 0.05
    m_NormalBias: 0.4
    m_NearPlane: 0.2
    m_CullingMatrixOverride:
      e00: 1
      e01: 0
      e02: 0
      e03: 0
      e10: 0
      e11: 1
      e12: 0
      e13: 0
      e20: 0
      e21: 0
      e22: 1
      e23: 0
      e30: 0
      e31: 0
      e32: 0
      e33: 1
    m_UseCullingMatrixOverride: 0
  m_Cookie: {fileID: 8900000, guid: 93ed0b8d7e1b4d143a0e8549ee0a977a, type: 2}
  m_DrawHalo: 0
  m_Flare: {fileID: 12100000, guid: deb58512da518644ab6ecdf2035b37b1, type: 2}
  m_RenderMode: 2
  m_CullingMask:
    serializedVersion: 2
    m_Bits: 4294967295
  m_RenderingLayerMask: 1
  m_Lightmapping: 4
  m_LightShadowCasterMode: 0
  m_AreaSize: {x: 1, y: 1}
  m_BounceIntensity: 1
  m_ColorTemperature: 6570
  m_UseColorTemperature: 0
  m_BoundingSphereOverride: {x: 0, y: 0, z: 0, w: 0}
  m_UseBoundingSphereOverride: 0
  m_UseViewFrustumForShadowCasterCull: 1
  m_ShadowRadius: 0
  m_ShadowAngle: 0
--- !u!1 &8215106920426077924
GameObject:
  m_ObjectHideFlags: 0
  m_CorrespondingSourceObject: {fileID: 0}
  m_PrefabInstance: {fileID: 0}
  m_PrefabAsset: {fileID: 0}
  serializedVersion: 6
  m_Component:
  - component: {fileID: 8215106920426077925}
  - component: {fileID: 8215106920426077926}
  - component: {fileID: 8215106920426077927}
  m_Layer: 0
  m_Name: Reflection Probe (4)
  m_TagString: Untagged
  m_Icon: {fileID: 0}
  m_NavMeshLayer: 0
  m_StaticEditorFlags: 0
  m_IsActive: 1
--- !u!4 &8215106920426077925
Transform:
  m_ObjectHideFlags: 0
  m_CorrespondingSourceObject: {fileID: 0}
  m_PrefabInstance: {fileID: 0}
  m_PrefabAsset: {fileID: 0}
  m_GameObject: {fileID: 8215106920426077924}
  m_LocalRotation: {x: 0, y: 0, z: 0, w: 1}
  m_LocalPosition: {x: -5.679, y: 1.6808975, z: 0.006}
  m_LocalScale: {x: 1, y: 1, z: 1}
  m_Children: []
  m_Father: {fileID: 8215106919521564443}
  m_RootOrder: 4
  m_LocalEulerAnglesHint: {x: 0, y: 0, z: 0}
--- !u!215 &8215106920426077926
ReflectionProbe:
  m_ObjectHideFlags: 0
  m_CorrespondingSourceObject: {fileID: 0}
  m_PrefabInstance: {fileID: 0}
  m_PrefabAsset: {fileID: 0}
  m_GameObject: {fileID: 8215106920426077924}
  m_Enabled: 1
  serializedVersion: 2
  m_Type: 0
  m_Mode: 1
  m_RefreshMode: 2
  m_TimeSlicingMode: 0
  m_Resolution: 32
  m_UpdateFrequency: 0
  m_BoxSize: {x: 4.4849663, y: 4.0772, z: 4.3145366}
  m_BoxOffset: {x: 0.14983368, y: 0.37742615, z: 0.1728208}
  m_NearClip: 0.3
  m_FarClip: 30
  m_ShadowDistance: 0
  m_ClearFlags: 1
  m_BackGroundColor: {r: 0.19215687, g: 0.3019608, b: 0.4745098, a: 0}
  m_CullingMask:
    serializedVersion: 2
    m_Bits: 4294967295
  m_IntensityMultiplier: 1
  m_BlendDistance: 1
  m_HDR: 1
  m_BoxProjection: 1
  m_RenderDynamicObjects: 0
  m_UseOcclusionCulling: 1
  m_Importance: 1
  m_CustomBakedTexture: {fileID: 0}
--- !u!114 &8215106920426077927
MonoBehaviour:
  m_ObjectHideFlags: 0
  m_CorrespondingSourceObject: {fileID: 0}
  m_PrefabInstance: {fileID: 0}
  m_PrefabAsset: {fileID: 0}
  m_GameObject: {fileID: 8215106920426077924}
  m_Enabled: 1
  m_EditorHideFlags: 0
  m_Script: {fileID: 11500000, guid: ecff7081915771c499a1aebc0ba57a2f, type: 3}
  m_Name: 
  m_EditorClassIdentifier: 
  angle: -2
--- !u!1001 &980832356260374727
PrefabInstance:
  m_ObjectHideFlags: 0
  serializedVersion: 2
  m_Modification:
    m_TransformParent: {fileID: 8215106919649264068}
    m_Modifications:
    - target: {fileID: 1808541562546600270, guid: 8b117d26e8560c2458ce6465ec63e1cf,
        type: 3}
      propertyPath: Clearance
      value: 4
      objectReference: {fileID: 0}
    - target: {fileID: 1817873299796814978, guid: 8b117d26e8560c2458ce6465ec63e1cf,
        type: 3}
      propertyPath: Clearance
      value: 4
      objectReference: {fileID: 0}
    - target: {fileID: 3509292714356296820, guid: 8b117d26e8560c2458ce6465ec63e1cf,
        type: 3}
      propertyPath: m_LocalPosition.z
      value: -0.327
      objectReference: {fileID: 0}
    - target: {fileID: 3732938118764586899, guid: 8b117d26e8560c2458ce6465ec63e1cf,
        type: 3}
      propertyPath: m_IsActive
      value: 0
      objectReference: {fileID: 0}
    - target: {fileID: 4321894189022098867, guid: 8b117d26e8560c2458ce6465ec63e1cf,
        type: 3}
      propertyPath: m_IsActive
      value: 0
      objectReference: {fileID: 0}
    - target: {fileID: 4416237426726756766, guid: 8b117d26e8560c2458ce6465ec63e1cf,
        type: 3}
      propertyPath: m_LocalPosition.z
      value: 0.314
      objectReference: {fileID: 0}
    - target: {fileID: 4704157506594609049, guid: 8b117d26e8560c2458ce6465ec63e1cf,
        type: 3}
      propertyPath: m_RootOrder
      value: 3
      objectReference: {fileID: 0}
    - target: {fileID: 4704157506594609049, guid: 8b117d26e8560c2458ce6465ec63e1cf,
        type: 3}
      propertyPath: m_LocalPosition.x
      value: 2.882
      objectReference: {fileID: 0}
    - target: {fileID: 4704157506594609049, guid: 8b117d26e8560c2458ce6465ec63e1cf,
        type: 3}
      propertyPath: m_LocalPosition.y
      value: -38.28
      objectReference: {fileID: 0}
    - target: {fileID: 4704157506594609049, guid: 8b117d26e8560c2458ce6465ec63e1cf,
        type: 3}
      propertyPath: m_LocalPosition.z
      value: 5.046
      objectReference: {fileID: 0}
    - target: {fileID: 4704157506594609049, guid: 8b117d26e8560c2458ce6465ec63e1cf,
        type: 3}
      propertyPath: m_LocalRotation.w
      value: 1
      objectReference: {fileID: 0}
    - target: {fileID: 4704157506594609049, guid: 8b117d26e8560c2458ce6465ec63e1cf,
        type: 3}
      propertyPath: m_LocalRotation.x
      value: -0
      objectReference: {fileID: 0}
    - target: {fileID: 4704157506594609049, guid: 8b117d26e8560c2458ce6465ec63e1cf,
        type: 3}
      propertyPath: m_LocalRotation.y
      value: -0
      objectReference: {fileID: 0}
    - target: {fileID: 4704157506594609049, guid: 8b117d26e8560c2458ce6465ec63e1cf,
        type: 3}
      propertyPath: m_LocalRotation.z
      value: -0
      objectReference: {fileID: 0}
    - target: {fileID: 4704157506594609049, guid: 8b117d26e8560c2458ce6465ec63e1cf,
        type: 3}
      propertyPath: m_LocalEulerAnglesHint.x
      value: 0
      objectReference: {fileID: 0}
    - target: {fileID: 4704157506594609049, guid: 8b117d26e8560c2458ce6465ec63e1cf,
        type: 3}
      propertyPath: m_LocalEulerAnglesHint.y
      value: 0
      objectReference: {fileID: 0}
    - target: {fileID: 4704157506594609049, guid: 8b117d26e8560c2458ce6465ec63e1cf,
        type: 3}
      propertyPath: m_LocalEulerAnglesHint.z
      value: 0
      objectReference: {fileID: 0}
    - target: {fileID: 8844315487564344749, guid: 8b117d26e8560c2458ce6465ec63e1cf,
        type: 3}
      propertyPath: m_Name
      value: LightDoor_key (1)
      objectReference: {fileID: 0}
    m_RemovedComponents: []
  m_SourcePrefab: {fileID: 100100000, guid: 8b117d26e8560c2458ce6465ec63e1cf, type: 3}
--- !u!4 &5536080081989205854 stripped
Transform:
  m_CorrespondingSourceObject: {fileID: 4704157506594609049, guid: 8b117d26e8560c2458ce6465ec63e1cf,
    type: 3}
  m_PrefabInstance: {fileID: 980832356260374727}
  m_PrefabAsset: {fileID: 0}
--- !u!1 &6668705045168618368 stripped
GameObject:
  m_CorrespondingSourceObject: {fileID: 5843247054901121863, guid: 8b117d26e8560c2458ce6465ec63e1cf,
    type: 3}
  m_PrefabInstance: {fileID: 980832356260374727}
  m_PrefabAsset: {fileID: 0}
--- !u!1001 &3953751947261974462
PrefabInstance:
  m_ObjectHideFlags: 0
  serializedVersion: 2
  m_Modification:
    m_TransformParent: {fileID: 4215927422002585578}
    m_Modifications:
    - target: {fileID: 748402288547984660, guid: c620c6aa7f7e88c4b9402e7661d1d279,
        type: 3}
      propertyPath: m_RootOrder
      value: 3
      objectReference: {fileID: 0}
    - target: {fileID: 748402288547984660, guid: c620c6aa7f7e88c4b9402e7661d1d279,
        type: 3}
      propertyPath: m_LocalPosition.x
      value: -0.004272461
      objectReference: {fileID: 0}
    - target: {fileID: 748402288547984660, guid: c620c6aa7f7e88c4b9402e7661d1d279,
        type: 3}
      propertyPath: m_LocalPosition.y
      value: 0
      objectReference: {fileID: 0}
    - target: {fileID: 748402288547984660, guid: c620c6aa7f7e88c4b9402e7661d1d279,
        type: 3}
      propertyPath: m_LocalPosition.z
      value: -3.9683042
      objectReference: {fileID: 0}
    - target: {fileID: 748402288547984660, guid: c620c6aa7f7e88c4b9402e7661d1d279,
        type: 3}
      propertyPath: m_LocalRotation.w
      value: 1
      objectReference: {fileID: 0}
    - target: {fileID: 748402288547984660, guid: c620c6aa7f7e88c4b9402e7661d1d279,
        type: 3}
      propertyPath: m_LocalRotation.x
      value: -0
      objectReference: {fileID: 0}
    - target: {fileID: 748402288547984660, guid: c620c6aa7f7e88c4b9402e7661d1d279,
        type: 3}
      propertyPath: m_LocalRotation.y
      value: -0
      objectReference: {fileID: 0}
    - target: {fileID: 748402288547984660, guid: c620c6aa7f7e88c4b9402e7661d1d279,
        type: 3}
      propertyPath: m_LocalRotation.z
      value: -0
      objectReference: {fileID: 0}
    - target: {fileID: 748402288547984660, guid: c620c6aa7f7e88c4b9402e7661d1d279,
        type: 3}
      propertyPath: m_LocalEulerAnglesHint.x
      value: 0
      objectReference: {fileID: 0}
    - target: {fileID: 748402288547984660, guid: c620c6aa7f7e88c4b9402e7661d1d279,
        type: 3}
      propertyPath: m_LocalEulerAnglesHint.y
      value: 0
      objectReference: {fileID: 0}
    - target: {fileID: 748402288547984660, guid: c620c6aa7f7e88c4b9402e7661d1d279,
        type: 3}
      propertyPath: m_LocalEulerAnglesHint.z
      value: 0
      objectReference: {fileID: 0}
    - target: {fileID: 748402288547984662, guid: c620c6aa7f7e88c4b9402e7661d1d279,
        type: 3}
      propertyPath: m_Name
      value: LightDoor_Alone (1)
      objectReference: {fileID: 0}
    - target: {fileID: 748402288547984663, guid: c620c6aa7f7e88c4b9402e7661d1d279,
        type: 3}
      propertyPath: scp173
      value: 0
      objectReference: {fileID: 0}
    - target: {fileID: 748402288547984663, guid: c620c6aa7f7e88c4b9402e7661d1d279,
        type: 3}
      propertyPath: switchOpen
      value: 1
      objectReference: {fileID: 0}
    - target: {fileID: 2704144367695859783, guid: c620c6aa7f7e88c4b9402e7661d1d279,
        type: 3}
      propertyPath: m_LocalPosition.y
      value: -2.587
      objectReference: {fileID: 0}
    - target: {fileID: 7546826427736064450, guid: c620c6aa7f7e88c4b9402e7661d1d279,
        type: 3}
      propertyPath: m_IsActive
      value: 0
      objectReference: {fileID: 0}
    m_RemovedComponents: []
  m_SourcePrefab: {fileID: 100100000, guid: c620c6aa7f7e88c4b9402e7661d1d279, type: 3}
--- !u!1 &4376469249174201000 stripped
GameObject:
  m_CorrespondingSourceObject: {fileID: 748402288547984662, guid: c620c6aa7f7e88c4b9402e7661d1d279,
    type: 3}
  m_PrefabInstance: {fileID: 3953751947261974462}
  m_PrefabAsset: {fileID: 0}
--- !u!1001 &8215106918848130266
PrefabInstance:
  m_ObjectHideFlags: 0
  serializedVersion: 2
  m_Modification:
    m_TransformParent: {fileID: 8215106919649264068}
    m_Modifications:
    - target: {fileID: 400494444349689735, guid: ef22373c3fd5df3408bc03dbd42ef8e8,
        type: 3}
      propertyPath: m_IsActive
      value: 0
      objectReference: {fileID: 0}
    - target: {fileID: 644425118650111773, guid: ef22373c3fd5df3408bc03dbd42ef8e8,
        type: 3}
      propertyPath: m_Name
      value: HeavyDoor_def
      objectReference: {fileID: 0}
    - target: {fileID: 3676240752217140521, guid: ef22373c3fd5df3408bc03dbd42ef8e8,
        type: 3}
      propertyPath: m_RootOrder
      value: 2
      objectReference: {fileID: 0}
    - target: {fileID: 3676240752217140521, guid: ef22373c3fd5df3408bc03dbd42ef8e8,
        type: 3}
      propertyPath: m_LocalPosition.x
      value: -3.46
      objectReference: {fileID: 0}
    - target: {fileID: 3676240752217140521, guid: ef22373c3fd5df3408bc03dbd42ef8e8,
        type: 3}
      propertyPath: m_LocalPosition.y
      value: -38.280003
      objectReference: {fileID: 0}
    - target: {fileID: 3676240752217140521, guid: ef22373c3fd5df3408bc03dbd42ef8e8,
        type: 3}
      propertyPath: m_LocalPosition.z
      value: 6.503
      objectReference: {fileID: 0}
    - target: {fileID: 3676240752217140521, guid: ef22373c3fd5df3408bc03dbd42ef8e8,
        type: 3}
      propertyPath: m_LocalRotation.w
      value: 0.7071068
      objectReference: {fileID: 0}
    - target: {fileID: 3676240752217140521, guid: ef22373c3fd5df3408bc03dbd42ef8e8,
        type: 3}
      propertyPath: m_LocalRotation.x
      value: -0
      objectReference: {fileID: 0}
    - target: {fileID: 3676240752217140521, guid: ef22373c3fd5df3408bc03dbd42ef8e8,
        type: 3}
      propertyPath: m_LocalRotation.y
      value: 0.7071068
      objectReference: {fileID: 0}
    - target: {fileID: 3676240752217140521, guid: ef22373c3fd5df3408bc03dbd42ef8e8,
        type: 3}
      propertyPath: m_LocalRotation.z
      value: -0
      objectReference: {fileID: 0}
    - target: {fileID: 3676240752217140521, guid: ef22373c3fd5df3408bc03dbd42ef8e8,
        type: 3}
      propertyPath: m_LocalEulerAnglesHint.x
      value: 0
      objectReference: {fileID: 0}
    - target: {fileID: 3676240752217140521, guid: ef22373c3fd5df3408bc03dbd42ef8e8,
        type: 3}
      propertyPath: m_LocalEulerAnglesHint.y
      value: 90
      objectReference: {fileID: 0}
    - target: {fileID: 3676240752217140521, guid: ef22373c3fd5df3408bc03dbd42ef8e8,
        type: 3}
      propertyPath: m_LocalEulerAnglesHint.z
      value: 0
      objectReference: {fileID: 0}
    - target: {fileID: 5512997255214833771, guid: ef22373c3fd5df3408bc03dbd42ef8e8,
        type: 3}
      propertyPath: m_IsActive
      value: 0
      objectReference: {fileID: 0}
    - target: {fileID: 7320336121119526391, guid: ef22373c3fd5df3408bc03dbd42ef8e8,
        type: 3}
      propertyPath: m_LocalPosition.z
      value: -0.234
      objectReference: {fileID: 0}
    - target: {fileID: 7320336121709644689, guid: ef22373c3fd5df3408bc03dbd42ef8e8,
        type: 3}
      propertyPath: m_LocalPosition.x
      value: 0.961
      objectReference: {fileID: 0}
    - target: {fileID: 7320336121709644689, guid: ef22373c3fd5df3408bc03dbd42ef8e8,
        type: 3}
      propertyPath: m_LocalPosition.z
      value: 0.383
      objectReference: {fileID: 0}
    m_RemovedComponents: []
  m_SourcePrefab: {fileID: 100100000, guid: ef22373c3fd5df3408bc03dbd42ef8e8, type: 3}
--- !u!4 &4685235972025893363 stripped
Transform:
  m_CorrespondingSourceObject: {fileID: 3676240752217140521, guid: ef22373c3fd5df3408bc03dbd42ef8e8,
    type: 3}
  m_PrefabInstance: {fileID: 8215106918848130266}
  m_PrefabAsset: {fileID: 0}
--- !u!1001 &8215106918987704566
PrefabInstance:
  m_ObjectHideFlags: 0
  serializedVersion: 2
  m_Modification:
    m_TransformParent: {fileID: 8215106919812141901}
    m_Modifications:
    - target: {fileID: -6277873661758113603, guid: 90b941fa3c1504240a00a0de05eb3a4a,
        type: 3}
      propertyPath: m_IsActive
      value: 1
      objectReference: {fileID: 0}
    - target: {fileID: -4943744016313211207, guid: 90b941fa3c1504240a00a0de05eb3a4a,
        type: 3}
      propertyPath: m_LightProbeUsage
      value: 1
      objectReference: {fileID: 0}
    - target: {fileID: -4943744016313211207, guid: 90b941fa3c1504240a00a0de05eb3a4a,
        type: 3}
      propertyPath: m_Materials.Array.data[0]
      value: 
      objectReference: {fileID: 2100000, guid: 7d6390302bd777b47895a59ecf77a2ba, type: 2}
    - target: {fileID: -4216859302048453862, guid: 90b941fa3c1504240a00a0de05eb3a4a,
        type: 3}
      propertyPath: m_RootOrder
      value: 0
      objectReference: {fileID: 0}
    - target: {fileID: -4216859302048453862, guid: 90b941fa3c1504240a00a0de05eb3a4a,
        type: 3}
      propertyPath: m_LocalPosition.x
      value: 0
      objectReference: {fileID: 0}
    - target: {fileID: -4216859302048453862, guid: 90b941fa3c1504240a00a0de05eb3a4a,
        type: 3}
      propertyPath: m_LocalPosition.y
      value: 0
      objectReference: {fileID: 0}
    - target: {fileID: -4216859302048453862, guid: 90b941fa3c1504240a00a0de05eb3a4a,
        type: 3}
      propertyPath: m_LocalPosition.z
      value: 0
      objectReference: {fileID: 0}
    - target: {fileID: -4216859302048453862, guid: 90b941fa3c1504240a00a0de05eb3a4a,
        type: 3}
      propertyPath: m_LocalRotation.w
      value: 1
      objectReference: {fileID: 0}
    - target: {fileID: -4216859302048453862, guid: 90b941fa3c1504240a00a0de05eb3a4a,
        type: 3}
      propertyPath: m_LocalRotation.x
      value: -0
      objectReference: {fileID: 0}
    - target: {fileID: -4216859302048453862, guid: 90b941fa3c1504240a00a0de05eb3a4a,
        type: 3}
      propertyPath: m_LocalRotation.y
      value: -0
      objectReference: {fileID: 0}
    - target: {fileID: -4216859302048453862, guid: 90b941fa3c1504240a00a0de05eb3a4a,
        type: 3}
      propertyPath: m_LocalRotation.z
      value: -0
      objectReference: {fileID: 0}
    - target: {fileID: -4216859302048453862, guid: 90b941fa3c1504240a00a0de05eb3a4a,
        type: 3}
      propertyPath: m_LocalEulerAnglesHint.x
      value: 0
      objectReference: {fileID: 0}
    - target: {fileID: -4216859302048453862, guid: 90b941fa3c1504240a00a0de05eb3a4a,
        type: 3}
      propertyPath: m_LocalEulerAnglesHint.y
      value: 0
      objectReference: {fileID: 0}
    - target: {fileID: -4216859302048453862, guid: 90b941fa3c1504240a00a0de05eb3a4a,
        type: 3}
      propertyPath: m_LocalEulerAnglesHint.z
      value: 0
      objectReference: {fileID: 0}
    - target: {fileID: -927199367670048503, guid: 90b941fa3c1504240a00a0de05eb3a4a,
        type: 3}
      propertyPath: m_Name
      value: room008
      objectReference: {fileID: 0}
    - target: {fileID: -927199367670048503, guid: 90b941fa3c1504240a00a0de05eb3a4a,
        type: 3}
      propertyPath: m_StaticEditorFlags
      value: 4294967295
      objectReference: {fileID: 0}
    - target: {fileID: 5433117222155276134, guid: 90b941fa3c1504240a00a0de05eb3a4a,
        type: 3}
      propertyPath: m_Layer
      value: 10
      objectReference: {fileID: 0}
    - target: {fileID: 5433117222155276134, guid: 90b941fa3c1504240a00a0de05eb3a4a,
        type: 3}
      propertyPath: m_TagString
      value: Metal
      objectReference: {fileID: 0}
    - target: {fileID: 5433117222155276134, guid: 90b941fa3c1504240a00a0de05eb3a4a,
        type: 3}
      propertyPath: m_StaticEditorFlags
      value: 4294967295
      objectReference: {fileID: 0}
    - target: {fileID: 7139400368598888570, guid: 90b941fa3c1504240a00a0de05eb3a4a,
        type: 3}
      propertyPath: m_Materials.Array.data[0]
      value: 
      objectReference: {fileID: 2100000, guid: 7d6390302bd777b47895a59ecf77a2ba, type: 2}
    - target: {fileID: 7139400368598888570, guid: 90b941fa3c1504240a00a0de05eb3a4a,
        type: 3}
      propertyPath: m_Materials.Array.data[1]
      value: 
      objectReference: {fileID: 2100000, guid: cbf54ace343547c4eae36d8d6ec6efd1, type: 2}
    - target: {fileID: 9199734400240562206, guid: 90b941fa3c1504240a00a0de05eb3a4a,
        type: 3}
      propertyPath: m_Materials.Array.data[4]
      value: 
      objectReference: {fileID: 2100000, guid: 4913b1a27c6b78245be11184e3bb54d2, type: 2}
    - target: {fileID: 9199734400240562206, guid: 90b941fa3c1504240a00a0de05eb3a4a,
        type: 3}
      propertyPath: m_Materials.Array.data[5]
      value: 
      objectReference: {fileID: 2100000, guid: c593b65254059d040a57ffc9cb795815, type: 2}
    - target: {fileID: 9199734400240562206, guid: 90b941fa3c1504240a00a0de05eb3a4a,
        type: 3}
      propertyPath: m_Materials.Array.data[8]
      value: 
      objectReference: {fileID: 2100000, guid: 92b1b6345d751c54a8f6c8faa9bc2bca, type: 2}
    - target: {fileID: 9199734400240562206, guid: 90b941fa3c1504240a00a0de05eb3a4a,
        type: 3}
      propertyPath: m_Materials.Array.data[12]
      value: 
      objectReference: {fileID: 2100000, guid: af0e2388367184241a0a4759ca53421d, type: 2}
    - target: {fileID: 9199734400240562206, guid: 90b941fa3c1504240a00a0de05eb3a4a,
        type: 3}
      propertyPath: m_Materials.Array.data[15]
      value: 
      objectReference: {fileID: 2100000, guid: e12b35b0818479d4d947d98970ca8fcc, type: 2}
    - target: {fileID: 9199734400240562206, guid: 90b941fa3c1504240a00a0de05eb3a4a,
        type: 3}
      propertyPath: m_Materials.Array.data[17]
      value: 
      objectReference: {fileID: 2100000, guid: f44380bf2d542d34986027780be90908, type: 2}
    - target: {fileID: 9199734400240562206, guid: 90b941fa3c1504240a00a0de05eb3a4a,
        type: 3}
      propertyPath: m_Materials.Array.data[18]
      value: 
      objectReference: {fileID: 2100000, guid: 41c0636eab781d64789f79cd189bd303, type: 2}
    - target: {fileID: 9199734400240562206, guid: 90b941fa3c1504240a00a0de05eb3a4a,
        type: 3}
      propertyPath: m_Materials.Array.data[20]
      value: 
      objectReference: {fileID: 2100000, guid: b8a4b214bc2514b4886bcb7c48b0930e, type: 2}
    - target: {fileID: 9199734400240562206, guid: 90b941fa3c1504240a00a0de05eb3a4a,
        type: 3}
      propertyPath: m_Materials.Array.data[23]
      value: 
      objectReference: {fileID: 2100000, guid: af0e2388367184241a0a4759ca53421d, type: 2}
    - target: {fileID: 9199734400240562206, guid: 90b941fa3c1504240a00a0de05eb3a4a,
        type: 3}
      propertyPath: m_Materials.Array.data[26]
      value: 
      objectReference: {fileID: 2100000, guid: e12b35b0818479d4d947d98970ca8fcc, type: 2}
    - target: {fileID: 9199734400240562206, guid: 90b941fa3c1504240a00a0de05eb3a4a,
        type: 3}
      propertyPath: m_Materials.Array.data[27]
      value: 
      objectReference: {fileID: 2100000, guid: 787e92e4705ac2f4185bc49761d3f5d8, type: 2}
    - target: {fileID: 9199734400240562206, guid: 90b941fa3c1504240a00a0de05eb3a4a,
        type: 3}
      propertyPath: m_Materials.Array.data[28]
      value: 
      objectReference: {fileID: 2100000, guid: 4f467b3df53533a4fb2a633be0ce0be4, type: 2}
    - target: {fileID: 9199734400240562206, guid: 90b941fa3c1504240a00a0de05eb3a4a,
        type: 3}
      propertyPath: m_Materials.Array.data[29]
      value: 
      objectReference: {fileID: 2100000, guid: b8a4b214bc2514b4886bcb7c48b0930e, type: 2}
    - target: {fileID: 9199734400240562206, guid: 90b941fa3c1504240a00a0de05eb3a4a,
        type: 3}
      propertyPath: m_Materials.Array.data[31]
      value: 
      objectReference: {fileID: 2100000, guid: f44380bf2d542d34986027780be90908, type: 2}
    - target: {fileID: 9199734400240562206, guid: 90b941fa3c1504240a00a0de05eb3a4a,
        type: 3}
      propertyPath: m_Materials.Array.data[32]
      value: 
      objectReference: {fileID: 2100000, guid: 41c0636eab781d64789f79cd189bd303, type: 2}
    - target: {fileID: 9199734400240562206, guid: 90b941fa3c1504240a00a0de05eb3a4a,
        type: 3}
      propertyPath: m_Materials.Array.data[33]
      value: 
      objectReference: {fileID: 2100000, guid: e12b35b0818479d4d947d98970ca8fcc, type: 2}
    - target: {fileID: 9199734400240562206, guid: 90b941fa3c1504240a00a0de05eb3a4a,
        type: 3}
      propertyPath: m_Materials.Array.data[34]
      value: 
      objectReference: {fileID: 2100000, guid: 9b1c2c55fec42b14f8fb2cb639a0c20e, type: 2}
    - target: {fileID: 9199734400240562206, guid: 90b941fa3c1504240a00a0de05eb3a4a,
        type: 3}
      propertyPath: m_Materials.Array.data[36]
      value: 
      objectReference: {fileID: 2100000, guid: 446e4dc1595130447813f9067aaa714e, type: 2}
    m_RemovedComponents: []
  m_SourcePrefab: {fileID: 100100000, guid: 90b941fa3c1504240a00a0de05eb3a4a, type: 3}
--- !u!1 &81066037962011135 stripped
GameObject:
  m_CorrespondingSourceObject: {fileID: -927199367670048503, guid: 90b941fa3c1504240a00a0de05eb3a4a,
    type: 3}
  m_PrefabInstance: {fileID: 8215106918987704566}
  m_PrefabAsset: {fileID: 0}
--- !u!4 &3997886921287402476 stripped
Transform:
  m_CorrespondingSourceObject: {fileID: -4216859302048453862, guid: 90b941fa3c1504240a00a0de05eb3a4a,
    type: 3}
  m_PrefabInstance: {fileID: 8215106918987704566}
  m_PrefabAsset: {fileID: 0}
--- !u!1001 &8215106919675334279
PrefabInstance:
  m_ObjectHideFlags: 0
  serializedVersion: 2
  m_Modification:
    m_TransformParent: {fileID: 8215106919649264068}
    m_Modifications:
    - target: {fileID: 2078537753930619231, guid: ad306b3ba405bb2418fd85734260d6fe,
        type: 3}
      propertyPath: m_IsActive
      value: 0
      objectReference: {fileID: 0}
    - target: {fileID: 2224703823196629214, guid: ad306b3ba405bb2418fd85734260d6fe,
        type: 3}
      propertyPath: m_Name
      value: Elevator1
      objectReference: {fileID: 0}
    - target: {fileID: 3189484250011536859, guid: ad306b3ba405bb2418fd85734260d6fe,
        type: 3}
      propertyPath: m_LocalPosition.x
      value: 1.21
      objectReference: {fileID: 0}
    - target: {fileID: 3189484250011536859, guid: ad306b3ba405bb2418fd85734260d6fe,
        type: 3}
      propertyPath: m_LocalPosition.z
      value: 1.995
      objectReference: {fileID: 0}
    - target: {fileID: 3425055455358230709, guid: ad306b3ba405bb2418fd85734260d6fe,
        type: 3}
      propertyPath: m_IsActive
      value: 0
      objectReference: {fileID: 0}
    - target: {fileID: 3896343595005662062, guid: ad306b3ba405bb2418fd85734260d6fe,
        type: 3}
      propertyPath: m_RootOrder
      value: 0
      objectReference: {fileID: 0}
    - target: {fileID: 3896343595005662062, guid: ad306b3ba405bb2418fd85734260d6fe,
        type: 3}
      propertyPath: m_LocalPosition.x
      value: 0
      objectReference: {fileID: 0}
    - target: {fileID: 3896343595005662062, guid: ad306b3ba405bb2418fd85734260d6fe,
        type: 3}
      propertyPath: m_LocalPosition.y
      value: 3.527
      objectReference: {fileID: 0}
    - target: {fileID: 3896343595005662062, guid: ad306b3ba405bb2418fd85734260d6fe,
        type: 3}
      propertyPath: m_LocalPosition.z
      value: -5.677
      objectReference: {fileID: 0}
    - target: {fileID: 3896343595005662062, guid: ad306b3ba405bb2418fd85734260d6fe,
        type: 3}
      propertyPath: m_LocalRotation.w
      value: 1
      objectReference: {fileID: 0}
    - target: {fileID: 3896343595005662062, guid: ad306b3ba405bb2418fd85734260d6fe,
        type: 3}
      propertyPath: m_LocalRotation.x
      value: 0
      objectReference: {fileID: 0}
    - target: {fileID: 3896343595005662062, guid: ad306b3ba405bb2418fd85734260d6fe,
        type: 3}
      propertyPath: m_LocalRotation.y
      value: 0
      objectReference: {fileID: 0}
    - target: {fileID: 3896343595005662062, guid: ad306b3ba405bb2418fd85734260d6fe,
        type: 3}
      propertyPath: m_LocalRotation.z
      value: 0
      objectReference: {fileID: 0}
    - target: {fileID: 3896343595005662062, guid: ad306b3ba405bb2418fd85734260d6fe,
        type: 3}
      propertyPath: m_LocalEulerAnglesHint.x
      value: 0
      objectReference: {fileID: 0}
    - target: {fileID: 3896343595005662062, guid: ad306b3ba405bb2418fd85734260d6fe,
        type: 3}
      propertyPath: m_LocalEulerAnglesHint.y
      value: 0
      objectReference: {fileID: 0}
    - target: {fileID: 3896343595005662062, guid: ad306b3ba405bb2418fd85734260d6fe,
        type: 3}
      propertyPath: m_LocalEulerAnglesHint.z
      value: 0
      objectReference: {fileID: 0}
    - target: {fileID: 5119574682429265864, guid: ad306b3ba405bb2418fd85734260d6fe,
        type: 3}
      propertyPath: m_IsActive
      value: 0
      objectReference: {fileID: 0}
    - target: {fileID: 5701593599323679596, guid: ad306b3ba405bb2418fd85734260d6fe,
        type: 3}
      propertyPath: m_LocalPosition.x
      value: 1.21
      objectReference: {fileID: 0}
    - target: {fileID: 5701593599323679596, guid: ad306b3ba405bb2418fd85734260d6fe,
        type: 3}
      propertyPath: m_LocalPosition.z
      value: 2.083
      objectReference: {fileID: 0}
    - target: {fileID: 5878669235380231848, guid: ad306b3ba405bb2418fd85734260d6fe,
        type: 3}
      propertyPath: m_IsActive
      value: 0
      objectReference: {fileID: 0}
    - target: {fileID: 6768394161307755297, guid: ad306b3ba405bb2418fd85734260d6fe,
        type: 3}
      propertyPath: m_LocalPosition.x
      value: -5.706
      objectReference: {fileID: 0}
    - target: {fileID: 6768394161307755297, guid: ad306b3ba405bb2418fd85734260d6fe,
        type: 3}
      propertyPath: m_LocalPosition.z
      value: 5.68
      objectReference: {fileID: 0}
    - target: {fileID: 6768394161307755297, guid: ad306b3ba405bb2418fd85734260d6fe,
        type: 3}
      propertyPath: m_LocalRotation.w
      value: 0.7071068
      objectReference: {fileID: 0}
    - target: {fileID: 6768394161307755297, guid: ad306b3ba405bb2418fd85734260d6fe,
        type: 3}
      propertyPath: m_LocalRotation.y
      value: 0.7071068
      objectReference: {fileID: 0}
    - target: {fileID: 6768394161307755297, guid: ad306b3ba405bb2418fd85734260d6fe,
        type: 3}
      propertyPath: m_LocalEulerAnglesHint.y
      value: 90
      objectReference: {fileID: 0}
    - target: {fileID: 6935074982498374883, guid: ad306b3ba405bb2418fd85734260d6fe,
        type: 3}
      propertyPath: m_LocalPosition.x
      value: -8.427
      objectReference: {fileID: 0}
    - target: {fileID: 6935074982498374883, guid: ad306b3ba405bb2418fd85734260d6fe,
        type: 3}
      propertyPath: m_LocalPosition.y
      value: -41.274
      objectReference: {fileID: 0}
    - target: {fileID: 6935074982498374883, guid: ad306b3ba405bb2418fd85734260d6fe,
        type: 3}
      propertyPath: m_LocalPosition.z
      value: 7.829
      objectReference: {fileID: 0}
    - target: {fileID: 6935074982498374883, guid: ad306b3ba405bb2418fd85734260d6fe,
        type: 3}
      propertyPath: m_LocalRotation.w
      value: 0.7071068
      objectReference: {fileID: 0}
    - target: {fileID: 6935074982498374883, guid: ad306b3ba405bb2418fd85734260d6fe,
        type: 3}
      propertyPath: m_LocalRotation.y
      value: 0.7071068
      objectReference: {fileID: 0}
    - target: {fileID: 6935074982498374883, guid: ad306b3ba405bb2418fd85734260d6fe,
        type: 3}
      propertyPath: m_LocalEulerAnglesHint.y
      value: 90
      objectReference: {fileID: 0}
    m_RemovedComponents: []
  m_SourcePrefab: {fileID: 100100000, guid: ad306b3ba405bb2418fd85734260d6fe, type: 3}
--- !u!4 &4905400676239302121 stripped
Transform:
  m_CorrespondingSourceObject: {fileID: 3896343595005662062, guid: ad306b3ba405bb2418fd85734260d6fe,
    type: 3}
  m_PrefabInstance: {fileID: 8215106919675334279}
  m_PrefabAsset: {fileID: 0}
--- !u!1001 &8215106919689029743
PrefabInstance:
  m_ObjectHideFlags: 0
  serializedVersion: 2
  m_Modification:
    m_TransformParent: {fileID: 8215106919649264068}
    m_Modifications:
    - target: {fileID: 100476260248226419, guid: c81a1eada14e6f04696677f14d634802,
        type: 3}
      propertyPath: screen
      value: 
      objectReference: {fileID: 21300000, guid: a2a23e12c08c8a9438b944536652fc28,
        type: 3}
    - target: {fileID: 7525384045971086366, guid: c81a1eada14e6f04696677f14d634802,
        type: 3}
      propertyPath: m_Name
      value: ReadableScreen
      objectReference: {fileID: 0}
    - target: {fileID: 9130189859734579514, guid: c81a1eada14e6f04696677f14d634802,
        type: 3}
      propertyPath: m_RootOrder
      value: 8
      objectReference: {fileID: 0}
    - target: {fileID: 9130189859734579514, guid: c81a1eada14e6f04696677f14d634802,
        type: 3}
      propertyPath: m_LocalPosition.x
      value: 1.574
      objectReference: {fileID: 0}
    - target: {fileID: 9130189859734579514, guid: c81a1eada14e6f04696677f14d634802,
        type: 3}
      propertyPath: m_LocalPosition.y
      value: -36.427322
      objectReference: {fileID: 0}
    - target: {fileID: 9130189859734579514, guid: c81a1eada14e6f04696677f14d634802,
        type: 3}
      propertyPath: m_LocalPosition.z
      value: 2.335669
      objectReference: {fileID: 0}
    - target: {fileID: 9130189859734579514, guid: c81a1eada14e6f04696677f14d634802,
        type: 3}
      propertyPath: m_LocalRotation.w
      value: 0
      objectReference: {fileID: 0}
    - target: {fileID: 9130189859734579514, guid: c81a1eada14e6f04696677f14d634802,
        type: 3}
      propertyPath: m_LocalRotation.x
      value: -0
      objectReference: {fileID: 0}
    - target: {fileID: 9130189859734579514, guid: c81a1eada14e6f04696677f14d634802,
        type: 3}
      propertyPath: m_LocalRotation.y
      value: 1
      objectReference: {fileID: 0}
    - target: {fileID: 9130189859734579514, guid: c81a1eada14e6f04696677f14d634802,
        type: 3}
      propertyPath: m_LocalRotation.z
      value: -0
      objectReference: {fileID: 0}
    - target: {fileID: 9130189859734579514, guid: c81a1eada14e6f04696677f14d634802,
        type: 3}
      propertyPath: m_LocalEulerAnglesHint.x
      value: 0
      objectReference: {fileID: 0}
    - target: {fileID: 9130189859734579514, guid: c81a1eada14e6f04696677f14d634802,
        type: 3}
      propertyPath: m_LocalEulerAnglesHint.y
      value: 180
      objectReference: {fileID: 0}
    - target: {fileID: 9130189859734579514, guid: c81a1eada14e6f04696677f14d634802,
        type: 3}
      propertyPath: m_LocalEulerAnglesHint.z
      value: 0
      objectReference: {fileID: 0}
    m_RemovedComponents: []
  m_SourcePrefab: {fileID: 100100000, guid: c81a1eada14e6f04696677f14d634802, type: 3}
--- !u!4 &915672710010462549 stripped
Transform:
  m_CorrespondingSourceObject: {fileID: 9130189859734579514, guid: c81a1eada14e6f04696677f14d634802,
    type: 3}
  m_PrefabInstance: {fileID: 8215106919689029743}
  m_PrefabAsset: {fileID: 0}
--- !u!1001 &8215106919769020173
PrefabInstance:
  m_ObjectHideFlags: 0
  serializedVersion: 2
  m_Modification:
    m_TransformParent: {fileID: 3997886921287402476}
    m_Modifications:
    - target: {fileID: 100006, guid: 3be9379f9881312438a34a53a5b9e0f4, type: 3}
      propertyPath: m_Name
      value: lamp3
      objectReference: {fileID: 0}
    - target: {fileID: 400006, guid: 3be9379f9881312438a34a53a5b9e0f4, type: 3}
      propertyPath: m_RootOrder
      value: 3
      objectReference: {fileID: 0}
    - target: {fileID: 400006, guid: 3be9379f9881312438a34a53a5b9e0f4, type: 3}
      propertyPath: m_LocalPosition.x
      value: -4.679
      objectReference: {fileID: 0}
    - target: {fileID: 400006, guid: 3be9379f9881312438a34a53a5b9e0f4, type: 3}
      propertyPath: m_LocalPosition.y
      value: -35.036
      objectReference: {fileID: 0}
    - target: {fileID: 400006, guid: 3be9379f9881312438a34a53a5b9e0f4, type: 3}
      propertyPath: m_LocalPosition.z
      value: 4.473
      objectReference: {fileID: 0}
    - target: {fileID: 400006, guid: 3be9379f9881312438a34a53a5b9e0f4, type: 3}
      propertyPath: m_LocalRotation.w
      value: 0
      objectReference: {fileID: 0}
    - target: {fileID: 400006, guid: 3be9379f9881312438a34a53a5b9e0f4, type: 3}
      propertyPath: m_LocalRotation.x
      value: -0
      objectReference: {fileID: 0}
    - target: {fileID: 400006, guid: 3be9379f9881312438a34a53a5b9e0f4, type: 3}
      propertyPath: m_LocalRotation.y
      value: -0
      objectReference: {fileID: 0}
    - target: {fileID: 400006, guid: 3be9379f9881312438a34a53a5b9e0f4, type: 3}
      propertyPath: m_LocalRotation.z
      value: 1
      objectReference: {fileID: 0}
    - target: {fileID: 400006, guid: 3be9379f9881312438a34a53a5b9e0f4, type: 3}
      propertyPath: m_LocalEulerAnglesHint.x
      value: 0
      objectReference: {fileID: 0}
    - target: {fileID: 400006, guid: 3be9379f9881312438a34a53a5b9e0f4, type: 3}
      propertyPath: m_LocalEulerAnglesHint.y
      value: 0
      objectReference: {fileID: 0}
    - target: {fileID: 400006, guid: 3be9379f9881312438a34a53a5b9e0f4, type: 3}
      propertyPath: m_LocalEulerAnglesHint.z
      value: 180
      objectReference: {fileID: 0}
    m_RemovedComponents: []
  m_SourcePrefab: {fileID: 100100000, guid: 3be9379f9881312438a34a53a5b9e0f4, type: 3}
--- !u!1001 &8919799021212911731
PrefabInstance:
  m_ObjectHideFlags: 0
  serializedVersion: 2
  m_Modification:
    m_TransformParent: {fileID: 8215106919649264068}
    m_Modifications:
    - target: {fileID: 1808541562546600270, guid: 8b117d26e8560c2458ce6465ec63e1cf,
        type: 3}
      propertyPath: Door02
      value: 
      objectReference: {fileID: 4376469249174201000}
    - target: {fileID: 1808541562546600270, guid: 8b117d26e8560c2458ce6465ec63e1cf,
        type: 3}
      propertyPath: Clearance
      value: 4
      objectReference: {fileID: 0}
    - target: {fileID: 1817873299796814978, guid: 8b117d26e8560c2458ce6465ec63e1cf,
        type: 3}
      propertyPath: Door02
      value: 
      objectReference: {fileID: 4376469249174201000}
    - target: {fileID: 1817873299796814978, guid: 8b117d26e8560c2458ce6465ec63e1cf,
        type: 3}
      propertyPath: Clearance
      value: 4
      objectReference: {fileID: 0}
    - target: {fileID: 3509292714356296820, guid: 8b117d26e8560c2458ce6465ec63e1cf,
        type: 3}
      propertyPath: m_LocalPosition.x
      value: -0.945
      objectReference: {fileID: 0}
    - target: {fileID: 3509292714356296820, guid: 8b117d26e8560c2458ce6465ec63e1cf,
        type: 3}
      propertyPath: m_LocalPosition.z
      value: -3.73
      objectReference: {fileID: 0}
    - target: {fileID: 3509292714356296820, guid: 8b117d26e8560c2458ce6465ec63e1cf,
        type: 3}
      propertyPath: m_LocalRotation.w
      value: 0.7071068
      objectReference: {fileID: 0}
    - target: {fileID: 3509292714356296820, guid: 8b117d26e8560c2458ce6465ec63e1cf,
        type: 3}
      propertyPath: m_LocalRotation.x
      value: 0
      objectReference: {fileID: 0}
    - target: {fileID: 3509292714356296820, guid: 8b117d26e8560c2458ce6465ec63e1cf,
        type: 3}
      propertyPath: m_LocalRotation.y
      value: -0.7071068
      objectReference: {fileID: 0}
    - target: {fileID: 3509292714356296820, guid: 8b117d26e8560c2458ce6465ec63e1cf,
        type: 3}
      propertyPath: m_LocalRotation.z
      value: 0
      objectReference: {fileID: 0}
    - target: {fileID: 3509292714356296820, guid: 8b117d26e8560c2458ce6465ec63e1cf,
        type: 3}
      propertyPath: m_LocalEulerAnglesHint.y
      value: -90
      objectReference: {fileID: 0}
    - target: {fileID: 3732938118764586899, guid: 8b117d26e8560c2458ce6465ec63e1cf,
        type: 3}
      propertyPath: m_IsActive
      value: 0
      objectReference: {fileID: 0}
    - target: {fileID: 4321894189022098867, guid: 8b117d26e8560c2458ce6465ec63e1cf,
        type: 3}
      propertyPath: m_IsActive
      value: 0
      objectReference: {fileID: 0}
    - target: {fileID: 4416237426726756766, guid: 8b117d26e8560c2458ce6465ec63e1cf,
        type: 3}
      propertyPath: m_LocalPosition.x
      value: 1.003
      objectReference: {fileID: 0}
    - target: {fileID: 4416237426726756766, guid: 8b117d26e8560c2458ce6465ec63e1cf,
        type: 3}
      propertyPath: m_LocalPosition.z
      value: 0.313
      objectReference: {fileID: 0}
    - target: {fileID: 4704157506594609049, guid: 8b117d26e8560c2458ce6465ec63e1cf,
        type: 3}
      propertyPath: m_RootOrder
      value: 4
      objectReference: {fileID: 0}
    - target: {fileID: 4704157506594609049, guid: 8b117d26e8560c2458ce6465ec63e1cf,
        type: 3}
      propertyPath: m_LocalPosition.x
      value: -2.213
      objectReference: {fileID: 0}
    - target: {fileID: 4704157506594609049, guid: 8b117d26e8560c2458ce6465ec63e1cf,
        type: 3}
      propertyPath: m_LocalPosition.y
      value: -38.280003
      objectReference: {fileID: 0}
    - target: {fileID: 4704157506594609049, guid: 8b117d26e8560c2458ce6465ec63e1cf,
        type: 3}
      propertyPath: m_LocalPosition.z
      value: 5.042
      objectReference: {fileID: 0}
    - target: {fileID: 4704157506594609049, guid: 8b117d26e8560c2458ce6465ec63e1cf,
        type: 3}
      propertyPath: m_LocalRotation.w
      value: 1
      objectReference: {fileID: 0}
    - target: {fileID: 4704157506594609049, guid: 8b117d26e8560c2458ce6465ec63e1cf,
        type: 3}
      propertyPath: m_LocalRotation.x
      value: -0
      objectReference: {fileID: 0}
    - target: {fileID: 4704157506594609049, guid: 8b117d26e8560c2458ce6465ec63e1cf,
        type: 3}
      propertyPath: m_LocalRotation.y
      value: -0
      objectReference: {fileID: 0}
    - target: {fileID: 4704157506594609049, guid: 8b117d26e8560c2458ce6465ec63e1cf,
        type: 3}
      propertyPath: m_LocalRotation.z
      value: -0
      objectReference: {fileID: 0}
    - target: {fileID: 4704157506594609049, guid: 8b117d26e8560c2458ce6465ec63e1cf,
        type: 3}
      propertyPath: m_LocalEulerAnglesHint.x
      value: 0
      objectReference: {fileID: 0}
    - target: {fileID: 4704157506594609049, guid: 8b117d26e8560c2458ce6465ec63e1cf,
        type: 3}
      propertyPath: m_LocalEulerAnglesHint.y
      value: 0
      objectReference: {fileID: 0}
    - target: {fileID: 4704157506594609049, guid: 8b117d26e8560c2458ce6465ec63e1cf,
        type: 3}
      propertyPath: m_LocalEulerAnglesHint.z
      value: 0
      objectReference: {fileID: 0}
    - target: {fileID: 8844315487564344749, guid: 8b117d26e8560c2458ce6465ec63e1cf,
        type: 3}
      propertyPath: m_Name
      value: LightDoor_key
      objectReference: {fileID: 0}
    - target: {fileID: 9147573010740672022, guid: 8b117d26e8560c2458ce6465ec63e1cf,
        type: 3}
      propertyPath: m_LocalPosition.y
      value: -2.694
      objectReference: {fileID: 0}
    m_RemovedComponents: []
  m_SourcePrefab: {fileID: 100100000, guid: 8b117d26e8560c2458ce6465ec63e1cf, type: 3}
--- !u!4 &4215927422002585578 stripped
Transform:
  m_CorrespondingSourceObject: {fileID: 4704157506594609049, guid: 8b117d26e8560c2458ce6465ec63e1cf,
    type: 3}
  m_PrefabInstance: {fileID: 8919799021212911731}
  m_PrefabAsset: {fileID: 0}
