%YAML 1.1
%TAG !u! tag:unity3d.com,2011:
--- !u!1 &2224703823196629214
GameObject:
  m_ObjectHideFlags: 0
  m_CorrespondingSourceObject: {fileID: 0}
  m_PrefabInstance: {fileID: 0}
  m_PrefabAsset: {fileID: 0}
  serializedVersion: 6
  m_Component:
  - component: {fileID: 3896343595005662062}
  - component: {fileID: 8431967954715470539}
  m_Layer: 0
  m_Name: Elevator1
  m_TagString: Untagged
  m_Icon: {fileID: 0}
  m_NavMeshLayer: 0
  m_StaticEditorFlags: 0
  m_IsActive: 1
--- !u!4 &3896343595005662062
Transform:
  m_ObjectHideFlags: 0
  m_CorrespondingSourceObject: {fileID: 0}
  m_PrefabInstance: {fileID: 0}
  m_PrefabAsset: {fileID: 0}
  m_GameObject: {fileID: 2224703823196629214}
  m_LocalRotation: {x: 0, y: 0, z: 0, w: 1}
  m_LocalPosition: {x: 0, y: 3.527, z: -5.677}
  m_LocalScale: {x: 1, y: 1, z: 1}
  m_Children:
  - {fileID: 6768394161307755297}
  - {fileID: 6935074982498374883}
  m_Father: {fileID: 0}
  m_RootOrder: 0
  m_LocalEulerAnglesHint: {x: 0, y: 0, z: 0}
--- !u!114 &8431967954715470539
MonoBehaviour:
  m_ObjectHideFlags: 0
  m_CorrespondingSourceObject: {fileID: 0}
  m_PrefabInstance: {fileID: 0}
  m_PrefabAsset: {fileID: 0}
  m_GameObject: {fileID: 2224703823196629214}
  m_Enabled: 1
  m_EditorHideFlags: 0
  m_Script: {fileID: 11500000, guid: d6ff07d84996e42499bc795289b24a57, type: 3}
  m_Name: 
  m_EditorClassIdentifier: 
  ignoreSave: 0
  isDisabled: 0
  Floor1: {fileID: 6768394161307755297}
  Floor2: {fileID: 6935074982498374883}
  Out1: {fileID: 4987842582506974526}
  Out2: {fileID: 4987842581282449038}
  Switch1: {fileID: 3847126937091692778}
  Switch2: {fileID: 5219222610944796223}
  Door1: {fileID: 3125309714467274761}
  Door2: {fileID: 1733633489829870051}
  Door1Objects: {fileID: 3425055455358230709}
  Door2Objects: {fileID: 2078537753930619231}
  FloorUp: 1
  MovingTime: 10
  elev: {fileID: 8300000, guid: 66a79e2f777af5f46bf90f537c1877db, type: 3}
  ding: {fileID: 8300000, guid: f7489e4f2c4e8834bb0b63a90189a46c, type: 3}
--- !u!1 &2341493949941973416
GameObject:
  m_ObjectHideFlags: 0
  m_CorrespondingSourceObject: {fileID: 0}
  m_PrefabInstance: {fileID: 0}
  m_PrefabAsset: {fileID: 0}
  serializedVersion: 6
  m_Component:
  - component: {fileID: 6768394161307755297}
  m_Layer: 0
  m_Name: Floor1_1
  m_TagString: Untagged
  m_Icon: {fileID: 0}
  m_NavMeshLayer: 0
  m_StaticEditorFlags: 0
  m_IsActive: 1
--- !u!4 &6768394161307755297
Transform:
  m_ObjectHideFlags: 0
  m_CorrespondingSourceObject: {fileID: 0}
  m_PrefabInstance: {fileID: 0}
  m_PrefabAsset: {fileID: 0}
  m_GameObject: {fileID: 2341493949941973416}
  m_LocalRotation: {x: 0, y: 0, z: 0, w: 1}
  m_LocalPosition: {x: 0, y: -3, z: 0}
  m_LocalScale: {x: 1, y: 1, z: 1}
  m_Children:
  - {fileID: 5133987171758525414}
  - {fileID: 3698679939194592814}
  - {fileID: 1981096627656276526}
  m_Father: {fileID: 3896343595005662062}
  m_RootOrder: 0
  m_LocalEulerAnglesHint: {x: 0, y: 0, z: 0}
--- !u!1 &5119574682429265864
GameObject:
  m_ObjectHideFlags: 0
  m_CorrespondingSourceObject: {fileID: 0}
  m_PrefabInstance: {fileID: 0}
  m_PrefabAsset: {fileID: 0}
  serializedVersion: 6
  m_Component:
  - component: {fileID: 1981096627656276526}
  m_Layer: 0
  m_Name: Buttons
  m_TagString: Untagged
  m_Icon: {fileID: 0}
  m_NavMeshLayer: 0
  m_StaticEditorFlags: 0
  m_IsActive: 0
--- !u!4 &1981096627656276526
Transform:
  m_ObjectHideFlags: 0
  m_CorrespondingSourceObject: {fileID: 0}
  m_PrefabInstance: {fileID: 0}
  m_PrefabAsset: {fileID: 0}
  m_GameObject: {fileID: 5119574682429265864}
  m_LocalRotation: {x: 0, y: 0, z: 0, w: 1}
  m_LocalPosition: {x: 0, y: 0, z: 0}
  m_LocalScale: {x: 1, y: 1, z: 1}
  m_Children:
  - {fileID: 3189484250011536859}
  - {fileID: 9208468642897077053}
  m_Father: {fileID: 6768394161307755297}
  m_RootOrder: 2
  m_LocalEulerAnglesHint: {x: 0, y: 0, z: 0}
--- !u!1 &5878669235380231848
GameObject:
  m_ObjectHideFlags: 0
  m_CorrespondingSourceObject: {fileID: 0}
  m_PrefabInstance: {fileID: 0}
  m_PrefabAsset: {fileID: 0}
  serializedVersion: 6
  m_Component:
  - component: {fileID: 1110999074326952012}
  m_Layer: 0
  m_Name: Buttons
  m_TagString: Untagged
  m_Icon: {fileID: 0}
  m_NavMeshLayer: 0
  m_StaticEditorFlags: 0
  m_IsActive: 0
--- !u!4 &1110999074326952012
Transform:
  m_ObjectHideFlags: 0
  m_CorrespondingSourceObject: {fileID: 0}
  m_PrefabInstance: {fileID: 0}
  m_PrefabAsset: {fileID: 0}
  m_GameObject: {fileID: 5878669235380231848}
  m_LocalRotation: {x: 0, y: 0, z: 0, w: 1}
  m_LocalPosition: {x: 0, y: 0, z: 0}
  m_LocalScale: {x: 1, y: 1, z: 1}
  m_Children:
  - {fileID: 9208468644088604813}
  - {fileID: 5701593599323679596}
  m_Father: {fileID: 6935074982498374883}
  m_RootOrder: 2
  m_LocalEulerAnglesHint: {x: 0, y: 0, z: 0}
--- !u!1 &7727696274294369025
GameObject:
  m_ObjectHideFlags: 0
  m_CorrespondingSourceObject: {fileID: 0}
  m_PrefabInstance: {fileID: 0}
  m_PrefabAsset: {fileID: 0}
  serializedVersion: 6
  m_Component:
  - component: {fileID: 6935074982498374883}
  m_Layer: 0
  m_Name: Floor2_2
  m_TagString: Untagged
  m_Icon: {fileID: 0}
  m_NavMeshLayer: 0
  m_StaticEditorFlags: 0
  m_IsActive: 1
--- !u!4 &6935074982498374883
Transform:
  m_ObjectHideFlags: 0
  m_CorrespondingSourceObject: {fileID: 0}
  m_PrefabInstance: {fileID: 0}
  m_PrefabAsset: {fileID: 0}
  m_GameObject: {fileID: 7727696274294369025}
  m_LocalRotation: {x: 0, y: 1, z: 0, w: 0}
  m_LocalPosition: {x: 3.437, y: -45.25, z: 14.225}
  m_LocalScale: {x: 1, y: 1, z: 1}
  m_Children:
  - {fileID: 8390163192993919500}
  - {fileID: 642553028437726338}
  - {fileID: 1110999074326952012}
  m_Father: {fileID: 3896343595005662062}
  m_RootOrder: 1
  m_LocalEulerAnglesHint: {x: 0, y: 180, z: 0}
--- !u!1001 &882518136445741117
PrefabInstance:
  m_ObjectHideFlags: 0
  serializedVersion: 2
  m_Modification:
    m_TransformParent: {fileID: 6768394161307755297}
    m_Modifications:
    - target: {fileID: 5404534713671246811, guid: a9d5b6c75c132ef4e9e2aafd2dbca369,
        type: 3}
      propertyPath: m_RootOrder
      value: 0
      objectReference: {fileID: 0}
    - target: {fileID: 5404534713671246811, guid: a9d5b6c75c132ef4e9e2aafd2dbca369,
        type: 3}
      propertyPath: m_LocalPosition.x
      value: -0.003008008
      objectReference: {fileID: 0}
    - target: {fileID: 5404534713671246811, guid: a9d5b6c75c132ef4e9e2aafd2dbca369,
        type: 3}
      propertyPath: m_LocalPosition.y
      value: -0.52699995
      objectReference: {fileID: 0}
    - target: {fileID: 5404534713671246811, guid: a9d5b6c75c132ef4e9e2aafd2dbca369,
        type: 3}
      propertyPath: m_LocalPosition.z
      value: 2.4107723
      objectReference: {fileID: 0}
    - target: {fileID: 5404534713671246811, guid: a9d5b6c75c132ef4e9e2aafd2dbca369,
        type: 3}
      propertyPath: m_LocalRotation.w
      value: 1
      objectReference: {fileID: 0}
    - target: {fileID: 5404534713671246811, guid: a9d5b6c75c132ef4e9e2aafd2dbca369,
        type: 3}
      propertyPath: m_LocalRotation.x
      value: -0
      objectReference: {fileID: 0}
    - target: {fileID: 5404534713671246811, guid: a9d5b6c75c132ef4e9e2aafd2dbca369,
        type: 3}
      propertyPath: m_LocalRotation.y
      value: -0
      objectReference: {fileID: 0}
    - target: {fileID: 5404534713671246811, guid: a9d5b6c75c132ef4e9e2aafd2dbca369,
        type: 3}
      propertyPath: m_LocalRotation.z
      value: -0
      objectReference: {fileID: 0}
    - target: {fileID: 5404534713671246811, guid: a9d5b6c75c132ef4e9e2aafd2dbca369,
        type: 3}
      propertyPath: m_LocalEulerAnglesHint.x
      value: 0
      objectReference: {fileID: 0}
    - target: {fileID: 5404534713671246811, guid: a9d5b6c75c132ef4e9e2aafd2dbca369,
        type: 3}
      propertyPath: m_LocalEulerAnglesHint.y
      value: 0
      objectReference: {fileID: 0}
    - target: {fileID: 5404534713671246811, guid: a9d5b6c75c132ef4e9e2aafd2dbca369,
        type: 3}
      propertyPath: m_LocalEulerAnglesHint.z
      value: 0
      objectReference: {fileID: 0}
    - target: {fileID: 8139438254142872047, guid: a9d5b6c75c132ef4e9e2aafd2dbca369,
        type: 3}
      propertyPath: m_Name
      value: ElevDoor_def (1)
      objectReference: {fileID: 0}
    m_RemovedComponents: []
  m_SourcePrefab: {fileID: 100100000, guid: a9d5b6c75c132ef4e9e2aafd2dbca369, type: 3}
--- !u!4 &5133987171758525414 stripped
Transform:
  m_CorrespondingSourceObject: {fileID: 5404534713671246811, guid: a9d5b6c75c132ef4e9e2aafd2dbca369,
    type: 3}
  m_PrefabInstance: {fileID: 882518136445741117}
  m_PrefabAsset: {fileID: 0}
--- !u!114 &3125309714467274761 stripped
MonoBehaviour:
  m_CorrespondingSourceObject: {fileID: 2837269078720538676, guid: a9d5b6c75c132ef4e9e2aafd2dbca369,
    type: 3}
  m_PrefabInstance: {fileID: 882518136445741117}
  m_PrefabAsset: {fileID: 0}
  m_GameObject: {fileID: 0}
  m_Enabled: 1
  m_EditorHideFlags: 0
  m_Script: {fileID: 11500000, guid: fd3b7ec2d9ca287468ffa0e795e730d6, type: 3}
  m_Name: 
  m_EditorClassIdentifier: 
--- !u!1 &3425055455358230709 stripped
GameObject:
  m_CorrespondingSourceObject: {fileID: 2573640454366300296, guid: a9d5b6c75c132ef4e9e2aafd2dbca369,
    type: 3}
  m_PrefabInstance: {fileID: 882518136445741117}
  m_PrefabAsset: {fileID: 0}
--- !u!1001 &1274557353957447779
PrefabInstance:
  m_ObjectHideFlags: 0
  serializedVersion: 2
  m_Modification:
    m_TransformParent: {fileID: 6935074982498374883}
    m_Modifications:
    - target: {fileID: 225344393597093137, guid: f03c9da0555287f42b4a99a37d66d188,
        type: 3}
      propertyPath: m_Name
      value: DistanceShut
      objectReference: {fileID: 0}
    - target: {fileID: 1827033982661758177, guid: f03c9da0555287f42b4a99a37d66d188,
        type: 3}
      propertyPath: m_RootOrder
      value: 1
      objectReference: {fileID: 0}
    - target: {fileID: 1827033982661758177, guid: f03c9da0555287f42b4a99a37d66d188,
        type: 3}
      propertyPath: m_LocalPosition.x
      value: 0
      objectReference: {fileID: 0}
    - target: {fileID: 1827033982661758177, guid: f03c9da0555287f42b4a99a37d66d188,
        type: 3}
      propertyPath: m_LocalPosition.y
      value: 0
      objectReference: {fileID: 0}
    - target: {fileID: 1827033982661758177, guid: f03c9da0555287f42b4a99a37d66d188,
        type: 3}
      propertyPath: m_LocalPosition.z
      value: 2.418
      objectReference: {fileID: 0}
    - target: {fileID: 1827033982661758177, guid: f03c9da0555287f42b4a99a37d66d188,
        type: 3}
      propertyPath: m_LocalRotation.w
      value: 1
      objectReference: {fileID: 0}
    - target: {fileID: 1827033982661758177, guid: f03c9da0555287f42b4a99a37d66d188,
        type: 3}
      propertyPath: m_LocalRotation.x
      value: 0
      objectReference: {fileID: 0}
    - target: {fileID: 1827033982661758177, guid: f03c9da0555287f42b4a99a37d66d188,
        type: 3}
      propertyPath: m_LocalRotation.y
      value: 0
      objectReference: {fileID: 0}
    - target: {fileID: 1827033982661758177, guid: f03c9da0555287f42b4a99a37d66d188,
        type: 3}
      propertyPath: m_LocalRotation.z
      value: 0
      objectReference: {fileID: 0}
    - target: {fileID: 1827033982661758177, guid: f03c9da0555287f42b4a99a37d66d188,
        type: 3}
      propertyPath: m_LocalEulerAnglesHint.x
      value: 0
      objectReference: {fileID: 0}
    - target: {fileID: 1827033982661758177, guid: f03c9da0555287f42b4a99a37d66d188,
        type: 3}
      propertyPath: m_LocalEulerAnglesHint.y
      value: 0
      objectReference: {fileID: 0}
    - target: {fileID: 1827033982661758177, guid: f03c9da0555287f42b4a99a37d66d188,
        type: 3}
      propertyPath: m_LocalEulerAnglesHint.z
      value: 0
      objectReference: {fileID: 0}
    - target: {fileID: 3276537589267162220, guid: f03c9da0555287f42b4a99a37d66d188,
        type: 3}
      propertyPath: Contains
      value: 
      objectReference: {fileID: 5878669235380231848}
    m_RemovedComponents: []
  m_SourcePrefab: {fileID: 100100000, guid: f03c9da0555287f42b4a99a37d66d188, type: 3}
--- !u!4 &642553028437726338 stripped
Transform:
  m_CorrespondingSourceObject: {fileID: 1827033982661758177, guid: f03c9da0555287f42b4a99a37d66d188,
    type: 3}
  m_PrefabInstance: {fileID: 1274557353957447779}
  m_PrefabAsset: {fileID: 0}
--- !u!1001 &1634874907579188189
PrefabInstance:
  m_ObjectHideFlags: 0
  serializedVersion: 2
  m_Modification:
    m_TransformParent: {fileID: 1981096627656276526}
    m_Modifications:
    - target: {fileID: 3181818087543733026, guid: d332d9230e7418340a8055bb5239e165,
        type: 3}
      propertyPath: m_Name
      value: Button (3)
      objectReference: {fileID: 0}
    - target: {fileID: 4247858822796873222, guid: d332d9230e7418340a8055bb5239e165,
        type: 3}
      propertyPath: m_RootOrder
      value: 0
      objectReference: {fileID: 0}
    - target: {fileID: 4247858822796873222, guid: d332d9230e7418340a8055bb5239e165,
        type: 3}
      propertyPath: m_LocalPosition.x
      value: 1.209517
      objectReference: {fileID: 0}
    - target: {fileID: 4247858822796873222, guid: d332d9230e7418340a8055bb5239e165,
        type: 3}
      propertyPath: m_LocalPosition.y
      value: 0.83514977
      objectReference: {fileID: 0}
    - target: {fileID: 4247858822796873222, guid: d332d9230e7418340a8055bb5239e165,
        type: 3}
      propertyPath: m_LocalPosition.z
      value: 1.912
      objectReference: {fileID: 0}
    - target: {fileID: 4247858822796873222, guid: d332d9230e7418340a8055bb5239e165,
        type: 3}
      propertyPath: m_LocalRotation.w
      value: 1
      objectReference: {fileID: 0}
    - target: {fileID: 4247858822796873222, guid: d332d9230e7418340a8055bb5239e165,
        type: 3}
      propertyPath: m_LocalRotation.x
      value: -0
      objectReference: {fileID: 0}
    - target: {fileID: 4247858822796873222, guid: d332d9230e7418340a8055bb5239e165,
        type: 3}
      propertyPath: m_LocalRotation.y
      value: -0
      objectReference: {fileID: 0}
    - target: {fileID: 4247858822796873222, guid: d332d9230e7418340a8055bb5239e165,
        type: 3}
      propertyPath: m_LocalRotation.z
      value: -0
      objectReference: {fileID: 0}
    - target: {fileID: 4247858822796873222, guid: d332d9230e7418340a8055bb5239e165,
        type: 3}
      propertyPath: m_LocalEulerAnglesHint.x
      value: 0
      objectReference: {fileID: 0}
    - target: {fileID: 4247858822796873222, guid: d332d9230e7418340a8055bb5239e165,
        type: 3}
      propertyPath: m_LocalEulerAnglesHint.y
      value: 0
      objectReference: {fileID: 0}
    - target: {fileID: 4247858822796873222, guid: d332d9230e7418340a8055bb5239e165,
        type: 3}
      propertyPath: m_LocalEulerAnglesHint.z
      value: 0
      objectReference: {fileID: 0}
    - target: {fileID: 4398250279716389959, guid: d332d9230e7418340a8055bb5239e165,
        type: 3}
      propertyPath: m_Center.z
      value: -0.03
      objectReference: {fileID: 0}
    m_RemovedComponents:
    - {fileID: 5202819318507689766, guid: d332d9230e7418340a8055bb5239e165, type: 3}
  m_SourcePrefab: {fileID: 100100000, guid: d332d9230e7418340a8055bb5239e165, type: 3}
--- !u!1 &4222169319552973055 stripped
GameObject:
  m_CorrespondingSourceObject: {fileID: 3181818087543733026, guid: d332d9230e7418340a8055bb5239e165,
    type: 3}
  m_PrefabInstance: {fileID: 1634874907579188189}
  m_PrefabAsset: {fileID: 0}
--- !u!4 &3189484250011536859 stripped
Transform:
  m_CorrespondingSourceObject: {fileID: 4247858822796873222, guid: d332d9230e7418340a8055bb5239e165,
    type: 3}
  m_PrefabInstance: {fileID: 1634874907579188189}
  m_PrefabAsset: {fileID: 0}
--- !u!114 &3847126937091692778
MonoBehaviour:
  m_ObjectHideFlags: 0
  m_CorrespondingSourceObject: {fileID: 0}
  m_PrefabInstance: {fileID: 0}
  m_PrefabAsset: {fileID: 0}
  m_GameObject: {fileID: 4222169319552973055}
  m_Enabled: 1
  m_EditorHideFlags: 0
  m_Script: {fileID: 11500000, guid: fd2912613eee9a14eab3862c1f011892, type: 3}
  m_Name: 
  m_EditorClassIdentifier: 
  clicked: {fileID: 8300000, guid: e5fe7496a5f470444bf38def2103322e, type: 3}
  activated: 0
--- !u!1001 &3030558012806894287
PrefabInstance:
  m_ObjectHideFlags: 0
  serializedVersion: 2
  m_Modification:
    m_TransformParent: {fileID: 6768394161307755297}
    m_Modifications:
    - target: {fileID: 225344393597093137, guid: f03c9da0555287f42b4a99a37d66d188,
        type: 3}
      propertyPath: m_Name
      value: DistanceShut
      objectReference: {fileID: 0}
    - target: {fileID: 1827033982661758177, guid: f03c9da0555287f42b4a99a37d66d188,
        type: 3}
      propertyPath: m_RootOrder
      value: 1
      objectReference: {fileID: 0}
    - target: {fileID: 1827033982661758177, guid: f03c9da0555287f42b4a99a37d66d188,
        type: 3}
      propertyPath: m_LocalPosition.x
      value: 0
      objectReference: {fileID: 0}
    - target: {fileID: 1827033982661758177, guid: f03c9da0555287f42b4a99a37d66d188,
        type: 3}
      propertyPath: m_LocalPosition.y
      value: 0
      objectReference: {fileID: 0}
    - target: {fileID: 1827033982661758177, guid: f03c9da0555287f42b4a99a37d66d188,
        type: 3}
      propertyPath: m_LocalPosition.z
      value: 2.481
      objectReference: {fileID: 0}
    - target: {fileID: 1827033982661758177, guid: f03c9da0555287f42b4a99a37d66d188,
        type: 3}
      propertyPath: m_LocalRotation.w
      value: 1
      objectReference: {fileID: 0}
    - target: {fileID: 1827033982661758177, guid: f03c9da0555287f42b4a99a37d66d188,
        type: 3}
      propertyPath: m_LocalRotation.x
      value: 0
      objectReference: {fileID: 0}
    - target: {fileID: 1827033982661758177, guid: f03c9da0555287f42b4a99a37d66d188,
        type: 3}
      propertyPath: m_LocalRotation.y
      value: 0
      objectReference: {fileID: 0}
    - target: {fileID: 1827033982661758177, guid: f03c9da0555287f42b4a99a37d66d188,
        type: 3}
      propertyPath: m_LocalRotation.z
      value: 0
      objectReference: {fileID: 0}
    - target: {fileID: 1827033982661758177, guid: f03c9da0555287f42b4a99a37d66d188,
        type: 3}
      propertyPath: m_LocalEulerAnglesHint.x
      value: 0
      objectReference: {fileID: 0}
    - target: {fileID: 1827033982661758177, guid: f03c9da0555287f42b4a99a37d66d188,
        type: 3}
      propertyPath: m_LocalEulerAnglesHint.y
      value: 0
      objectReference: {fileID: 0}
    - target: {fileID: 1827033982661758177, guid: f03c9da0555287f42b4a99a37d66d188,
        type: 3}
      propertyPath: m_LocalEulerAnglesHint.z
      value: 0
      objectReference: {fileID: 0}
    - target: {fileID: 3276537589267162220, guid: f03c9da0555287f42b4a99a37d66d188,
        type: 3}
      propertyPath: Contains
      value: 
      objectReference: {fileID: 5119574682429265864}
    m_RemovedComponents: []
  m_SourcePrefab: {fileID: 100100000, guid: f03c9da0555287f42b4a99a37d66d188, type: 3}
--- !u!4 &3698679939194592814 stripped
Transform:
  m_CorrespondingSourceObject: {fileID: 1827033982661758177, guid: f03c9da0555287f42b4a99a37d66d188,
    type: 3}
  m_PrefabInstance: {fileID: 3030558012806894287}
  m_PrefabAsset: {fileID: 0}
--- !u!1001 &4570902145495323095
PrefabInstance:
  m_ObjectHideFlags: 0
  serializedVersion: 2
  m_Modification:
    m_TransformParent: {fileID: 6935074982498374883}
    m_Modifications:
    - target: {fileID: 5404534713671246811, guid: a9d5b6c75c132ef4e9e2aafd2dbca369,
        type: 3}
      propertyPath: m_RootOrder
      value: 0
      objectReference: {fileID: 0}
    - target: {fileID: 5404534713671246811, guid: a9d5b6c75c132ef4e9e2aafd2dbca369,
        type: 3}
      propertyPath: m_LocalPosition.x
      value: -0.003008008
      objectReference: {fileID: 0}
    - target: {fileID: 5404534713671246811, guid: a9d5b6c75c132ef4e9e2aafd2dbca369,
        type: 3}
      propertyPath: m_LocalPosition.y
      value: -0.52699995
      objectReference: {fileID: 0}
    - target: {fileID: 5404534713671246811, guid: a9d5b6c75c132ef4e9e2aafd2dbca369,
        type: 3}
      propertyPath: m_LocalPosition.z
      value: 2.4107723
      objectReference: {fileID: 0}
    - target: {fileID: 5404534713671246811, guid: a9d5b6c75c132ef4e9e2aafd2dbca369,
        type: 3}
      propertyPath: m_LocalRotation.w
      value: 1
      objectReference: {fileID: 0}
    - target: {fileID: 5404534713671246811, guid: a9d5b6c75c132ef4e9e2aafd2dbca369,
        type: 3}
      propertyPath: m_LocalRotation.x
      value: -0
      objectReference: {fileID: 0}
    - target: {fileID: 5404534713671246811, guid: a9d5b6c75c132ef4e9e2aafd2dbca369,
        type: 3}
      propertyPath: m_LocalRotation.y
      value: -0
      objectReference: {fileID: 0}
    - target: {fileID: 5404534713671246811, guid: a9d5b6c75c132ef4e9e2aafd2dbca369,
        type: 3}
      propertyPath: m_LocalRotation.z
      value: -0
      objectReference: {fileID: 0}
    - target: {fileID: 5404534713671246811, guid: a9d5b6c75c132ef4e9e2aafd2dbca369,
        type: 3}
      propertyPath: m_LocalEulerAnglesHint.x
      value: 0
      objectReference: {fileID: 0}
    - target: {fileID: 5404534713671246811, guid: a9d5b6c75c132ef4e9e2aafd2dbca369,
        type: 3}
      propertyPath: m_LocalEulerAnglesHint.y
      value: 0
      objectReference: {fileID: 0}
    - target: {fileID: 5404534713671246811, guid: a9d5b6c75c132ef4e9e2aafd2dbca369,
        type: 3}
      propertyPath: m_LocalEulerAnglesHint.z
      value: 0
      objectReference: {fileID: 0}
    - target: {fileID: 8139438254142872047, guid: a9d5b6c75c132ef4e9e2aafd2dbca369,
        type: 3}
      propertyPath: m_Name
      value: ElevDoor_def
      objectReference: {fileID: 0}
    m_RemovedComponents: []
  m_SourcePrefab: {fileID: 100100000, guid: a9d5b6c75c132ef4e9e2aafd2dbca369, type: 3}
--- !u!1 &2078537753930619231 stripped
GameObject:
  m_CorrespondingSourceObject: {fileID: 2573640454366300296, guid: a9d5b6c75c132ef4e9e2aafd2dbca369,
    type: 3}
  m_PrefabInstance: {fileID: 4570902145495323095}
  m_PrefabAsset: {fileID: 0}
--- !u!4 &8390163192993919500 stripped
Transform:
  m_CorrespondingSourceObject: {fileID: 5404534713671246811, guid: a9d5b6c75c132ef4e9e2aafd2dbca369,
    type: 3}
  m_PrefabInstance: {fileID: 4570902145495323095}
  m_PrefabAsset: {fileID: 0}
--- !u!114 &1733633489829870051 stripped
MonoBehaviour:
  m_CorrespondingSourceObject: {fileID: 2837269078720538676, guid: a9d5b6c75c132ef4e9e2aafd2dbca369,
    type: 3}
  m_PrefabInstance: {fileID: 4570902145495323095}
  m_PrefabAsset: {fileID: 0}
  m_GameObject: {fileID: 0}
  m_Enabled: 1
  m_EditorHideFlags: 0
  m_Script: {fileID: 11500000, guid: fd3b7ec2d9ca287468ffa0e795e730d6, type: 3}
  m_Name: 
  m_EditorClassIdentifier: 
--- !u!1001 &4987842581282449035
PrefabInstance:
  m_ObjectHideFlags: 0
  serializedVersion: 2
  m_Modification:
    m_TransformParent: {fileID: 1110999074326952012}
    m_Modifications:
    - target: {fileID: 3181818087543733026, guid: d332d9230e7418340a8055bb5239e165,
        type: 3}
      propertyPath: m_Name
      value: Button (5)
      objectReference: {fileID: 0}
    - target: {fileID: 4247858822796873222, guid: d332d9230e7418340a8055bb5239e165,
        type: 3}
      propertyPath: m_RootOrder
      value: 0
      objectReference: {fileID: 0}
    - target: {fileID: 4247858822796873222, guid: d332d9230e7418340a8055bb5239e165,
        type: 3}
      propertyPath: m_LocalPosition.x
      value: -0.99099994
      objectReference: {fileID: 0}
    - target: {fileID: 4247858822796873222, guid: d332d9230e7418340a8055bb5239e165,
        type: 3}
      propertyPath: m_LocalPosition.y
      value: 0.8351517
      objectReference: {fileID: 0}
    - target: {fileID: 4247858822796873222, guid: d332d9230e7418340a8055bb5239e165,
        type: 3}
      propertyPath: m_LocalPosition.z
      value: 2.7180004
      objectReference: {fileID: 0}
    - target: {fileID: 4247858822796873222, guid: d332d9230e7418340a8055bb5239e165,
        type: 3}
      propertyPath: m_LocalRotation.w
      value: 0
      objectReference: {fileID: 0}
    - target: {fileID: 4247858822796873222, guid: d332d9230e7418340a8055bb5239e165,
        type: 3}
      propertyPath: m_LocalRotation.x
      value: -0
      objectReference: {fileID: 0}
    - target: {fileID: 4247858822796873222, guid: d332d9230e7418340a8055bb5239e165,
        type: 3}
      propertyPath: m_LocalRotation.y
      value: 1
      objectReference: {fileID: 0}
    - target: {fileID: 4247858822796873222, guid: d332d9230e7418340a8055bb5239e165,
        type: 3}
      propertyPath: m_LocalRotation.z
      value: -0
      objectReference: {fileID: 0}
    - target: {fileID: 4247858822796873222, guid: d332d9230e7418340a8055bb5239e165,
        type: 3}
      propertyPath: m_LocalEulerAnglesHint.x
      value: 0
      objectReference: {fileID: 0}
    - target: {fileID: 4247858822796873222, guid: d332d9230e7418340a8055bb5239e165,
        type: 3}
      propertyPath: m_LocalEulerAnglesHint.y
      value: 180
      objectReference: {fileID: 0}
    - target: {fileID: 4247858822796873222, guid: d332d9230e7418340a8055bb5239e165,
        type: 3}
      propertyPath: m_LocalEulerAnglesHint.z
      value: 0
      objectReference: {fileID: 0}
    - target: {fileID: 4398250279716389959, guid: d332d9230e7418340a8055bb5239e165,
        type: 3}
      propertyPath: m_Center.z
      value: -0.03
      objectReference: {fileID: 0}
    - target: {fileID: 8745853725360919475, guid: d332d9230e7418340a8055bb5239e165,
        type: 3}
      propertyPath: m_LocalPosition.z
      value: 0.0065
      objectReference: {fileID: 0}
    m_RemovedComponents:
    - {fileID: 5202819318507689766, guid: d332d9230e7418340a8055bb5239e165, type: 3}
  m_SourcePrefab: {fileID: 100100000, guid: d332d9230e7418340a8055bb5239e165, type: 3}
--- !u!1 &7570681643344371113 stripped
GameObject:
  m_CorrespondingSourceObject: {fileID: 3181818087543733026, guid: d332d9230e7418340a8055bb5239e165,
    type: 3}
  m_PrefabInstance: {fileID: 4987842581282449035}
  m_PrefabAsset: {fileID: 0}
--- !u!4 &9208468644088604813 stripped
Transform:
  m_CorrespondingSourceObject: {fileID: 4247858822796873222, guid: d332d9230e7418340a8055bb5239e165,
    type: 3}
  m_PrefabInstance: {fileID: 4987842581282449035}
  m_PrefabAsset: {fileID: 0}
--- !u!114 &4987842581282449038
MonoBehaviour:
  m_ObjectHideFlags: 0
  m_CorrespondingSourceObject: {fileID: 0}
  m_PrefabInstance: {fileID: 0}
  m_PrefabAsset: {fileID: 0}
  m_GameObject: {fileID: 7570681643344371113}
  m_Enabled: 1
  m_EditorHideFlags: 0
  m_Script: {fileID: 11500000, guid: fd2912613eee9a14eab3862c1f011892, type: 3}
  m_Name: 
  m_EditorClassIdentifier: 
  clicked: {fileID: 8300000, guid: e5fe7496a5f470444bf38def2103322e, type: 3}
  activated: 0
--- !u!1001 &4987842582506974523
PrefabInstance:
  m_ObjectHideFlags: 0
  serializedVersion: 2
  m_Modification:
    m_TransformParent: {fileID: 1981096627656276526}
    m_Modifications:
    - target: {fileID: 3181818087543733026, guid: d332d9230e7418340a8055bb5239e165,
        type: 3}
      propertyPath: m_Name
      value: Button (4)
      objectReference: {fileID: 0}
    - target: {fileID: 4247858822796873222, guid: d332d9230e7418340a8055bb5239e165,
        type: 3}
      propertyPath: m_RootOrder
      value: 1
      objectReference: {fileID: 0}
    - target: {fileID: 4247858822796873222, guid: d332d9230e7418340a8055bb5239e165,
        type: 3}
      propertyPath: m_LocalPosition.x
      value: -0.991
      objectReference: {fileID: 0}
    - target: {fileID: 4247858822796873222, guid: d332d9230e7418340a8055bb5239e165,
        type: 3}
      propertyPath: m_LocalPosition.y
      value: 0.83514977
      objectReference: {fileID: 0}
    - target: {fileID: 4247858822796873222, guid: d332d9230e7418340a8055bb5239e165,
        type: 3}
      propertyPath: m_LocalPosition.z
      value: 2.607
      objectReference: {fileID: 0}
    - target: {fileID: 4247858822796873222, guid: d332d9230e7418340a8055bb5239e165,
        type: 3}
      propertyPath: m_LocalRotation.w
      value: 0
      objectReference: {fileID: 0}
    - target: {fileID: 4247858822796873222, guid: d332d9230e7418340a8055bb5239e165,
        type: 3}
      propertyPath: m_LocalRotation.x
      value: -0
      objectReference: {fileID: 0}
    - target: {fileID: 4247858822796873222, guid: d332d9230e7418340a8055bb5239e165,
        type: 3}
      propertyPath: m_LocalRotation.y
      value: 1
      objectReference: {fileID: 0}
    - target: {fileID: 4247858822796873222, guid: d332d9230e7418340a8055bb5239e165,
        type: 3}
      propertyPath: m_LocalRotation.z
      value: -0
      objectReference: {fileID: 0}
    - target: {fileID: 4247858822796873222, guid: d332d9230e7418340a8055bb5239e165,
        type: 3}
      propertyPath: m_LocalEulerAnglesHint.x
      value: 0
      objectReference: {fileID: 0}
    - target: {fileID: 4247858822796873222, guid: d332d9230e7418340a8055bb5239e165,
        type: 3}
      propertyPath: m_LocalEulerAnglesHint.y
      value: 180
      objectReference: {fileID: 0}
    - target: {fileID: 4247858822796873222, guid: d332d9230e7418340a8055bb5239e165,
        type: 3}
      propertyPath: m_LocalEulerAnglesHint.z
      value: 0
      objectReference: {fileID: 0}
    - target: {fileID: 4398250279716389959, guid: d332d9230e7418340a8055bb5239e165,
        type: 3}
      propertyPath: m_Center.z
      value: -0.03
      objectReference: {fileID: 0}
    - target: {fileID: 8745853725360919475, guid: d332d9230e7418340a8055bb5239e165,
        type: 3}
      propertyPath: m_LocalPosition.z
      value: 0.0065
      objectReference: {fileID: 0}
    m_RemovedComponents:
    - {fileID: 5202819318507689766, guid: d332d9230e7418340a8055bb5239e165, type: 3}
  m_SourcePrefab: {fileID: 100100000, guid: d332d9230e7418340a8055bb5239e165, type: 3}
--- !u!4 &9208468642897077053 stripped
Transform:
  m_CorrespondingSourceObject: {fileID: 4247858822796873222, guid: d332d9230e7418340a8055bb5239e165,
    type: 3}
  m_PrefabInstance: {fileID: 4987842582506974523}
  m_PrefabAsset: {fileID: 0}
--- !u!1 &7570681642118927897 stripped
GameObject:
  m_CorrespondingSourceObject: {fileID: 3181818087543733026, guid: d332d9230e7418340a8055bb5239e165,
    type: 3}
  m_PrefabInstance: {fileID: 4987842582506974523}
  m_PrefabAsset: {fileID: 0}
--- !u!114 &4987842582506974526
MonoBehaviour:
  m_ObjectHideFlags: 0
  m_CorrespondingSourceObject: {fileID: 0}
  m_PrefabInstance: {fileID: 0}
  m_PrefabAsset: {fileID: 0}
  m_GameObject: {fileID: 7570681642118927897}
  m_Enabled: 1
  m_EditorHideFlags: 0
  m_Script: {fileID: 11500000, guid: fd2912613eee9a14eab3862c1f011892, type: 3}
  m_Name: 
  m_EditorClassIdentifier: 
  clicked: {fileID: 8300000, guid: e5fe7496a5f470444bf38def2103322e, type: 3}
  activated: 0
--- !u!1001 &8490213544338728298
PrefabInstance:
  m_ObjectHideFlags: 0
  serializedVersion: 2
  m_Modification:
    m_TransformParent: {fileID: 1110999074326952012}
    m_Modifications:
    - target: {fileID: 3181818087543733026, guid: d332d9230e7418340a8055bb5239e165,
        type: 3}
      propertyPath: m_Name
      value: Button (4)
      objectReference: {fileID: 0}
    - target: {fileID: 4247858822796873222, guid: d332d9230e7418340a8055bb5239e165,
        type: 3}
      propertyPath: m_RootOrder
      value: 1
      objectReference: {fileID: 0}
    - target: {fileID: 4247858822796873222, guid: d332d9230e7418340a8055bb5239e165,
        type: 3}
      propertyPath: m_LocalScale.y
      value: 10
      objectReference: {fileID: 0}
    - target: {fileID: 4247858822796873222, guid: d332d9230e7418340a8055bb5239e165,
        type: 3}
      propertyPath: m_LocalScale.z
      value: 10
      objectReference: {fileID: 0}
    - target: {fileID: 4247858822796873222, guid: d332d9230e7418340a8055bb5239e165,
        type: 3}
      propertyPath: m_LocalPosition.x
      value: 1.209517
      objectReference: {fileID: 0}
    - target: {fileID: 4247858822796873222, guid: d332d9230e7418340a8055bb5239e165,
        type: 3}
      propertyPath: m_LocalPosition.y
      value: 0.8351517
      objectReference: {fileID: 0}
    - target: {fileID: 4247858822796873222, guid: d332d9230e7418340a8055bb5239e165,
        type: 3}
      propertyPath: m_LocalPosition.z
      value: 1.8540001
      objectReference: {fileID: 0}
    - target: {fileID: 4247858822796873222, guid: d332d9230e7418340a8055bb5239e165,
        type: 3}
      propertyPath: m_LocalRotation.w
      value: 1
      objectReference: {fileID: 0}
    - target: {fileID: 4247858822796873222, guid: d332d9230e7418340a8055bb5239e165,
        type: 3}
      propertyPath: m_LocalRotation.x
      value: -0
      objectReference: {fileID: 0}
    - target: {fileID: 4247858822796873222, guid: d332d9230e7418340a8055bb5239e165,
        type: 3}
      propertyPath: m_LocalRotation.y
      value: -0
      objectReference: {fileID: 0}
    - target: {fileID: 4247858822796873222, guid: d332d9230e7418340a8055bb5239e165,
        type: 3}
      propertyPath: m_LocalRotation.z
      value: -0
      objectReference: {fileID: 0}
    - target: {fileID: 4247858822796873222, guid: d332d9230e7418340a8055bb5239e165,
        type: 3}
      propertyPath: m_LocalEulerAnglesHint.x
      value: 0
      objectReference: {fileID: 0}
    - target: {fileID: 4247858822796873222, guid: d332d9230e7418340a8055bb5239e165,
        type: 3}
      propertyPath: m_LocalEulerAnglesHint.y
      value: 0
      objectReference: {fileID: 0}
    - target: {fileID: 4247858822796873222, guid: d332d9230e7418340a8055bb5239e165,
        type: 3}
      propertyPath: m_LocalEulerAnglesHint.z
      value: 0
      objectReference: {fileID: 0}
    - target: {fileID: 4398250279716389959, guid: d332d9230e7418340a8055bb5239e165,
        type: 3}
      propertyPath: m_Center.z
      value: -0.03
      objectReference: {fileID: 0}
    m_RemovedComponents:
    - {fileID: 5202819318507689766, guid: d332d9230e7418340a8055bb5239e165, type: 3}
  m_SourcePrefab: {fileID: 100100000, guid: d332d9230e7418340a8055bb5239e165, type: 3}
--- !u!1 &6483875650274975304 stripped
GameObject:
  m_CorrespondingSourceObject: {fileID: 3181818087543733026, guid: d332d9230e7418340a8055bb5239e165,
    type: 3}
  m_PrefabInstance: {fileID: 8490213544338728298}
  m_PrefabAsset: {fileID: 0}
--- !u!4 &5701593599323679596 stripped
Transform:
  m_CorrespondingSourceObject: {fileID: 4247858822796873222, guid: d332d9230e7418340a8055bb5239e165,
    type: 3}
  m_PrefabInstance: {fileID: 8490213544338728298}
  m_PrefabAsset: {fileID: 0}
--- !u!114 &5219222610944796223
MonoBehaviour:
  m_ObjectHideFlags: 0
  m_CorrespondingSourceObject: {fileID: 0}
  m_PrefabInstance: {fileID: 0}
  m_PrefabAsset: {fileID: 0}
  m_GameObject: {fileID: 6483875650274975304}
  m_Enabled: 1
  m_EditorHideFlags: 0
  m_Script: {fileID: 11500000, guid: fd2912613eee9a14eab3862c1f011892, type: 3}
  m_Name: 
  m_EditorClassIdentifier: 
  clicked: {fileID: 8300000, guid: e5fe7496a5f470444bf38def2103322e, type: 3}
  activated: 0
