%YAML 1.1
%TAG !u! tag:unity3d.com,2011:
--- !u!114 &11400000
MonoBehaviour:
  m_ObjectHideFlags: 0
  m_CorrespondingSourceObject: {fileID: 0}
  m_PrefabInstance: {fileID: 0}
  m_PrefabAsset: {fileID: 0}
  m_GameObject: {fileID: 0}
  m_Enabled: 1
  m_EditorHideFlags: 0
  m_Script: {fileID: 11500000, guid: c60f9225f8652da499c4b4b6bf76c929, type: 3}
  m_Name: Flashlight
  m_EditorClassIdentifier: 
  colCenter: {x: -0.0002312791, y: 0.1031627, z: 0}
  colSize: {x: 0.04990532, y: 0.2121449, z: 0.04914726}
  mass: 1
  itemName: flashlight
  icon: {fileID: 21300000, guid: 64a917ca8afca764484c9d1574523a4c, type: 3}
  deleteUse: 0
  hasEffect: 0
  isFem: 1
  isUnique: 1
  keepInv: 0
  Effects: []
  ItemModel: {fileID: 1275266641364890, guid: e3109ccf9db0f54408d5c02b496761c1, type: 3}
  valueFloat: 100
  valueInt: 0
  SFX: 1
  useTime: 0
  Overlay: {fileID: 0}
  protectGas: 0
  protectCogn: 0
  autoEquip: 0
  preventDequip: 1
  part: 2
  SpendBattery: 1
  ReceiveBattery: 1
  SpendFactor: 1
  assetName: Flashlight
