<?xml version="1.0" encoding="UTF-8" standalone="no"?>
<svg
   xmlns:dc="http://purl.org/dc/elements/1.1/"
   xmlns:cc="http://creativecommons.org/ns#"
   xmlns:rdf="http://www.w3.org/1999/02/22-rdf-syntax-ns#"
   xmlns:svg="http://www.w3.org/2000/svg"
   xmlns="http://www.w3.org/2000/svg"
   xmlns:sodipodi="http://sodipodi.sourceforge.net/DTD/sodipodi-0.dtd"
   xmlns:inkscape="http://www.inkscape.org/namespaces/inkscape"
   width="134.31587mm"
   height="22.128691mm"
   viewBox="0 0 134.31587 22.128691"
   version="1.1"
   id="svg989"
   inkscape:version="1.0.2 (e86c870879, 2021-01-15)"
   sodipodi:docname="caw_logo_exported.svg">
  <defs
     id="defs983">
    <clipPath
       clipPathUnits="userSpaceOnUse"
       id="clipPath907">
      <path
         d="M 100,937.273 H 480.738 V 1000 H 100 Z"
         id="path905" />
    </clipPath>
  </defs>
  <sodipodi:namedview
     id="base"
     pagecolor="#ffffff"
     bordercolor="#666666"
     borderopacity="1.0"
     inkscape:pageopacity="0.0"
     inkscape:pageshadow="2"
     inkscape:zoom="0.35"
     inkscape:cx="248.11098"
     inkscape:cy="116.10371"
     inkscape:document-units="mm"
     inkscape:current-layer="layer1"
     inkscape:document-rotation="0"
     showgrid="false"
     inkscape:pagecheckerboard="true"
     inkscape:window-width="843"
     inkscape:window-height="508"
     inkscape:window-x="499"
     inkscape:window-y="4"
     inkscape:window-maximized="0" />
  <metadata
     id="metadata986">
    <rdf:RDF>
      <cc:Work
         rdf:about="">
        <dc:format>image/svg+xml</dc:format>
        <dc:type
           rdf:resource="http://purl.org/dc/dcmitype/StillImage" />
        <dc:title></dc:title>
      </cc:Work>
    </rdf:RDF>
  </metadata>
  <g
     inkscape:label="Layer 1"
     inkscape:groupmode="layer"
     id="layer1"
     transform="translate(-40.187304,-117.44756)">
    <g
       id="g901"
       transform="matrix(0.35277777,0,0,-0.35277777,4.9095274,470.22533)">
      <g
         id="g903"
         clip-path="url(#clipPath907)">
        <g
           id="g909"
           transform="translate(180.356,943.4806)">
          <path
             d="m 0,0 c -6.532,0 -12.685,4.75 -12.685,13.711 0,9.284 6.315,13.873 12.631,13.873 6.424,0 9.987,-3.725 11.12,-8.367 l 6.1,2.051 c -1.728,6.694 -7.503,12.415 -17.22,12.415 -9.932,0 -19.271,-7.502 -19.271,-19.972 0,-12.47 9.015,-19.919 19.325,-19.919 9.77,0 15.6,6.208 17.328,12.686 L 11.39,8.421 C 10.094,4.102 6.424,0 0,0"
             style="fill:#ffffff;fill-opacity:1;fill-rule:nonzero;stroke:none"
             id="path911" />
        </g>
        <g
           id="g913"
           transform="translate(211.8265,953.6828)">
          <path
             d="M 0,0 5.83,15.655 11.66,0 Z M 2.213,22.672 -12.685,-15.6 h 6.855 l 3.563,9.608 h 16.194 l 3.617,-9.608 h 7.071 L 9.716,22.672 Z"
             style="fill:#ffffff;fill-opacity:1;fill-rule:nonzero;stroke:none"
             id="path915" />
        </g>
        <g
           id="g917"
           transform="translate(273.0403,948.1766)">
          <path
             d="m 0,0 -9.123,28.178 h -6.747 l -8.961,-27.962 -7.665,27.962 h -6.802 l 10.85,-38.272 h 6.64 l 9.284,28.933 9.285,-28.933 H 3.455 L 14.197,28.178 H 7.503 Z"
             style="fill:#ffffff;fill-opacity:1;fill-rule:nonzero;stroke:none"
             id="path919" />
        </g>
        <g
           id="g921"
           transform="translate(289.9893,970.2546)">
          <path
             d="m 0,0 h 12.416 v -32.172 h 6.477 V 0 h 12.47 V 6.1 H 0 Z"
             style="fill:#ffffff;fill-opacity:1;fill-rule:nonzero;stroke:none"
             id="path923" />
        </g>
        <g
           id="g925"
           transform="translate(351.3652,960.5383)">
          <path
             d="m 0,0 h -17.976 v 15.816 h -6.477 v -38.272 h 6.477 V -6.1 H 0 V -22.456 H 6.532 V 15.816 H 0 Z"
             style="fill:#ffffff;fill-opacity:1;fill-rule:nonzero;stroke:none"
             id="path927" />
        </g>
        <g
           id="g929"
           transform="translate(373.8741,958.9189)">
          <path
             d="m 0,0 v 11.714 h 10.94 c 3.995,0 6.586,-2.321 6.586,-5.884 C 17.526,2.321 14.935,0 10.94,0 Z m 24.112,5.83 c 0,6.477 -4.589,11.605 -11.984,11.605 H -6.532 V -20.836 H 0 v 15.114 h 8.727 l 9.924,-15.114 h 7.341 L 15.475,-5.074 c 5.344,1.295 8.637,5.451 8.637,10.904"
             style="fill:#ffffff;fill-opacity:1;fill-rule:nonzero;stroke:none"
             id="path931" />
        </g>
        <g
           id="g933"
           transform="translate(422.0077,943.4266)">
          <path
             d="m 0,0 c -6.424,0 -12.794,4.588 -12.794,13.819 0,9.231 6.37,13.819 12.794,13.819 6.478,0 12.847,-4.588 12.847,-13.819 C 12.847,4.588 6.478,0 0,0 m 0,33.737 c -10.04,0 -19.433,-7.395 -19.433,-19.918 0,-12.578 9.393,-19.973 19.433,-19.973 10.04,0 19.487,7.395 19.487,19.973 0,12.523 -9.447,19.918 -19.487,19.918"
             style="fill:#ffffff;fill-opacity:1;fill-rule:nonzero;stroke:none"
             id="path935" />
        </g>
        <g
           id="g937"
           transform="translate(474.2599,976.3544)">
          <path
             d="M 0,0 V -27.152 L -17.382,0 h -8.259 v -38.272 h 6.478 V -9.285 L -0.27,-38.272 H 6.478 V 0 Z"
             style="fill:#ffffff;fill-opacity:1;fill-rule:nonzero;stroke:none"
             id="path939" />
        </g>
        <g
           id="g941"
           transform="translate(100.0001,963.629)">
          <path
             d="M 0,0 V -25.547 H 32.03 C 15.23,-22.475 2.412,-12.771 0,0"
             style="fill:#ffffff;fill-opacity:1;fill-rule:nonzero;stroke:none"
             id="path943" />
        </g>
        <g
           id="g945"
           transform="translate(133.2248,989.2364)">
          <path
             d="m 0,0 c 0.428,0 0.855,-0.009 1.283,-0.023 v -12.488 c -1.785,0.288 -3.616,0.437 -5.48,0.437 -16.015,0 -24.78,-10.675 -25.328,-11.187 C -29.525,-10.248 -16.169,0 0,0 m -33.225,-18.878 c 5.675,-10.377 20.886,-16.828 37.938,-15.085 2.83,0.287 5.563,0.785 8.17,1.468 v 43.259 h -46.108 z"
             style="fill:#ffffff;fill-opacity:1;fill-rule:nonzero;stroke:none"
             id="path947" />
        </g>
      </g>
    </g>
  </g>
</svg>
