{
	"LANGUAGE": "Idioma",
	"LANGUAGE_NAME": "Español",
	"LOCAL": "Local",
	"LOBBY": "Sala de espera",
	"MAIN_MENU": "Menú principal",
	"ONLINE": "En línea",
	"OPTIONS": "Opciones",
	"PLAY_AGAIN": "Reproducir de nuevo",
	"TIME_REMAINING": "Tiempo restante",
	"QUIT": "Salir"
}