{
    "accessors" : [
        {
            "bufferView" : 0, 
            "componentType" : 5123, 
            "count" : 2616, 
            "max" : [
                1251
            ], 
            "min" : [
                0
            ], 
            "type" : "SCALAR"
        }, 
        {
            "bufferView" : 1, 
            "componentType" : 5126, 
            "count" : 1252, 
            "max" : [
                0.36947163939476013, 
                1.0323872566223145, 
                0.3694717288017273
            ], 
            "min" : [
                -0.36947184801101685, 
                -1.193967591461842e-07, 
                -0.3694717586040497
            ], 
            "type" : "VEC3"
        }, 
        {
            "bufferView" : 2, 
            "componentType" : 5126, 
            "count" : 1252, 
            "max" : [
                1.0, 
                1.0, 
                1.0
            ], 
            "min" : [
                -1.0, 
                -1.0, 
                -1.0
            ], 
            "type" : "VEC3"
        }, 
        {
            "bufferView" : 3, 
            "componentType" : 5126, 
            "count" : 1252, 
            "max" : [
                0.9907145500183105, 
                0.9907337483018637
            ], 
            "min" : [
                0.009285461157560349, 
                0.009266197681427002
            ], 
            "type" : "VEC2"
        }
    ], 
    "asset" : {
        "generator" : "Khronos Blender glTF 2.0 exporter", 
        "version" : "2.0"
    }, 
    "bufferViews" : [
        {
            "buffer" : 0, 
            "byteLength" : 5232, 
            "byteOffset" : 0, 
            "target" : 34963
        }, 
        {
            "buffer" : 0, 
            "byteLength" : 15024, 
            "byteOffset" : 5232, 
            "target" : 34962
        }, 
        {
            "buffer" : 0, 
            "byteLength" : 15024, 
            "byteOffset" : 20256, 
            "target" : 34962
        }, 
        {
            "buffer" : 0, 
            "byteLength" : 10016, 
            "byteOffset" : 35280, 
            "target" : 34962
        }
    ], 
    "buffers" : [
        {
            "byteLength" : 45296, 
            "uri" : "Barrel_Model.bin"
        }
    ], 
    "materials" : [
        {
            "name" : "Mat_Barrel", 
            "pbrMetallicRoughness" : {
                "baseColorFactor" : [
                    0.4222731292247772, 
                    0.3348046541213989, 
                    0.0, 
                    1.0
                ], 
                "roughnessFactor" : 0.9133988618850708
            }
        }
    ], 
    "meshes" : [
        {
            "name" : "Cube", 
            "primitives" : [
                {
                    "attributes" : {
                        "NORMAL" : 2, 
                        "POSITION" : 1, 
                        "TEXCOORD_0" : 3
                    }, 
                    "indices" : 0, 
                    "material" : 0
                }
            ]
        }
    ], 
    "nodes" : [
        {
            "mesh" : 0, 
            "name" : "Barrel", 
            "translation" : [
                0.8443527817726135, 
                -1.478805415899842e-07, 
                0.11116160452365875
            ]
        }
    ], 
    "scene" : 0, 
    "scenes" : [
        {
            "name" : "Scene", 
            "nodes" : [
                0
            ]
        }
    ]
}
