{
    "accessors" : [
        {
            "bufferView" : 0, 
            "componentType" : 5121, 
            "count" : 996, 
            "max" : [
                215
            ], 
            "min" : [
                0
            ], 
            "type" : "SCALAR"
        }, 
        {
            "bufferView" : 1, 
            "componentType" : 5126, 
            "count" : 216, 
            "max" : [
                0.8906193971633911, 
                2.720258951187134, 
                1.0147433280944824
            ], 
            "min" : [
                -0.8906199932098389, 
                0.9925405979156494, 
                -1.014742374420166
            ], 
            "type" : "VEC3"
        }, 
        {
            "bufferView" : 2, 
            "componentType" : 5126, 
            "count" : 216, 
            "max" : [
                0.9838557243347168, 
                1.0, 
                0.9744865298271179
            ], 
            "min" : [
                -0.9838557243347168, 
                -1.0, 
                -0.9744865298271179
            ], 
            "type" : "VEC3"
        }, 
        {
            "bufferView" : 3, 
            "componentType" : 5123, 
            "count" : 4200, 
            "max" : [
                1361
            ], 
            "min" : [
                0
            ], 
            "type" : "SCALAR"
        }, 
        {
            "bufferView" : 4, 
            "componentType" : 5126, 
            "count" : 1362, 
            "max" : [
                1.8848189115524292, 
                1.6118113994598389, 
                2.1108782291412354
            ], 
            "min" : [
                -1.8848187923431396, 
                0.15062367916107178, 
                -2.1108763217926025
            ], 
            "type" : "VEC3"
        }, 
        {
            "bufferView" : 5, 
            "componentType" : 5126, 
            "count" : 1362, 
            "max" : [
                1.0, 
                1.0, 
                0.9918820858001709
            ], 
            "min" : [
                -1.0, 
                -1.0, 
                -0.9918820858001709
            ], 
            "type" : "VEC3"
        }, 
        {
            "bufferView" : 6, 
            "componentType" : 5121, 
            "count" : 360, 
            "max" : [
                73
            ], 
            "min" : [
                0
            ], 
            "type" : "SCALAR"
        }, 
        {
            "bufferView" : 7, 
            "componentType" : 5126, 
            "count" : 74, 
            "max" : [
                1.0532515048980713, 
                1.2038755416870117, 
                1.0532526969909668
            ], 
            "min" : [
                -1.05325186252594, 
                -0.8396140336990356, 
                -1.0532506704330444
            ], 
            "type" : "VEC3"
        }, 
        {
            "bufferView" : 8, 
            "componentType" : 5126, 
            "count" : 74, 
            "max" : [
                1.0, 
                1.0, 
                1.0
            ], 
            "min" : [
                -1.0, 
                -1.0, 
                -1.0
            ], 
            "type" : "VEC3"
        }
    ], 
    "asset" : {
        "generator" : "Khronos Blender glTF 2.0 exporter", 
        "version" : "2.0"
    }, 
    "bufferViews" : [
        {
            "buffer" : 0, 
            "byteLength" : 996, 
            "byteOffset" : 0, 
            "target" : 34963
        }, 
        {
            "buffer" : 0, 
            "byteLength" : 2592, 
            "byteOffset" : 996, 
            "target" : 34962
        }, 
        {
            "buffer" : 0, 
            "byteLength" : 2592, 
            "byteOffset" : 3588, 
            "target" : 34962
        }, 
        {
            "buffer" : 0, 
            "byteLength" : 8400, 
            "byteOffset" : 6180, 
            "target" : 34963
        }, 
        {
            "buffer" : 0, 
            "byteLength" : 16344, 
            "byteOffset" : 14580, 
            "target" : 34962
        }, 
        {
            "buffer" : 0, 
            "byteLength" : 16344, 
            "byteOffset" : 30924, 
            "target" : 34962
        }, 
        {
            "buffer" : 0, 
            "byteLength" : 360, 
            "byteOffset" : 47268, 
            "target" : 34963
        }, 
        {
            "buffer" : 0, 
            "byteLength" : 888, 
            "byteOffset" : 47628, 
            "target" : 34962
        }, 
        {
            "buffer" : 0, 
            "byteLength" : 888, 
            "byteOffset" : 48516, 
            "target" : 34962
        }
    ], 
    "buffers" : [
        {
            "byteLength" : 49404, 
            "uri" : "saucer_hex.bin"
        }
    ], 
    "materials" : [
        {
            "name" : "Mat_UFO_Bottom", 
            "pbrMetallicRoughness" : {
                "baseColorFactor" : [
                    0.026668652892112732, 
                    0.026668652892112732, 
                    0.026668652892112732, 
                    1.0
                ], 
                "metallicFactor" : 0.0
            }
        }, 
        {
            "name" : "Mat_UFO_Middle.001", 
            "pbrMetallicRoughness" : {
                "baseColorFactor" : [
                    0.0, 
                    0.041234370321035385, 
                    0.5149175524711609, 
                    1.0
                ], 
                "metallicFactor" : 0.0
            }
        }, 
        {
            "name" : "Mat_UFO_Top.001", 
            "pbrMetallicRoughness" : {
                "baseColorFactor" : [
                    0.02624814212322235, 
                    0.50071781873703, 
                    0.027992429211735725, 
                    1.0
                ], 
                "metallicFactor" : 0.0
            }
        }
    ], 
    "meshes" : [
        {
            "name" : "Sphere.010", 
            "primitives" : [
                {
                    "attributes" : {
                        "NORMAL" : 2, 
                        "POSITION" : 1
                    }, 
                    "indices" : 0, 
                    "material" : 2
                }, 
                {
                    "attributes" : {
                        "NORMAL" : 5, 
                        "POSITION" : 4
                    }, 
                    "indices" : 3, 
                    "material" : 1
                }, 
                {
                    "attributes" : {
                        "NORMAL" : 8, 
                        "POSITION" : 7
                    }, 
                    "indices" : 6, 
                    "material" : 0
                }
            ]
        }
    ], 
    "nodes" : [
        {
            "mesh" : 0, 
            "name" : "clay_UFO_Blue", 
            "scale" : [
                2.0, 
                2.0, 
                2.0
            ]
        }
    ], 
    "scene" : 0, 
    "scenes" : [
        {
            "name" : "Scene", 
            "nodes" : [
                0
            ]
        }
    ]
}
