# Blender v2.74 (sub 0) OBJ File: ''
# www.blender.org
mtllib car 3 wheel.mtl
o Cylinder
v 0.028036 0.278460 0.160769
v 0.225965 0.278460 0.160769
v 0.225965 0.278460 -0.160769
v 0.028036 0.278460 -0.160769
v 0.028036 -0.278460 -0.160769
v 0.225965 -0.278460 -0.160769
v 0.225965 -0.278460 0.160769
v 0.028036 -0.278460 0.160769
v 0.225965 0.000000 0.321538
v 0.028036 0.000000 0.321538
v 0.028036 0.000000 -0.321538
v 0.225965 0.000000 -0.321538
v 0.254250 0.000000 -0.288877
v 0.254250 0.250174 -0.144438
v 0.254250 0.250174 0.144438
v 0.254250 0.000000 0.288877
v 0.254250 -0.250174 0.144438
v 0.254250 -0.250175 -0.144438
v 0.019126 0.000000 -0.299164
v 0.019126 0.259084 -0.149582
v -0.000250 0.000000 -0.288877
v -0.000250 0.250174 -0.144438
v 0.234874 0.259084 -0.149582
v 0.234874 0.000000 -0.299164
v 0.019126 -0.259084 -0.149582
v -0.000250 -0.250175 -0.144438
v 0.234874 -0.259084 -0.149582
v 0.019126 -0.259084 0.149582
v -0.000250 -0.250174 0.144438
v 0.234874 -0.259084 0.149582
v 0.019126 0.000000 0.299164
v -0.000250 0.000000 0.288877
v 0.234874 0.000000 0.299164
v 0.019126 0.259084 0.149582
v -0.000250 0.250174 0.144438
v 0.234874 0.259084 0.149582
vn -0.490900 0.754500 0.435600
vn 0.490900 0.754500 0.435600
vn 0.490900 0.754500 -0.435600
vn -0.490900 0.754500 -0.435600
vn -0.490900 -0.754500 -0.435600
vn 0.490900 -0.754500 -0.435600
vn 0.490900 -0.754500 0.435600
vn -0.490900 -0.754500 0.435600
vn 0.490900 0.000000 0.871200
vn -0.490900 -0.000000 0.871200
vn -0.490900 0.000000 -0.871200
vn 0.490900 0.000000 -0.871200
vn 0.785000 -0.000000 -0.619500
vn 0.785000 0.536500 -0.309700
vn 0.785000 0.536500 0.309700
vn 0.785000 -0.000000 0.619500
vn 0.785000 -0.536500 0.309700
vn 0.785000 -0.536500 -0.309700
vn -0.803900 -0.000000 -0.594700
vn -0.803900 0.515100 -0.297400
vn -0.785000 -0.000000 -0.619500
vn -0.785000 0.536500 -0.309700
vn 0.803900 0.515000 -0.297400
vn 0.803900 -0.000000 -0.594700
vn -0.803900 -0.515100 -0.297400
vn -0.785000 -0.536500 -0.309700
vn 0.803900 -0.515000 -0.297400
vn -0.803900 -0.515100 0.297400
vn -0.785000 -0.536500 0.309700
vn 0.803900 -0.515000 0.297400
vn -0.803900 -0.000000 0.594700
vn -0.785000 -0.000000 0.619500
vn 0.803900 0.000000 0.594700
vn -0.803900 0.515100 0.297400
vn -0.785000 0.536500 0.309700
vn 0.803900 0.515000 0.297400
usemtl None
s 1
f 1//1 2//2 3//3 4//4
f 5//5 6//6 7//7 8//8
f 8//8 7//7 9//9 10//10
f 10//10 9//9 2//2 1//1
f 11//11 12//12 6//6 5//5
f 13//13 14//14 15//15 16//16 17//17 18//18
f 4//4 3//3 12//12 11//11
f 4//4 11//11 19//19 20//20
f 20//20 19//19 21//21 22//22
f 12//12 3//3 23//23 24//24
f 24//24 23//23 14//14 13//13
f 11//11 5//5 25//25 19//19
f 19//19 25//25 26//26 21//21
f 6//6 12//12 24//24 27//27
f 27//27 24//24 13//13 18//18
f 5//5 8//8 28//28 25//25
f 25//25 28//28 29//29 26//26
f 7//7 6//6 27//27 30//30
f 30//30 27//27 18//18 17//17
f 8//8 10//10 31//31 28//28
f 28//28 31//31 32//32 29//29
f 9//9 7//7 30//30 33//33
f 33//33 30//30 17//17 16//16
f 10//10 1//1 34//34 31//31
f 31//31 34//34 35//35 32//32
f 2//2 9//9 33//33 36//36
f 36//36 33//33 16//16 15//15
f 1//1 4//4 20//20 34//34
f 34//34 20//20 22//22 35//35
f 3//3 2//2 36//36 23//23
f 23//23 36//36 15//15 14//14
f 22//22 21//21 26//26 29//29 32//32 35//35
