{
	"image": "energy.png",
	"textureMask": [ 1, 1, 1, 1 ],

	"emitCount": -1,
	"emitRate": 100,
	"maxParticles": 1000,
	"targetStopDuration": 0,
	"updateSpeed": 0.016,

	"gravity": [ 0, -9.81, 0 ],

	"color1": [ 0.5, 1, 0.4, 1 ],
	"color2": [ 1, 1, 1, 1 ],
	"colorDead": [ 1, 1, 1, 0 ],

	"direction1": [ -0.1, -0.1, -0.1 ],
	"direction2": [ 0.05, -0.2, 0.05 ],

	"minAngularSpeed": 0,
	"maxAngularSpeed": 0,

	"maxEmitBox": [ 0.5, 0.5, 0.5],
	"minEmitBox": [ -0.5, -0.5, -0.5],

	"minEmitPower": 200,
	"maxEmitPower": 200,

	"minLifeTime": 0.5,
	"maxLifeTime": 1,

	"minSize": 0.05,
	"maxSize": 0.2,

	"textureAnimates": false,
	"startSpriteCellID": 0,
	"endSpriteCellID": 0,
	"spriteCellHeight": 0,
	"spriteCellWidth": 0,
	"spriteCellLoop": true,
	"spriteCellChangeSpeed": 0
}