[
    {
        "time": 1653696000,
        "mau": "1",
        "bch": "0.025000",
        "fiat": "4.48"
    },
    {
        "time": 1653782400,
        "mau": "1",
        "bch": "0.025000",
        "fiat": "4.64"
    },
    {
        "time": 1653868800,
        "mau": "1",
        "bch": "0.025000",
        "fiat": "4.90"
    },
    {
        "time": 1653955200,
        "mau": "1",
        "bch": "0.025000",
        "fiat": "5.09"
    },
    {
        "time": 1654041600,
        "mau": "1",
        "bch": "0.025000",
        "fiat": "4.66"
    },
    {
        "time": 1654128000,
        "mau": "1",
        "bch": "0.025000",
        "fiat": "4.71"
    },
    {
        "time": 1654214400,
        "mau": "1",
        "bch": "0.025000",
        "fiat": "4.58"
    },
    {
        "time": 1654300800,
        "mau": "1",
        "bch": "0.025000",
        "fiat": "4.72"
    },
    {
        "time": 1654387200,
        "mau": "1",
        "bch": "0.025000",
        "fiat": "4.50"
    },
    {
        "time": 1654473600,
        "mau": "1",
        "bch": "0.025000",
        "fiat": "4.65"
    },
    {
        "time": 1654560000,
        "mau": "1",
        "bch": "0.025000",
        "fiat": "4.58"
    },
    {
        "time": 1654646400,
        "mau": "1",
        "bch": "0.025000",
        "fiat": "4.43"
    },
    {
        "time": 1654732800,
        "mau": "1",
        "bch": "0.025000",
        "fiat": "4.39"
    },
    {
        "time": 1654819200,
        "mau": "1",
        "bch": "0.025000",
        "fiat": "4.20"
    },
    {
        "time": 1654905600,
        "mau": "1",
        "bch": "0.025000",
        "fiat": "3.91"
    },
    {
        "time": 1654992000,
        "mau": "1",
        "bch": "0.025000",
        "fiat": "3.69"
    },
    {
        "time": 1655078400,
        "mau": "2",
        "bch": "0.083290",
        "fiat": "10.51"
    },
    {
        "time": 1655164800,
        "mau": "2",
        "bch": "0.083290",
        "fiat": "10.56"
    },
    {
        "time": 1655251200,
        "mau": "2",
        "bch": "0.083290",
        "fiat": "10.60"
    },
    {
        "time": 1655337600,
        "mau": "2",
        "bch": "0.083290",
        "fiat": "9.12"
    },
    {
        "time": 1655424000,
        "mau": "2",
        "bch": "0.083290",
        "fiat": "10.11"
    },
    {
        "time": 1655510400,
        "mau": "2",
        "bch": "0.083290",
        "fiat": "9.73"
    },
    {
        "time": 1655596800,
        "mau": "2",
        "bch": "0.083290",
        "fiat": "10.01"
    },
    {
        "time": 1655683200,
        "mau": "2",
        "bch": "0.083290",
        "fiat": "9.93"
    },
    {
        "time": 1655769600,
        "mau": "2",
        "bch": "0.083290",
        "fiat": "9.90"
    },
    {
        "time": 1655856000,
        "mau": "2",
        "bch": "0.083290",
        "fiat": "9.42"
    },
    {
        "time": 1655942400,
        "mau": "2",
        "bch": "0.083290",
        "fiat": "9.65"
    },
    {
        "time": 1656028800,
        "mau": "2",
        "bch": "0.083290",
        "fiat": "9.59"
    },
    {
        "time": 1656115200,
        "mau": "2",
        "bch": "0.083290",
        "fiat": "9.63"
    },
    {
        "time": 1656201600,
        "mau": "2",
        "bch": "0.583286",
        "fiat": "66.22"
    },
    {
        "time": 1656288000,
        "mau": "2",
        "bch": "0.583286",
        "fiat": "64.94"
    },
    {
        "time": 1656374400,
        "mau": "2",
        "bch": "0.583286",
        "fiat": "60.13"
    },
    {
        "time": 1656460800,
        "mau": "2",
        "bch": "0.583286",
        "fiat": "60.96"
    },
    {
        "time": 1656547200,
        "mau": "2",
        "bch": "0.583286",
        "fiat": "59.60"
    },
    {
        "time": 1656633600,
        "mau": "2",
        "bch": "0.583286",
        "fiat": "59.48"
    },
    {
        "time": 1656720000,
        "mau": "2",
        "bch": "0.583286",
        "fiat": "62.36"
    },
    {
        "time": 1656806400,
        "mau": "2",
        "bch": "0.583286",
        "fiat": "61.68"
    },
    {
        "time": 1656892800,
        "mau": "2",
        "bch": "0.583286",
        "fiat": "63.01"
    },
    {
        "time": 1656979200,
        "mau": "2",
        "bch": "0.583286",
        "fiat": "60.97"
    },
    {
        "time": 1657065600,
        "mau": "2",
        "bch": "0.583286",
        "fiat": "62.07"
    },
    {
        "time": 1657152000,
        "mau": "2",
        "bch": "0.583286",
        "fiat": "65.26"
    },
    {
        "time": 1657238400,
        "mau": "2",
        "bch": "0.583286",
        "fiat": "64.03"
    },
    {
        "time": 1657324800,
        "mau": "2",
        "bch": "0.583286",
        "fiat": "64.98"
    },
    {
        "time": 1657411200,
        "mau": "2",
        "bch": "0.583286",
        "fiat": "62.55"
    },
    {
        "time": 1657497600,
        "mau": "2",
        "bch": "0.583286",
        "fiat": "58.04"
    },
    {
        "time": 1657584000,
        "mau": "2",
        "bch": "0.583058",
        "fiat": "57.13"
    },
    {
        "time": 1657670400,
        "mau": "2",
        "bch": "0.583058",
        "fiat": "59.67"
    },
    {
        "time": 1657756800,
        "mau": "2",
        "bch": "0.583058",
        "fiat": "60.23"
    },
    {
        "time": 1657843200,
        "mau": "2",
        "bch": "0.583058",
        "fiat": "62.00"
    },
    {
        "time": 1657929600,
        "mau": "2",
        "bch": "0.583058",
        "fiat": "63.97"
    },
    {
        "time": 1658016000,
        "mau": "2",
        "bch": "0.583058",
        "fiat": "64.44"
    },
    {
        "time": 1658102400,
        "mau": "2",
        "bch": "0.583058",
        "fiat": "70.95"
    },
    {
        "time": 1658188800,
        "mau": "2",
        "bch": "0.583058",
        "fiat": "74.85"
    },
    {
        "time": 1658275200,
        "mau": "2",
        "bch": "1.137471",
        "fiat": "138.99"
    },
    {
        "time": 1658361600,
        "mau": "2",
        "bch": "1.137471",
        "fiat": "140.45"
    },
    {
        "time": 1658448000,
        "mau": "2",
        "bch": "1.137471",
        "fiat": "140.14"
    },
    {
        "time": 1658534400,
        "mau": "2",
        "bch": "1.137471",
        "fiat": "140.00"
    },
    {
        "time": 1658620800,
        "mau": "2",
        "bch": "1.137471",
        "fiat": "150.61"
    },
    {
        "time": 1658707200,
        "mau": "2",
        "bch": "1.137471",
        "fiat": "134.95"
    },
    {
        "time": 1658793600,
        "mau": "2",
        "bch": "1.137471",
        "fiat": "134.96"
    },
    {
        "time": 1658880000,
        "mau": "2",
        "bch": "1.137471",
        "fiat": "144.81"
    },
    {
        "time": 1658966400,
        "mau": "2",
        "bch": "1.137471",
        "fiat": "176.10"
    },
    {
        "time": 1659052800,
        "mau": "2",
        "bch": "1.137471",
        "fiat": "174.34"
    },
    {
        "time": 1659139200,
        "mau": "2",
        "bch": "1.137471",
        "fiat": "164.56"
    },
    {
        "time": 1659225600,
        "mau": "2",
        "bch": "1.137471",
        "fiat": "159.03"
    },
    {
        "time": 1659312000,
        "mau": "2",
        "bch": "1.137471",
        "fiat": "157.42"
    },
    {
        "time": 1659398400,
        "mau": "2",
        "bch": "1.137471",
        "fiat": "153.15"
    },
    {
        "time": 1659484800,
        "mau": "2",
        "bch": "1.137471",
        "fiat": "152.41"
    },
    {
        "time": 1659571200,
        "mau": "2",
        "bch": "1.137471",
        "fiat": "153.30"
    },
    {
        "time": 1659657600,
        "mau": "2",
        "bch": "1.137471",
        "fiat": "160.13"
    },
    {
        "time": 1659744000,
        "mau": "2",
        "bch": "1.137471",
        "fiat": "161.03"
    },
    {
        "time": 1659830400,
        "mau": "2",
        "bch": "1.137471",
        "fiat": "160.85"
    },
    {
        "time": 1659916800,
        "mau": "2",
        "bch": "1.137471",
        "fiat": "162.98"
    },
    {
        "time": 1660003200,
        "mau": "2",
        "bch": "1.137244",
        "fiat": "153.72"
    },
    {
        "time": 1660089600,
        "mau": "2",
        "bch": "1.137244",
        "fiat": "161.74"
    },
    {
        "time": 1660176000,
        "mau": "2",
        "bch": "1.137244",
        "fiat": "162.55"
    },
    {
        "time": 1660262400,
        "mau": "2",
        "bch": "1.137244",
        "fiat": "162.91"
    },
    {
        "time": 1660348800,
        "mau": "2",
        "bch": "1.137244",
        "fiat": "164.18"
    },
    {
        "time": 1660435200,
        "mau": "2",
        "bch": "1.137244",
        "fiat": "158.72"
    },
    {
        "time": 1660521600,
        "mau": "2",
        "bch": "1.137244",
        "fiat": "156.62"
    },
    {
        "time": 1660608000,
        "mau": "2",
        "bch": "1.137244",
        "fiat": "155.32"
    },
    {
        "time": 1660694400,
        "mau": "2",
        "bch": "1.137244",
        "fiat": "152.28"
    },
    {
        "time": 1660780800,
        "mau": "2",
        "bch": "1.137244",
        "fiat": "146.38"
    },
    {
        "time": 1660867200,
        "mau": "2",
        "bch": "1.137244",
        "fiat": "130.52"
    },
    {
        "time": 1660953600,
        "mau": "2",
        "bch": "1.137244",
        "fiat": "130.35"
    },
    {
        "time": 1661040000,
        "mau": "2",
        "bch": "1.137244",
        "fiat": "136.19"
    },
    {
        "time": 1661126400,
        "mau": "2",
        "bch": "1.137244",
        "fiat": "139.60"
    },
    {
        "time": 1661212800,
        "mau": "2",
        "bch": "1.137244",
        "fiat": "151.84"
    },
    {
        "time": 1661299200,
        "mau": "2",
        "bch": "1.137244",
        "fiat": "149.33"
    },
    {
        "time": 1661385600,
        "mau": "2",
        "bch": "1.137244",
        "fiat": "148.78"
    },
    {
        "time": 1661472000,
        "mau": "2",
        "bch": "1.137244",
        "fiat": "131.76"
    },
    {
        "time": 1661558400,
        "mau": "2",
        "bch": "1.137244",
        "fiat": "131.57"
    },
    {
        "time": 1661644800,
        "mau": "2",
        "bch": "1.137244",
        "fiat": "128.95"
    },
    {
        "time": 1661731200,
        "mau": "2",
        "bch": "1.137244",
        "fiat": "136.09"
    },
    {
        "time": 1661817600,
        "mau": "2",
        "bch": "1.137244",
        "fiat": "130.36"
    },
    {
        "time": 1661904000,
        "mau": "2",
        "bch": "1.137244",
        "fiat": "130.73"
    },
    {
        "time": 1661990400,
        "mau": "2",
        "bch": "1.137244",
        "fiat": "133.14"
    },
    {
        "time": 1662076800,
        "mau": "2",
        "bch": "1.137244",
        "fiat": "132.33"
    },
    {
        "time": 1662163200,
        "mau": "2",
        "bch": "1.137244",
        "fiat": "133.69"
    },
    {
        "time": 1662249600,
        "mau": "2",
        "bch": "1.137244",
        "fiat": "134.24"
    },
    {
        "time": 1662336000,
        "mau": "2",
        "bch": "1.137244",
        "fiat": "142.92"
    },
    {
        "time": 1662422400,
        "mau": "2",
        "bch": "1.137244",
        "fiat": "128.35"
    },
    {
        "time": 1662508800,
        "mau": "2",
        "bch": "1.137244",
        "fiat": "134.98"
    },
    {
        "time": 1662595200,
        "mau": "2",
        "bch": "1.137244",
        "fiat": "144.68"
    },
    {
        "time": 1662681600,
        "mau": "2",
        "bch": "1.137244",
        "fiat": "150.66"
    },
    {
        "time": 1662768000,
        "mau": "2",
        "bch": "1.137244",
        "fiat": "151.05"
    },
    {
        "time": 1662854400,
        "mau": "2",
        "bch": "1.137244",
        "fiat": "148.74"
    },
    {
        "time": 1662940800,
        "mau": "2",
        "bch": "1.137017",
        "fiat": "146.05"
    },
    {
        "time": 1663027200,
        "mau": "2",
        "bch": "1.137017",
        "fiat": "133.54"
    },
    {
        "time": 1663113600,
        "mau": "2",
        "bch": "1.137017",
        "fiat": "136.89"
    },
    {
        "time": 1663200000,
        "mau": "2",
        "bch": "1.137017",
        "fiat": "134.46"
    },
    {
        "time": 1663286400,
        "mau": "2",
        "bch": "1.137017",
        "fiat": "135.62"
    },
    {
        "time": 1663372800,
        "mau": "2",
        "bch": "1.137017",
        "fiat": "139.11"
    },
    {
        "time": 1663459200,
        "mau": "2",
        "bch": "1.137017",
        "fiat": "127.34"
    },
    {
        "time": 1663545600,
        "mau": "2",
        "bch": "1.137017",
        "fiat": "127.76"
    },
    {
        "time": 1663632000,
        "mau": "2",
        "bch": "1.126196",
        "fiat": "127.14"
    },
    {
        "time": 1663718400,
        "mau": "2",
        "bch": "1.126196",
        "fiat": "122.99"
    },
    {
        "time": 1663804800,
        "mau": "2",
        "bch": "1.126196",
        "fiat": "131.27"
    },
    {
        "time": 1663891200,
        "mau": "2",
        "bch": "1.126196",
        "fiat": "135.54"
    },
    {
        "time": 1663977600,
        "mau": "2",
        "bch": "1.126196",
        "fiat": "132.73"
    },
    {
        "time": 1664064000,
        "mau": "2",
        "bch": "1.126196",
        "fiat": "127.83"
    },
    {
        "time": 1664150400,
        "mau": "2",
        "bch": "1.126196",
        "fiat": "130.98"
    },
    {
        "time": 1664236800,
        "mau": "2",
        "bch": "1.126196",
        "fiat": "128.93"
    },
    {
        "time": 1664323200,
        "mau": "2",
        "bch": "1.126196",
        "fiat": "129.00"
    },
    {
        "time": 1664409600,
        "mau": "2",
        "bch": "1.126196",
        "fiat": "131.53"
    },
    {
        "time": 1664496000,
        "mau": "2",
        "bch": "1.126196",
        "fiat": "135.17"
    },
    {
        "time": 1664582400,
        "mau": "2",
        "bch": "1.126196",
        "fiat": "131.95"
    },
    {
        "time": 1664668800,
        "mau": "2",
        "bch": "1.126196",
        "fiat": "129.01"
    },
    {
        "time": 1664755200,
        "mau": "2",
        "bch": "1.126196",
        "fiat": "131.08"
    },
    {
        "time": 1664841600,
        "mau": "2",
        "bch": "1.126196",
        "fiat": "136.51"
    },
    {
        "time": 1664928000,
        "mau": "2",
        "bch": "1.126196",
        "fiat": "137.67"
    },
    {
        "time": 1665014400,
        "mau": "2",
        "bch": "1.126196",
        "fiat": "133.60"
    },
    {
        "time": 1665100800,
        "mau": "2",
        "bch": "1.126196",
        "fiat": "131.18"
    },
    {
        "time": 1665187200,
        "mau": "2",
        "bch": "1.126196",
        "fiat": "131.54"
    },
    {
        "time": 1665273600,
        "mau": "2",
        "bch": "1.126196",
        "fiat": "132.02"
    },
    {
        "time": 1665360000,
        "mau": "2",
        "bch": "1.126196",
        "fiat": "125.99"
    },
    {
        "time": 1665446400,
        "mau": "2",
        "bch": "1.126196",
        "fiat": "125.19"
    },
    {
        "time": 1665532800,
        "mau": "2",
        "bch": "1.125970",
        "fiat": "126.03"
    },
    {
        "time": 1665619200,
        "mau": "2",
        "bch": "1.125970",
        "fiat": "122.72"
    },
    {
        "time": 1665705600,
        "mau": "2",
        "bch": "1.125970",
        "fiat": "121.04"
    },
    {
        "time": 1665792000,
        "mau": "2",
        "bch": "1.125970",
        "fiat": "121.53"
    },
    {
        "time": 1665878400,
        "mau": "2",
        "bch": "1.125970",
        "fiat": "124.16"
    },
    {
        "time": 1665964800,
        "mau": "2",
        "bch": "1.125970",
        "fiat": "124.64"
    },
    {
        "time": 1666051200,
        "mau": "2",
        "bch": "1.125970",
        "fiat": "122.44"
    },
    {
        "time": 1666137600,
        "mau": "2",
        "bch": "1.125970",
        "fiat": "119.24"
    },
    {
        "time": 1666224000,
        "mau": "3",
        "bch": "1.125978",
        "fiat": "119.40"
    },
    {
        "time": 1666310400,
        "mau": "3",
        "bch": "1.125978",
        "fiat": "120.30"
    },
    {
        "time": 1666396800,
        "mau": "3",
        "bch": "1.125978",
        "fiat": "122.35"
    },
    {
        "time": 1666483200,
        "mau": "3",
        "bch": "1.125978",
        "fiat": "124.83"
    },
    {
        "time": 1666569600,
        "mau": "3",
        "bch": "1.125978",
        "fiat": "121.40"
    },
    {
        "time": 1666656000,
        "mau": "3",
        "bch": "1.125978",
        "fiat": "126.96"
    },
    {
        "time": 1666742400,
        "mau": "3",
        "bch": "1.125978",
        "fiat": "129.11"
    },
    {
        "time": 1666828800,
        "mau": "3",
        "bch": "1.125978",
        "fiat": "126.73"
    },
    {
        "time": 1666915200,
        "mau": "3",
        "bch": "1.125978",
        "fiat": "129.98"
    },
    {
        "time": 1667001600,
        "mau": "3",
        "bch": "1.126003",
        "fiat": "133.26"
    },
    {
        "time": 1667088000,
        "mau": "3",
        "bch": "1.126003",
        "fiat": "130.83"
    },
    {
        "time": 1667174400,
        "mau": "3",
        "bch": "1.126003",
        "fiat": "129.63"
    },
    {
        "time": 1667260800,
        "mau": "3",
        "bch": "1.126003",
        "fiat": "129.52"
    },
    {
        "time": 1667347200,
        "mau": "3",
        "bch": "1.126003",
        "fiat": "128.00"
    },
    {
        "time": 1667433600,
        "mau": "3",
        "bch": "1.126003",
        "fiat": "130.20"
    },
    {
        "time": 1667520000,
        "mau": "3",
        "bch": "1.126003",
        "fiat": "139.34"
    },
    {
        "time": 1667606400,
        "mau": "3",
        "bch": "1.126003",
        "fiat": "139.30"
    },
    {
        "time": 1667692800,
        "mau": "3",
        "bch": "1.126003",
        "fiat": "131.50"
    },
    {
        "time": 1667779200,
        "mau": "3",
        "bch": "1.126003",
        "fiat": "132.55"
    },
    {
        "time": 1667865600,
        "mau": "3",
        "bch": "1.126003",
        "fiat": "116.18"
    },
    {
        "time": 1667952000,
        "mau": "3",
        "bch": "1.126003",
        "fiat": "99.74"
    },
    {
        "time": 1668038400,
        "mau": "3",
        "bch": "1.126003",
        "fiat": "115.74"
    },
    {
        "time": 1668124800,
        "mau": "3",
        "bch": "1.125778",
        "fiat": "115.89"
    },
    {
        "time": 1668211200,
        "mau": "3",
        "bch": "1.125778",
        "fiat": "114.88"
    },
    {
        "time": 1668297600,
        "mau": "3",
        "bch": "1.125778",
        "fiat": "111.81"
    },
    {
        "time": 1668384000,
        "mau": "3",
        "bch": "1.125778",
        "fiat": "116.45"
    },
    {
        "time": 1668470400,
        "mau": "3",
        "bch": "1.125778",
        "fiat": "116.74"
    },
    {
        "time": 1668556800,
        "mau": "4",
        "bch": "1.125963",
        "fiat": "117.79"
    },
    {
        "time": 1668643200,
        "mau": "4",
        "bch": "1.125963",
        "fiat": "116.85"
    },
    {
        "time": 1668729600,
        "mau": "4",
        "bch": "1.125963",
        "fiat": "118.06"
    },
    {
        "time": 1668816000,
        "mau": "4",
        "bch": "1.125963",
        "fiat": "118.01"
    },
    {
        "time": 1668902400,
        "mau": "4",
        "bch": "1.125963",
        "fiat": "118.13"
    },
    {
        "time": 1668988800,
        "mau": "4",
        "bch": "1.125963",
        "fiat": "116.43"
    },
    {
        "time": 1669075200,
        "mau": "5",
        "bch": "1.261788",
        "fiat": "137.41"
    },
    {
        "time": 1669161600,
        "mau": "5",
        "bch": "1.234128",
        "fiat": "141.34"
    },
    {
        "time": 1669248000,
        "mau": "5",
        "bch": "1.234128",
        "fiat": "144.01"
    },
    {
        "time": 1669334400,
        "mau": "5",
        "bch": "1.234128",
        "fiat": "140.57"
    },
    {
        "time": 1669420800,
        "mau": "5",
        "bch": "1.234128",
        "fiat": "138.58"
    },
    {
        "time": 1669507200,
        "mau": "5",
        "bch": "1.206468",
        "fiat": "134.16"
    },
    {
        "time": 1669593600,
        "mau": "5",
        "bch": "1.206468",
        "fiat": "132.75"
    },
    {
        "time": 1669680000,
        "mau": "5",
        "bch": "1.206468",
        "fiat": "133.83"
    },
    {
        "time": 1669766400,
        "mau": "5",
        "bch": "1.206468",
        "fiat": "136.96"
    },
    {
        "time": 1669852800,
        "mau": "5",
        "bch": "1.178808",
        "fiat": "129.92"
    },
    {
        "time": 1669939200,
        "mau": "5",
        "bch": "1.178808",
        "fiat": "131.98"
    },
    {
        "time": 1670025600,
        "mau": "5",
        "bch": "1.151148",
        "fiat": "126.47"
    },
    {
        "time": 1670112000,
        "mau": "5",
        "bch": "1.151148",
        "fiat": "128.12"
    },
    {
        "time": 1670198400,
        "mau": "5",
        "bch": "1.151148",
        "fiat": "127.16"
    },
    {
        "time": 1670284800,
        "mau": "5",
        "bch": "1.151148",
        "fiat": "128.90"
    },
    {
        "time": 1670371200,
        "mau": "5",
        "bch": "1.151148",
        "fiat": "125.92"
    },
    {
        "time": 1670457600,
        "mau": "5",
        "bch": "1.151148",
        "fiat": "128.70"
    },
    {
        "time": 1670544000,
        "mau": "5",
        "bch": "1.151148",
        "fiat": "126.44"
    },
    {
        "time": 1670630400,
        "mau": "5",
        "bch": "1.151148",
        "fiat": "125.53"
    },
    {
        "time": 1670716800,
        "mau": "5",
        "bch": "1.150923",
        "fiat": "122.48"
    },
    {
        "time": 1670803200,
        "mau": "5",
        "bch": "1.150923",
        "fiat": "121.87"
    },
    {
        "time": 1670889600,
        "mau": "5",
        "bch": "1.150923",
        "fiat": "126.42"
    },
    {
        "time": 1670976000,
        "mau": "5",
        "bch": "1.150923",
        "fiat": "125.38"
    },
    {
        "time": 1671062400,
        "mau": "6",
        "bch": "1.150958",
        "fiat": "123.14"
    },
    {
        "time": 1671148800,
        "mau": "6",
        "bch": "1.150958",
        "fiat": "114.66"
    },
    {
        "time": 1671235200,
        "mau": "6",
        "bch": "1.150958",
        "fiat": "118.58"
    },
    {
        "time": 1671321600,
        "mau": "6",
        "bch": "1.150958",
        "fiat": "117.15"
    },
    {
        "time": 1671408000,
        "mau": "7",
        "bch": "1.280775",
        "fiat": "126.27"
    },
    {
        "time": 1671494400,
        "mau": "7",
        "bch": "1.280792",
        "fiat": "130.17"
    },
    {
        "time": 1671580800,
        "mau": "7",
        "bch": "1.280792",
        "fiat": "128.32"
    },
    {
        "time": 1671667200,
        "mau": "7",
        "bch": "1.280792",
        "fiat": "129.56"
    },
    {
        "time": 1671753600,
        "mau": "7",
        "bch": "1.280792",
        "fiat": "130.33"
    },
    {
        "time": 1671840000,
        "mau": "7",
        "bch": "1.280792",
        "fiat": "130.31"
    },
    {
        "time": 1671926400,
        "mau": "7",
        "bch": "1.280792",
        "fiat": "130.09"
    },
    {
        "time": 1672012800,
        "mau": "7",
        "bch": "1.280792",
        "fiat": "131.83"
    },
    {
        "time": 1672099200,
        "mau": "7",
        "bch": "1.280792",
        "fiat": "129.72"
    },
    {
        "time": 1672185600,
        "mau": "7",
        "bch": "1.257632",
        "fiat": "124.61"
    },
    {
        "time": 1672272000,
        "mau": "7",
        "bch": "1.257632",
        "fiat": "123.44"
    },
    {
        "time": 1672358400,
        "mau": "7",
        "bch": "1.257632",
        "fiat": "121.32"
    },
    {
        "time": 1672444800,
        "mau": "7",
        "bch": "1.257632",
        "fiat": "121.92"
    },
    {
        "time": 1672531200,
        "mau": "7",
        "bch": "1.257632",
        "fiat": "121.49"
    },
    {
        "time": 1672617600,
        "mau": "7",
        "bch": "1.257632",
        "fiat": "124.58"
    },
    {
        "time": 1672704000,
        "mau": "7",
        "bch": "1.257632",
        "fiat": "125.03"
    },
    {
        "time": 1672790400,
        "mau": "16",
        "bch": "19.257632",
        "fiat": "1956.09"
    },
    {
        "time": 1672876800,
        "mau": "17",
        "bch": "21.234472",
        "fiat": "2139.85"
    },
    {
        "time": 1672963200,
        "mau": "17",
        "bch": "21.234472",
        "fiat": "2161.10"
    },
    {
        "time": 1673049600,
        "mau": "17",
        "bch": "21.211292",
        "fiat": "2149.32"
    },
    {
        "time": 1673136000,
        "mau": "17",
        "bch": "21.211292",
        "fiat": "2194.54"
    },
    {
        "time": 1673222400,
        "mau": "17",
        "bch": "21.211292",
        "fiat": "2262.49"
    },
    {
        "time": 1673308800,
        "mau": "17",
        "bch": "21.211292",
        "fiat": "2284.16"
    },
    {
        "time": 1673395200,
        "mau": "17",
        "bch": "21.211068",
        "fiat": "2345.67"
    },
    {
        "time": 1673481600,
        "mau": "17",
        "bch": "21.211068",
        "fiat": "2534.88"
    },
    {
        "time": 1673568000,
        "mau": "17",
        "bch": "21.211068",
        "fiat": "2618.13"
    },
    {
        "time": 1673654400,
        "mau": "17",
        "bch": "21.211068",
        "fiat": "2670.54"
    },
    {
        "time": 1673740800,
        "mau": "17",
        "bch": "21.211068",
        "fiat": "2647.08"
    },
    {
        "time": 1673827200,
        "mau": "17",
        "bch": "21.211068",
        "fiat": "2629.58"
    },
    {
        "time": 1673913600,
        "mau": "17",
        "bch": "21.211068",
        "fiat": "2602.83"
    },
    {
        "time": 1674000000,
        "mau": "17",
        "bch": "21.211068",
        "fiat": "2525.04"
    },
    {
        "time": 1674086400,
        "mau": "17",
        "bch": "21.211068",
        "fiat": "2575.73"
    },
    {
        "time": 1674172800,
        "mau": "17",
        "bch": "21.211068",
        "fiat": "2708.24"
    },
    {
        "time": 1674259200,
        "mau": "17",
        "bch": "21.211068",
        "fiat": "2720.89"
    },
    {
        "time": 1674345600,
        "mau": "17",
        "bch": "21.211068",
        "fiat": "2729.67"
    },
    {
        "time": 1674432000,
        "mau": "17",
        "bch": "21.211068",
        "fiat": "2833.26"
    },
    {
        "time": 1674518400,
        "mau": "17",
        "bch": "21.211068",
        "fiat": "2717.97"
    },
    {
        "time": 1674604800,
        "mau": "17",
        "bch": "21.211068",
        "fiat": "2802.57"
    },
    {
        "time": 1674691200,
        "mau": "17",
        "bch": "21.211068",
        "fiat": "2841.15"
    },
    {
        "time": 1674777600,
        "mau": "17",
        "bch": "21.211068",
        "fiat": "2865.47"
    },
    {
        "time": 1674864000,
        "mau": "17",
        "bch": "21.211068",
        "fiat": "2814.96"
    },
    {
        "time": 1674950400,
        "mau": "17",
        "bch": "21.211068",
        "fiat": "2905.76"
    },
    {
        "time": 1675036800,
        "mau": "18",
        "bch": "25.736145",
        "fiat": "3358.62"
    },
    {
        "time": 1675123200,
        "mau": "18",
        "bch": "25.736145",
        "fiat": "3433.55"
    },
    {
        "time": 1675209600,
        "mau": "18",
        "bch": "25.696036",
        "fiat": "3487.01"
    },
    {
        "time": 1675296000,
        "mau": "18",
        "bch": "25.512439",
        "fiat": "3500.66"
    },
    {
        "time": 1675382400,
        "mau": "19",
        "bch": "25.712419",
        "fiat": "3539.36"
    },
    {
        "time": 1675468800,
        "mau": "20",
        "bch": "25.718921",
        "fiat": "3547.25"
    },
    {
        "time": 1675555200,
        "mau": "20",
        "bch": "25.718384",
        "fiat": "3456.67"
    },
    {
        "time": 1675641600,
        "mau": "20",
        "bch": "25.718384",
        "fiat": "3382.77"
    },
    {
        "time": 1675728000,
        "mau": "20",
        "bch": "25.718384",
        "fiat": "3494.73"
    },
    {
        "time": 1675814400,
        "mau": "20",
        "bch": "25.717950",
        "fiat": "3377.28"
    },
    {
        "time": 1675900800,
        "mau": "20",
        "bch": "25.717559",
        "fiat": "3241.83"
    },
    {
        "time": 1675987200,
        "mau": "20",
        "bch": "25.717559",
        "fiat": "3207.25"
    },
    {
        "time": 1676073600,
        "mau": "20",
        "bch": "25.717019",
        "fiat": "3213.00"
    },
    {
        "time": 1676160000,
        "mau": "20",
        "bch": "25.716832",
        "fiat": "3154.78"
    },
    {
        "time": 1676246400,
        "mau": "20",
        "bch": "25.716722",
        "fiat": "3187.87"
    },
    {
        "time": 1676332800,
        "mau": "20",
        "bch": "25.716622",
        "fiat": "3262.69"
    },
    {
        "time": 1676419200,
        "mau": "20",
        "bch": "25.705856",
        "fiat": "3459.88"
    },
    {
        "time": 1676505600,
        "mau": "20",
        "bch": "25.705818",
        "fiat": "3319.01"
    },
    {
        "time": 1676592000,
        "mau": "22",
        "bch": "29.273816",
        "fiat": "3925.39"
    },
    {
        "time": 1676678400,
        "mau": "22",
        "bch": "29.273797",
        "fiat": "3990.16"
    },
    {
        "time": 1676764800,
        "mau": "23",
        "bch": "29.377375",
        "fiat": "3983.21"
    },
    {
        "time": 1676851200,
        "mau": "25",
        "bch": "29.696839",
        "fiat": "4279.59"
    },
    {
        "time": 1676937600,
        "mau": "25",
        "bch": "29.696839",
        "fiat": "4314.06"
    },
    {
        "time": 1677024000,
        "mau": "27",
        "bch": "29.784935",
        "fiat": "4223.37"
    },
    {
        "time": 1677110400,
        "mau": "27",
        "bch": "29.784935",
        "fiat": "4142.01"
    },
    {
        "time": 1677196800,
        "mau": "27",
        "bch": "29.784941",
        "fiat": "3954.07"
    },
    {
        "time": 1677283200,
        "mau": "27",
        "bch": "29.784941",
        "fiat": "3965.85"
    },
    {
        "time": 1677369600,
        "mau": "27",
        "bch": "29.757281",
        "fiat": "4046.86"
    },
    {
        "time": 1677456000,
        "mau": "28",
        "bch": "29.755168",
        "fiat": "4009.06"
    },
    {
        "time": 1677542400,
        "mau": "28",
        "bch": "29.727508",
        "fiat": "3912.55"
    },
    {
        "time": 1677628800,
        "mau": "29",
        "bch": "29.656107",
        "fiat": "3970.16"
    },
    {
        "time": 1677715200,
        "mau": "29",
        "bch": "29.469615",
        "fiat": "3879.23"
    },
    {
        "time": 1677801600,
        "mau": "29",
        "bch": "29.467603",
        "fiat": "3702.26"
    },
    {
        "time": 1677888000,
        "mau": "29",
        "bch": "29.467603",
        "fiat": "3670.27"
    },
    {
        "time": 1677974400,
        "mau": "29",
        "bch": "29.467603",
        "fiat": "3658.51"
    },
    {
        "time": 1678060800,
        "mau": "29",
        "bch": "29.467603",
        "fiat": "3667.00"
    },
    {
        "time": 1678147200,
        "mau": "29",
        "bch": "29.465533",
        "fiat": "3589.75"
    },
    {
        "time": 1678233600,
        "mau": "30",
        "bch": "30.453097",
        "fiat": "3546.01"
    },
    {
        "time": 1678320000,
        "mau": "30",
        "bch": "32.122117",
        "fiat": "3542.20"
    },
    {
        "time": 1678406400,
        "mau": "30",
        "bch": "32.122117",
        "fiat": "3582.65"
    },
    {
        "time": 1678492800,
        "mau": "30",
        "bch": "32.122117",
        "fiat": "3640.64"
    },
    {
        "time": 1678579200,
        "mau": "31",
        "bch": "37.863116",
        "fiat": "4575.04"
    },
    {
        "time": 1678665600,
        "mau": "31",
        "bch": "37.862894",
        "fiat": "4809.09"
    },
    {
        "time": 1678752000,
        "mau": "31",
        "bch": "37.862894",
        "fiat": "4971.64"
    },
    {
        "time": 1678838400,
        "mau": "31",
        "bch": "37.860865",
        "fiat": "4690.10"
    },
    {
        "time": 1678924800,
        "mau": "31",
        "bch": "37.860865",
        "fiat": "4812.12"
    },
    {
        "time": 1679011200,
        "mau": "31",
        "bch": "37.850440",
        "fiat": "5140.46"
    },
    {
        "time": 1679097600,
        "mau": "31",
        "bch": "37.850440",
        "fiat": "4990.04"
    },
    {
        "time": 1679184000,
        "mau": "31",
        "bch": "37.846439",
        "fiat": "5179.68"
    },
    {
        "time": 1679270400,
        "mau": "31",
        "bch": "37.846439",
        "fiat": "4972.66"
    },
    {
        "time": 1679356800,
        "mau": "31",
        "bch": "37.846439",
        "fiat": "5091.34"
    },
    {
        "time": 1679443200,
        "mau": "31",
        "bch": "37.810717",
        "fiat": "4790.69"
    },
    {
        "time": 1679529600,
        "mau": "31",
        "bch": "37.810717",
        "fiat": "4880.25"
    },
    {
        "time": 1679616000,
        "mau": "31",
        "bch": "37.810717",
        "fiat": "4684.11"
    },
    {
        "time": 1679702400,
        "mau": "31",
        "bch": "37.800111",
        "fiat": "4741.27"
    },
    {
        "time": 1679788800,
        "mau": "31",
        "bch": "37.800111",
        "fiat": "4709.02"
    },
    {
        "time": 1679875200,
        "mau": "31",
        "bch": "37.796126",
        "fiat": "4552.25"
    },
    {
        "time": 1679961600,
        "mau": "31",
        "bch": "37.796126",
        "fiat": "4581.49"
    },
    {
        "time": 1680048000,
        "mau": "31",
        "bch": "37.796126",
        "fiat": "4664.53"
    },
    {
        "time": 1680134400,
        "mau": "31",
        "bch": "37.617278",
        "fiat": "4556.32"
    },
    {
        "time": 1680220800,
        "mau": "31",
        "bch": "37.617278",
        "fiat": "4669.67"
    },
    {
        "time": 1680307200,
        "mau": "31",
        "bch": "37.595683",
        "fiat": "4748.73"
    },
    {
        "time": 1680393600,
        "mau": "31",
        "bch": "37.595683",
        "fiat": "4627.97"
    },
    {
        "time": 1680480000,
        "mau": "31",
        "bch": "37.595683",
        "fiat": "4808.86"
    },
    {
        "time": 1680566400,
        "mau": "31",
        "bch": "37.591714",
        "fiat": "4776.93"
    },
    {
        "time": 1680652800,
        "mau": "31",
        "bch": "37.581826",
        "fiat": "4783.99"
    },
    {
        "time": 1680739200,
        "mau": "31",
        "bch": "37.581826",
        "fiat": "4737.83"
    },
    {
        "time": 1680825600,
        "mau": "31",
        "bch": "42.424099",
        "fiat": "5294.45"
    },
    {
        "time": 1680912000,
        "mau": "31",
        "bch": "42.424099",
        "fiat": "5257.43"
    },
    {
        "time": 1680998400,
        "mau": "31",
        "bch": "42.424099",
        "fiat": "5330.54"
    },
    {
        "time": 1681084800,
        "mau": "31",
        "bch": "42.424099",
        "fiat": "5431.54"
    },
    {
        "time": 1681171200,
        "mau": "31",
        "bch": "40.984644",
        "fiat": "5292.49"
    },
    {
        "time": 1681257600,
        "mau": "31",
        "bch": "40.984644",
        "fiat": "5282.43"
    },
    {
        "time": 1681344000,
        "mau": "31",
        "bch": "40.984644",
        "fiat": "5378.69"
    },
    {
        "time": 1681430400,
        "mau": "31",
        "bch": "40.955719",
        "fiat": "5428.69"
    },
    {
        "time": 1681516800,
        "mau": "31",
        "bch": "40.955719",
        "fiat": "5440.68"
    },
    {
        "time": 1681603200,
        "mau": "31",
        "bch": "40.955719",
        "fiat": "5499.16"
    },
    {
        "time": 1681689600,
        "mau": "31",
        "bch": "40.955719",
        "fiat": "5395.25"
    },
    {
        "time": 1681776000,
        "mau": "32",
        "bch": "42.292288",
        "fiat": "5648.82"
    },
    {
        "time": 1681862400,
        "mau": "32",
        "bch": "42.289792",
        "fiat": "5286.24"
    },
    {
        "time": 1681948800,
        "mau": "32",
        "bch": "42.259098",
        "fiat": "5199.40"
    },
    {
        "time": 1682035200,
        "mau": "32",
        "bch": "42.259098",
        "fiat": "5062.09"
    },
    {
        "time": 1682121600,
        "mau": "32",
        "bch": "42.246765",
        "fiat": "5170.35"
    },
    {
        "time": 1682208000,
        "mau": "32",
        "bch": "42.246765",
        "fiat": "5070.03"
    },
    {
        "time": 1682294400,
        "mau": "32",
        "bch": "42.246765",
        "fiat": "5039.37"
    },
    {
        "time": 1682380800,
        "mau": "32",
        "bch": "42.235421",
        "fiat": "5081.36"
    },
    {
        "time": 1682467200,
        "mau": "32",
        "bch": "42.235421",
        "fiat": "4963.45"
    },
    {
        "time": 1682553600,
        "mau": "32",
        "bch": "42.235421",
        "fiat": "4950.40"
    },
    {
        "time": 1682640000,
        "mau": "32",
        "bch": "42.058318",
        "fiat": "4966.44"
    },
    {
        "time": 1682726400,
        "mau": "32",
        "bch": "42.058318",
        "fiat": "5030.57"
    },
    {
        "time": 1682812800,
        "mau": "32",
        "bch": "42.038859",
        "fiat": "4977.48"
    },
    {
        "time": 1682899200,
        "mau": "32",
        "bch": "42.037062",
        "fiat": "4922.50"
    },
    {
        "time": 1682985600,
        "mau": "32",
        "bch": "42.025734",
        "fiat": "5010.39"
    },
    {
        "time": 1683072000,
        "mau": "32",
        "bch": "42.025734",
        "fiat": "5047.24"
    },
    {
        "time": 1683158400,
        "mau": "32",
        "bch": "42.025734",
        "fiat": "4935.13"
    },
    {
        "time": 1683244800,
        "mau": "32",
        "bch": "42.015945",
        "fiat": "5047.36"
    },
    {
        "time": 1683331200,
        "mau": "32",
        "bch": "42.015945",
        "fiat": "4919.86"
    },
    {
        "time": 1683417600,
        "mau": "32",
        "bch": "42.015945",
        "fiat": "4911.88"
    },
    {
        "time": 1683504000,
        "mau": "32",
        "bch": "42.015945",
        "fiat": "4682.04"
    },
    {
        "time": 1683590400,
        "mau": "32",
        "bch": "42.015945",
        "fiat": "5111.67"
    },
    {
        "time": 1683676800,
        "mau": "32",
        "bch": "40.926190",
        "fiat": "4757.09"
    },
    {
        "time": 1683763200,
        "mau": "32",
        "bch": "40.877729",
        "fiat": "4644.01"
    },
    {
        "time": 1683849600,
        "mau": "32",
        "bch": "40.867511",
        "fiat": "4697.77"
    },
    {
        "time": 1683936000,
        "mau": "32",
        "bch": "40.867511",
        "fiat": "4622.38"
    },
    {
        "time": 1684022400,
        "mau": "32",
        "bch": "40.867511",
        "fiat": "4712.40"
    },
    {
        "time": 1684108800,
        "mau": "32",
        "bch": "40.867511",
        "fiat": "4756.39"
    },
    {
        "time": 1684195200,
        "mau": "32",
        "bch": "40.867511",
        "fiat": "4777.62"
    },
    {
        "time": 1684281600,
        "mau": "32",
        "bch": "40.852017",
        "fiat": "4819.49"
    },
    {
        "time": 1684368000,
        "mau": "32",
        "bch": "40.835400",
        "fiat": "4710.88"
    },
    {
        "time": 1684454400,
        "mau": "32",
        "bch": "40.835400",
        "fiat": "4716.85"
    },
    {
        "time": 1684540800,
        "mau": "32",
        "bch": "40.835400",
        "fiat": "4754.93"
    },
    {
        "time": 1684627200,
        "mau": "32",
        "bch": "40.825005",
        "fiat": "4685.38"
    },
    {
        "time": 1684713600,
        "mau": "32",
        "bch": "40.820324",
        "fiat": "4685.78"
    },
    {
        "time": 1684800000,
        "mau": "32",
        "bch": "40.820324",
        "fiat": "4721.23"
    },
    {
        "time": 1684886400,
        "mau": "32",
        "bch": "40.820324",
        "fiat": "4575.59"
    },
    {
        "time": 1684972800,
        "mau": "32",
        "bch": "40.820324",
        "fiat": "4570.10"
    },
    {
        "time": 1685059200,
        "mau": "32",
        "bch": "40.664484",
        "fiat": "4604.53"
    },
    {
        "time": 1685145600,
        "mau": "32",
        "bch": "40.664484",
        "fiat": "4632.77"
    },
    {
        "time": 1685232000,
        "mau": "32",
        "bch": "40.662532",
        "fiat": "4739.83"
    },
    {
        "time": 1685318400,
        "mau": "32",
        "bch": "40.639441",
        "fiat": "4671.63"
    },
    {
        "time": 1685404800,
        "mau": "32",
        "bch": "40.639441",
        "fiat": "4639.77"
    },
    {
        "time": 1685491200,
        "mau": "32",
        "bch": "40.632019",
        "fiat": "4602.17"
    },
    {
        "time": 1685577600,
        "mau": "32",
        "bch": "40.632019",
        "fiat": "4606.68"
    },
    {
        "time": 1685664000,
        "mau": "32",
        "bch": "40.620637",
        "fiat": "4659.65"
    },
    {
        "time": 1685750400,
        "mau": "32",
        "bch": "40.620637",
        "fiat": "4669.97"
    },
    {
        "time": 1685836800,
        "mau": "32",
        "bch": "40.620637",
        "fiat": "4708.61"
    },
    {
        "time": 1685923200,
        "mau": "32",
        "bch": "40.620637",
        "fiat": "4425.78"
    },
    {
        "time": 1686009600,
        "mau": "32",
        "bch": "40.620637",
        "fiat": "4659.82"
    },
    {
        "time": 1686096000,
        "mau": "32",
        "bch": "39.813072",
        "fiat": "4427.21"
    },
    {
        "time": 1686182400,
        "mau": "32",
        "bch": "39.786385",
        "fiat": "4446.40"
    },
    {
        "time": 1686268800,
        "mau": "32",
        "bch": "39.712920",
        "fiat": "4396.99"
    },
    {
        "time": 1686355200,
        "mau": "32",
        "bch": "39.697335",
        "fiat": "4114.54"
    },
    {
        "time": 1686441600,
        "mau": "32",
        "bch": "39.697335",
        "fiat": "4080.11"
    },
    {
        "time": 1686528000,
        "mau": "32",
        "bch": "39.697335",
        "fiat": "4080.52"
    },
    {
        "time": 1686614400,
        "mau": "32",
        "bch": "39.697335",
        "fiat": "4175.21"
    },
    {
        "time": 1686700800,
        "mau": "32",
        "bch": "39.694888",
        "fiat": "4040.74"
    },
    {
        "time": 1686787200,
        "mau": "32",
        "bch": "39.687466",
        "fiat": "4153.48"
    },
    {
        "time": 1686873600,
        "mau": "32",
        "bch": "39.687466",
        "fiat": "4286.22"
    },
    {
        "time": 1686960000,
        "mau": "32",
        "bch": "39.687466",
        "fiat": "4227.66"
    },
    {
        "time": 1687046400,
        "mau": "32",
        "bch": "39.682045",
        "fiat": "4248.57"
    },
    {
        "time": 1687132800,
        "mau": "32",
        "bch": "39.671754",
        "fiat": "4231.39"
    },
    {
        "time": 1687219200,
        "mau": "32",
        "bch": "39.671754",
        "fiat": "4354.77"
    },
    {
        "time": 1687305600,
        "mau": "32",
        "bch": "39.667307",
        "fiat": "5407.08"
    },
    {
        "time": 1687392000,
        "mau": "32",
        "bch": "39.659885",
        "fiat": "5322.91"
    },
    {
        "time": 1687478400,
        "mau": "32",
        "bch": "39.501937",
        "fiat": "7165.00"
    },
    {
        "time": 1687564800,
        "mau": "32",
        "bch": "39.500004",
        "fiat": "8449.52"
    },
    {
        "time": 1687651200,
        "mau": "32",
        "bch": "39.480932",
        "fiat": "7786.13"
    },
    {
        "time": 1687737600,
        "mau": "32",
        "bch": "39.480932",
        "fiat": "8873.02"
    },
    {
        "time": 1687824000,
        "mau": "32",
        "bch": "39.480932",
        "fiat": "9080.87"
    },
    {
        "time": 1687910400,
        "mau": "32",
        "bch": "39.473510",
        "fiat": "8903.68"
    },
    {
        "time": 1687996800,
        "mau": "32",
        "bch": "39.463916",
        "fiat": "10009.09"
    },
    {
        "time": 1688083200,
        "mau": "32",
        "bch": "39.458588",
        "fiat": "12100.58"
    },
    {
        "time": 1688169600,
        "mau": "32",
        "bch": "39.458588",
        "fiat": "11470.42"
    },
    {
        "time": 1688256000,
        "mau": "32",
        "bch": "39.458588",
        "fiat": "11808.31"
    },
    {
        "time": 1688342400,
        "mau": "32",
        "bch": "38.817392",
        "fiat": "11118.25"
    },
    {
        "time": 1688428800,
        "mau": "32",
        "bch": "38.817392",
        "fiat": "10547.73"
    },
    {
        "time": 1688515200,
        "mau": "32",
        "bch": "38.737239",
        "fiat": "10543.79"
    },
    {
        "time": 1688601600,
        "mau": "32",
        "bch": "38.727225",
        "fiat": "10850.63"
    },
    {
        "time": 1688688000,
        "mau": "32",
        "bch": "38.725727",
        "fiat": "10764.97"
    },
    {
        "time": 1688774400,
        "mau": "32",
        "bch": "38.721942",
        "fiat": "10468.81"
    },
    {
        "time": 1688860800,
        "mau": "32",
        "bch": "38.721942",
        "fiat": "10268.83"
    },
    {
        "time": 1688947200,
        "mau": "32",
        "bch": "38.719520",
        "fiat": "10624.42"
    },
    {
        "time": 1689033600,
        "mau": "32",
        "bch": "38.719520",
        "fiat": "10606.43"
    },
    {
        "time": 1689120000,
        "mau": "32",
        "bch": "38.712098",
        "fiat": "10938.63"
    },
    {
        "time": 1689206400,
        "mau": "32",
        "bch": "38.712098",
        "fiat": "10618.71"
    },
    {
        "time": 1689292800,
        "mau": "32",
        "bch": "38.710630",
        "fiat": "10220.34"
    },
    {
        "time": 1689379200,
        "mau": "32",
        "bch": "38.710630",
        "fiat": "9799.42"
    },
    {
        "time": 1689465600,
        "mau": "32",
        "bch": "38.696673",
        "fiat": "9679.35"
    },
    {
        "time": 1689552000,
        "mau": "32",
        "bch": "38.696673",
        "fiat": "9382.04"
    },
    {
        "time": 1689638400,
        "mau": "32",
        "bch": "38.696673",
        "fiat": "9444.12"
    },
    {
        "time": 1689724800,
        "mau": "32",
        "bch": "38.594846",
        "fiat": "9431.98"
    },
    {
        "time": 1689811200,
        "mau": "32",
        "bch": "38.538203",
        "fiat": "9404.66"
    },
    {
        "time": 1689897600,
        "mau": "32",
        "bch": "38.534851",
        "fiat": "9486.18"
    },
    {
        "time": 1689984000,
        "mau": "32",
        "bch": "38.515970",
        "fiat": "9188.23"
    },
    {
        "time": 1690070400,
        "mau": "32",
        "bch": "38.512215",
        "fiat": "9633.22"
    },
    {
        "time": 1690156800,
        "mau": "32",
        "bch": "38.512215",
        "fiat": "9197.30"
    },
    {
        "time": 1690243200,
        "mau": "32",
        "bch": "38.512215",
        "fiat": "9152.63"
    },
    {
        "time": 1690329600,
        "mau": "32",
        "bch": "38.504793",
        "fiat": "9317.14"
    },
    {
        "time": 1690416000,
        "mau": "32",
        "bch": "38.495295",
        "fiat": "9409.12"
    },
    {
        "time": 1690502400,
        "mau": "32",
        "bch": "38.495295",
        "fiat": "9302.34"
    },
    {
        "time": 1690588800,
        "mau": "32",
        "bch": "38.493885",
        "fiat": "9316.47"
    },
    {
        "time": 1690675200,
        "mau": "32",
        "bch": "38.490145",
        "fiat": "9736.05"
    },
    {
        "time": 1690761600,
        "mau": "32",
        "bch": "38.489927",
        "fiat": "9546.15"
    },
    {
        "time": 1690848000,
        "mau": "32",
        "bch": "38.000682",
        "fiat": "9288.71"
    },
    {
        "time": 1690934400,
        "mau": "32",
        "bch": "37.928678",
        "fiat": "8682.02"
    },
    {
        "time": 1691020800,
        "mau": "32",
        "bch": "37.911342",
        "fiat": "8539.23"
    },
    {
        "time": 1691107200,
        "mau": "32",
        "bch": "37.911342",
        "fiat": "8602.22"
    },
    {
        "time": 1691193600,
        "mau": "32",
        "bch": "37.911342",
        "fiat": "8589.83"
    },
    {
        "time": 1691280000,
        "mau": "32",
        "bch": "37.909960",
        "fiat": "8433.64"
    },
    {
        "time": 1691366400,
        "mau": "32",
        "bch": "37.903838",
        "fiat": "9005.72"
    },
    {
        "time": 1691452800,
        "mau": "32",
        "bch": "37.899613",
        "fiat": "9100.03"
    },
    {
        "time": 1691539200,
        "mau": "32",
        "bch": "37.899613",
        "fiat": "9033.75"
    },
    {
        "time": 1691625600,
        "mau": "32",
        "bch": "37.892191",
        "fiat": "8787.18"
    },
    {
        "time": 1691712000,
        "mau": "32",
        "bch": "37.892191",
        "fiat": "8675.71"
    },
    {
        "time": 1691798400,
        "mau": "32",
        "bch": "37.892191",
        "fiat": "8661.73"
    },
    {
        "time": 1691884800,
        "mau": "32",
        "bch": "37.880751",
        "fiat": "8651.48"
    },
    {
        "time": 1691971200,
        "mau": "32",
        "bch": "37.880751",
        "fiat": "8717.12"
    },
    {
        "time": 1692057600,
        "mau": "32",
        "bch": "37.877041",
        "fiat": "8665.33"
    },
    {
        "time": 1692144000,
        "mau": "32",
        "bch": "37.783580",
        "fiat": "7870.47"
    },
    {
        "time": 1692230400,
        "mau": "32",
        "bch": "37.727503",
        "fiat": "6934.33"
    },
    {
        "time": 1692316800,
        "mau": "32",
        "bch": "37.718187",
        "fiat": "7063.79"
    },
    {
        "time": 1692403200,
        "mau": "32",
        "bch": "37.718187",
        "fiat": "7051.59"
    },
    {
        "time": 1692489600,
        "mau": "32",
        "bch": "37.699495",
        "fiat": "7112.52"
    },
    {
        "time": 1692576000,
        "mau": "32",
        "bch": "37.698168",
        "fiat": "7011.15"
    },
    {
        "time": 1692662400,
        "mau": "32",
        "bch": "37.694473",
        "fiat": "6965.92"
    },
    {
        "time": 1692748800,
        "mau": "32",
        "bch": "37.694473",
        "fiat": "7302.22"
    },
    {
        "time": 1692835200,
        "mau": "32",
        "bch": "37.685070",
        "fiat": "7327.71"
    },
    {
        "time": 1692921600,
        "mau": "32",
        "bch": "37.677648",
        "fiat": "7232.49"
    },
    {
        "time": 1693008000,
        "mau": "32",
        "bch": "37.677648",
        "fiat": "7164.95"
    },
    {
        "time": 1693094400,
        "mau": "32",
        "bch": "37.676347",
        "fiat": "7457.58"
    },
    {
        "time": 1693180800,
        "mau": "32",
        "bch": "37.676129",
        "fiat": "7169.25"
    },
    {
        "time": 1693267200,
        "mau": "32",
        "bch": "37.676129",
        "fiat": "8444.98"
    },
    {
        "time": 1693353600,
        "mau": "32",
        "bch": "37.641367",
        "fiat": "8124.38"
    },
    {
        "time": 1693440000,
        "mau": "32",
        "bch": "37.641333",
        "fiat": "7807.29"
    },
    {
        "time": 1693526400,
        "mau": "32",
        "bch": "37.218382",
        "fiat": "7433.06"
    },
    {
        "time": 1693612800,
        "mau": "33",
        "bch": "37.229333",
        "fiat": "7256.01"
    },
    {
        "time": 1693699200,
        "mau": "33",
        "bch": "37.229333",
        "fiat": "7312.44"
    },
    {
        "time": 1693785600,
        "mau": "33",
        "bch": "37.317120",
        "fiat": "7226.17"
    },
    {
        "time": 1693872000,
        "mau": "34",
        "bch": "43.539621",
        "fiat": "8361.56"
    },
    {
        "time": 1693958400,
        "mau": "34",
        "bch": "43.539621",
        "fiat": "8402.48"
    },
    {
        "time": 1694044800,
        "mau": "34",
        "bch": "43.539621",
        "fiat": "8411.93"
    },
    {
        "time": 1694131200,
        "mau": "34",
        "bch": "43.524520",
        "fiat": "8405.24"
    },
    {
        "time": 1694217600,
        "mau": "34",
        "bch": "43.524520",
        "fiat": "8403.10"
    },
    {
        "time": 1694304000,
        "mau": "34",
        "bch": "43.514534",
        "fiat": "8285.47"
    },
    {
        "time": 1694390400,
        "mau": "35",
        "bch": "43.515191",
        "fiat": "7994.57"
    },
    {
        "time": 1694476800,
        "mau": "35",
        "bch": "43.513942",
        "fiat": "8658.39"
    },
    {
        "time": 1694563200,
        "mau": "35",
        "bch": "43.513942",
        "fiat": "8692.66"
    },
    {
        "time": 1694649600,
        "mau": "35",
        "bch": "43.365899",
        "fiat": "8998.17"
    },
    {
        "time": 1694736000,
        "mau": "35",
        "bch": "43.364024",
        "fiat": "9421.13"
    },
    {
        "time": 1694822400,
        "mau": "36",
        "bch": "43.371399",
        "fiat": "9320.32"
    },
    {
        "time": 1694908800,
        "mau": "36",
        "bch": "43.352894",
        "fiat": "9088.00"
    },
    {
        "time": 1694995200,
        "mau": "36",
        "bch": "43.352894",
        "fiat": "9419.65"
    },
    {
        "time": 1695081600,
        "mau": "36",
        "bch": "43.352894",
        "fiat": "9506.55"
    },
    {
        "time": 1695168000,
        "mau": "36",
        "bch": "43.351670",
        "fiat": "9339.53"
    },
    {
        "time": 1695254400,
        "mau": "36",
        "bch": "43.351670",
        "fiat": "9041.76"
    },
    {
        "time": 1695340800,
        "mau": "37",
        "bch": "43.346361",
        "fiat": "9008.02"
    },
    {
        "time": 1695427200,
        "mau": "37",
        "bch": "43.335302",
        "fiat": "9020.58"
    },
    {
        "time": 1695513600,
        "mau": "38",
        "bch": "43.335319",
        "fiat": "8865.09"
    },
    {
        "time": 1695600000,
        "mau": "38",
        "bch": "43.335101",
        "fiat": "9112.51"
    },
    {
        "time": 1695686400,
        "mau": "55",
        "bch": "44.288434",
        "fiat": "9489.38"
    },
    {
        "time": 1695772800,
        "mau": "55",
        "bch": "44.252820",
        "fiat": "10115.48"
    },
    {
        "time": 1695859200,
        "mau": "55",
        "bch": "44.252820",
        "fiat": "10584.84"
    },
    {
        "time": 1695945600,
        "mau": "55",
        "bch": "43.926689",
        "fiat": "10339.59"
    },
    {
        "time": 1696032000,
        "mau": "56",
        "bch": "43.941673",
        "fiat": "10300.56"
    },
    {
        "time": 1696118400,
        "mau": "57",
        "bch": "43.924916",
        "fiat": "10643.34"
    },
    {
        "time": 1696204800,
        "mau": "57",
        "bch": "43.924916",
        "fiat": "10855.07"
    },
    {
        "time": 1696291200,
        "mau": "57",
        "bch": "43.923741",
        "fiat": "10097.71"
    },
    {
        "time": 1696377600,
        "mau": "59",
        "bch": "43.933734",
        "fiat": "10262.88"
    },
    {
        "time": 1696464000,
        "mau": "59",
        "bch": "43.919669",
        "fiat": "10167.13"
    },
    {
        "time": 1696550400,
        "mau": "59",
        "bch": "43.866514",
        "fiat": "10138.17"
    },
    {
        "time": 1696636800,
        "mau": "59",
        "bch": "43.866514",
        "fiat": "10102.89"
    },
    {
        "time": 1696723200,
        "mau": "59",
        "bch": "43.852704",
        "fiat": "10006.64"
    },
    {
        "time": 1696809600,
        "mau": "59",
        "bch": "43.841673",
        "fiat": "9580.84"
    },
    {
        "time": 1696896000,
        "mau": "59",
        "bch": "43.841673",
        "fiat": "9327.27"
    },
    {
        "time": 1696982400,
        "mau": "59",
        "bch": "43.841673",
        "fiat": "9378.26"
    },
    {
        "time": 1697068800,
        "mau": "64",
        "bch": "44.003699",
        "fiat": "9420.75"
    },
    {
        "time": 1697155200,
        "mau": "64",
        "bch": "44.003697",
        "fiat": "9552.69"
    },
    {
        "time": 1697241600,
        "mau": "65",
        "bch": "44.165227",
        "fiat": "9477.46"
    },
    {
        "time": 1697328000,
        "mau": "65",
        "bch": "44.053335",
        "fiat": "9479.86"
    },
    {
        "time": 1697414400,
        "mau": "65",
        "bch": "44.042319",
        "fiat": "10199.60"
    },
    {
        "time": 1697500800,
        "mau": "65",
        "bch": "44.042112",
        "fiat": "9996.17"
    },
    {
        "time": 1697587200,
        "mau": "66",
        "bch": "44.060232",
        "fiat": "10012.50"
    },
    {
        "time": 1697673600,
        "mau": "66",
        "bch": "44.058968",
        "fiat": "10019.94"
    },
    {
        "time": 1697760000,
        "mau": "66",
        "bch": "44.049708",
        "fiat": "10606.52"
    },
    {
        "time": 1697846400,
        "mau": "66",
        "bch": "44.049708",
        "fiat": "10729.74"
    },
    {
        "time": 1697932800,
        "mau": "66",
        "bch": "44.049708",
        "fiat": "10748.78"
    },
    {
        "time": 1698019200,
        "mau": "66",
        "bch": "44.038378",
        "fiat": "11458.93"
    },
    {
        "time": 1698105600,
        "mau": "66",
        "bch": "44.038378",
        "fiat": "11084.66"
    },
    {
        "time": 1698192000,
        "mau": "66",
        "bch": "44.004307",
        "fiat": "11171.39"
    },
    {
        "time": 1698278400,
        "mau": "66",
        "bch": "44.004305",
        "fiat": "10889.50"
    },
    {
        "time": 1698364800,
        "mau": "66",
        "bch": "43.994292",
        "fiat": "10528.06"
    },
    {
        "time": 1698451200,
        "mau": "66",
        "bch": "43.994248",
        "fiat": "10775.69"
    },
    {
        "time": 1698537600,
        "mau": "66",
        "bch": "43.731869",
        "fiat": "10773.94"
    },
    {
        "time": 1698624000,
        "mau": "66",
        "bch": "43.730572",
        "fiat": "10764.87"
    },
    {
        "time": 1698710400,
        "mau": "66",
        "bch": "43.713247",
        "fiat": "10714.15"
    },
    {
        "time": 1698796800,
        "mau": "66",
        "bch": "43.712183",
        "fiat": "10711.11"
    },
    {
        "time": 1698883200,
        "mau": "66",
        "bch": "43.708652",
        "fiat": "10289.31"
    },
    {
        "time": 1698969600,
        "mau": "66",
        "bch": "43.707565",
        "fiat": "10383.31"
    },
    {
        "time": 1699056000,
        "mau": "66",
        "bch": "43.707565",
        "fiat": "10498.52"
    },
    {
        "time": 1699142400,
        "mau": "66",
        "bch": "43.707565",
        "fiat": "10424.42"
    },
    {
        "time": 1699228800,
        "mau": "66",
        "bch": "43.707521",
        "fiat": "10616.89"
    },
    {
        "time": 1699315200,
        "mau": "66",
        "bch": "43.685104",
        "fiat": "10656.30"
    },
    {
        "time": 1699401600,
        "mau": "66",
        "bch": "43.677567",
        "fiat": "10745.60"
    },
    {
        "time": 1699488000,
        "mau": "66",
        "bch": "43.673911",
        "fiat": "10475.82"
    },
    {
        "time": 1699574400,
        "mau": "66",
        "bch": "43.632795",
        "fiat": "10464.87"
    },
    {
        "time": 1699660800,
        "mau": "66",
        "bch": "43.632795",
        "fiat": "10325.57"
    },
    {
        "time": 1699747200,
        "mau": "66",
        "bch": "43.596519",
        "fiat": "10311.69"
    },
    {
        "time": 1699833600,
        "mau": "66",
        "bch": "43.577266",
        "fiat": "10225.41"
    },
    {
        "time": 1699920000,
        "mau": "66",
        "bch": "43.576730",
        "fiat": "10094.70"
    },
    {
        "time": 1700006400,
        "mau": "66",
        "bch": "43.551059",
        "fiat": "10373.51"
    },
    {
        "time": 1700092800,
        "mau": "66",
        "bch": "43.548635",
        "fiat": "10200.33"
    },
    {
        "time": 1700179200,
        "mau": "66",
        "bch": "43.548599",
        "fiat": "9965.97"
    },
    {
        "time": 1700265600,
        "mau": "66",
        "bch": "43.534796",
        "fiat": "9900.53"
    },
    {
        "time": 1700352000,
        "mau": "66",
        "bch": "43.478139",
        "fiat": "10013.11"
    },
    {
        "time": 1700438400,
        "mau": "66",
        "bch": "43.478139",
        "fiat": "9837.25"
    },
    {
        "time": 1700524800,
        "mau": "67",
        "bch": "43.556159",
        "fiat": "9453.00"
    },
    {
        "time": 1700611200,
        "mau": "67",
        "bch": "43.556159",
        "fiat": "9757.27"
    },
    {
        "time": 1700697600,
        "mau": "67",
        "bch": "43.514851",
        "fiat": "9798.86"
    },
    {
        "time": 1700784000,
        "mau": "67",
        "bch": "43.514817",
        "fiat": "9861.04"
    },
    {
        "time": 1700870400,
        "mau": "67",
        "bch": "43.510171",
        "fiat": "9895.06"
    },
    {
        "time": 1700956800,
        "mau": "67",
        "bch": "43.366481",
        "fiat": "9836.10"
    },
    {
        "time": 1701043200,
        "mau": "67",
        "bch": "43.296784",
        "fiat": "9677.23"
    },
    {
        "time": 1701129600,
        "mau": "67",
        "bch": "43.296784",
        "fiat": "9656.26"
    },
    {
        "time": 1701216000,
        "mau": "67",
        "bch": "43.287547",
        "fiat": "9652.50"
    },
    {
        "time": 1701302400,
        "mau": "67",
        "bch": "43.268316",
        "fiat": "9584.99"
    },
    {
        "time": 1701388800,
        "mau": "67",
        "bch": "43.268282",
        "fiat": "9744.22"
    },
    {
        "time": 1701475200,
        "mau": "67",
        "bch": "43.263499",
        "fiat": "9868.55"
    },
    {
        "time": 1701561600,
        "mau": "67",
        "bch": "43.263497",
        "fiat": "9947.22"
    },
    {
        "time": 1701648000,
        "mau": "67",
        "bch": "43.263497",
        "fiat": "10861.31"
    },
    {
        "time": 1701734400,
        "mau": "67",
        "bch": "43.263497",
        "fiat": "10869.66"
    },
    {
        "time": 1701820800,
        "mau": "67",
        "bch": "43.253808",
        "fiat": "10580.03"
    },
    {
        "time": 1701907200,
        "mau": "81",
        "bch": "44.003808",
        "fiat": "10862.18"
    },
    {
        "time": 1701993600,
        "mau": "81",
        "bch": "43.969803",
        "fiat": "11164.86"
    },
    {
        "time": 1702080000,
        "mau": "81",
        "bch": "43.944392",
        "fiat": "11100.87"
    },
    {
        "time": 1702166400,
        "mau": "81",
        "bch": "43.921862",
        "fiat": "11019.76"
    },
    {
        "time": 1702252800,
        "mau": "81",
        "bch": "43.921862",
        "fiat": "10112.55"
    },
    {
        "time": 1702339200,
        "mau": "81",
        "bch": "44.217282",
        "fiat": "10248.06"
    },
    {
        "time": 1702425600,
        "mau": "81",
        "bch": "44.199327",
        "fiat": "10403.94"
    },
    {
        "time": 1702512000,
        "mau": "81",
        "bch": "44.199327",
        "fiat": "10478.96"
    },
    {
        "time": 1702598400,
        "mau": "81",
        "bch": "44.180040",
        "fiat": "10016.32"
    },
    {
        "time": 1702684800,
        "mau": "81",
        "bch": "44.179510",
        "fiat": "10144.23"
    },
    {
        "time": 1702771200,
        "mau": "81",
        "bch": "44.162943",
        "fiat": "9976.25"
    },
    {
        "time": 1702857600,
        "mau": "81",
        "bch": "44.144988",
        "fiat": "10065.14"
    },
    {
        "time": 1702944000,
        "mau": "82",
        "bch": "44.200100",
        "fiat": "9940.20"
    },
    {
        "time": 1703030400,
        "mau": "82",
        "bch": "44.200100",
        "fiat": "10145.34"
    },
    {
        "time": 1703116800,
        "mau": "82",
        "bch": "44.200053",
        "fiat": "10302.41"
    },
    {
        "time": 1703203200,
        "mau": "83",
        "bch": "44.316658",
        "fiat": "10576.61"
    },
    {
        "time": 1703289600,
        "mau": "83",
        "bch": "44.315828",
        "fiat": "10335.56"
    },
    {
        "time": 1703376000,
        "mau": "84",
        "bch": "44.251598",
        "fiat": "10138.55"
    },
    {
        "time": 1703462400,
        "mau": "84",
        "bch": "44.594057",
        "fiat": "10476.34"
    },
    {
        "time": 1703548800,
        "mau": "85",
        "bch": "44.620601",
        "fiat": "10220.25"
    },
    {
        "time": 1703635200,
        "mau": "86",
        "bch": "44.638070",
        "fiat": "11793.67"
    },
    {
        "time": 1703721600,
        "mau": "86",
        "bch": "44.625610",
        "fiat": "11698.10"
    },
    {
        "time": 1703808000,
        "mau": "86",
        "bch": "44.625610",
        "fiat": "11351.80"
    },
    {
        "time": 1703894400,
        "mau": "86",
        "bch": "44.625610",
        "fiat": "12114.45"
    },
    {
        "time": 1703980800,
        "mau": "86",
        "bch": "44.624237",
        "fiat": "11561.91"
    },
    {
        "time": 1704067200,
        "mau": "86",
        "bch": "44.617829",
        "fiat": "11882.62"
    },
    {
        "time": 1704153600,
        "mau": "86",
        "bch": "44.599758",
        "fiat": "11473.23"
    },
    {
        "time": 1704240000,
        "mau": "87",
        "bch": "44.643621",
        "fiat": "10441.52"
    },
    {
        "time": 1704326400,
        "mau": "87",
        "bch": "44.643577",
        "fiat": "10705.04"
    },
    {
        "time": 1704412800,
        "mau": "87",
        "bch": "44.625801",
        "fiat": "10686.92"
    },
    {
        "time": 1704499200,
        "mau": "87",
        "bch": "44.601580",
        "fiat": "10528.05"
    },
    {
        "time": 1704585600,
        "mau": "87",
        "bch": "44.583804",
        "fiat": "10345.23"
    },
    {
        "time": 1704672000,
        "mau": "87",
        "bch": "44.568058",
        "fiat": "11324.87"
    },
    {
        "time": 1704758400,
        "mau": "87",
        "bch": "44.531467",
        "fiat": "10917.58"
    },
    {
        "time": 1704844800,
        "mau": "87",
        "bch": "44.527761",
        "fiat": "11325.66"
    },
    {
        "time": 1704931200,
        "mau": "87",
        "bch": "44.454526",
        "fiat": "12277.94"
    },
    {
        "time": 1705017600,
        "mau": "87",
        "bch": "44.438117",
        "fiat": "11532.70"
    },
    {
        "time": 1705104000,
        "mau": "87",
        "bch": "44.437068",
        "fiat": "11319.28"
    },
    {
        "time": 1705190400,
        "mau": "87",
        "bch": "44.419292",
        "fiat": "10928.32"
    },
    {
        "time": 1705276800,
        "mau": "87",
        "bch": "44.383001",
        "fiat": "11127.31"
    },
    {
        "time": 1705363200,
        "mau": "87",
        "bch": "44.382867",
        "fiat": "11155.94"
    },
    {
        "time": 1705449600,
        "mau": "87",
        "bch": "44.377326",
        "fiat": "10834.36"
    },
    {
        "time": 1705536000,
        "mau": "87",
        "bch": "44.340884",
        "fiat": "10525.62"
    },
    {
        "time": 1705622400,
        "mau": "88",
        "bch": "44.465969",
        "fiat": "10507.07"
    },
    {
        "time": 1705708800,
        "mau": "89",
        "bch": "44.536933",
        "fiat": "10635.67"
    },
    {
        "time": 1705795200,
        "mau": "89",
        "bch": "44.454530",
        "fiat": "10534.93"
    },
    {
        "time": 1705881600,
        "mau": "89",
        "bch": "44.385919",
        "fiat": "10423.49"
    },
    {
        "time": 1705968000,
        "mau": "89",
        "bch": "44.384899",
        "fiat": "10188.93"
    },
    {
        "time": 1706054400,
        "mau": "89",
        "bch": "44.379495",
        "fiat": "10492.28"
    },
    {
        "time": 1706140800,
        "mau": "89",
        "bch": "44.361495",
        "fiat": "10505.96"
    },
    {
        "time": 1706227200,
        "mau": "89",
        "bch": "44.361298",
        "fiat": "10725.18"
    },
    {
        "time": 1706313600,
        "mau": "91",
        "bch": "48.521098",
        "fiat": "11820.89"
    },
    {
        "time": 1706400000,
        "mau": "91",
        "bch": "48.521098",
        "fiat": "11496.48"
    },
    {
        "time": 1706486400,
        "mau": "92",
        "bch": "48.503377",
        "fiat": "11708.30"
    },
    {
        "time": 1706572800,
        "mau": "93",
        "bch": "48.542392",
        "fiat": "11525.19"
    },
    {
        "time": 1706659200,
        "mau": "93",
        "bch": "48.532498",
        "fiat": "11367.07"
    },
    {
        "time": 1706745600,
        "mau": "93",
        "bch": "48.600266",
        "fiat": "11496.16"
    },
    {
        "time": 1706832000,
        "mau": "93",
        "bch": "48.580688",
        "fiat": "11475.81"
    },
    {
        "time": 1706918400,
        "mau": "93",
        "bch": "48.523077",
        "fiat": "11563.20"
    },
    {
        "time": 1707004800,
        "mau": "93",
        "bch": "48.465467",
        "fiat": "11403.46"
    },
    {
        "time": 1707091200,
        "mau": "93",
        "bch": "48.441491",
        "fiat": "11400.99"
    },
    {
        "time": 1707177600,
        "mau": "93",
        "bch": "48.412228",
        "fiat": "11383.58"
    },
    {
        "time": 1707264000,
        "mau": "93",
        "bch": "48.396339",
        "fiat": "11632.12"
    },
    {
        "time": 1707350400,
        "mau": "93",
        "bch": "48.378741",
        "fiat": "11821.94"
    },
    {
        "time": 1707436800,
        "mau": "93",
        "bch": "48.378741",
        "fiat": "12112.13"
    },
    {
        "time": 1707523200,
        "mau": "93",
        "bch": "48.338726",
        "fiat": "11969.55"
    },
    {
        "time": 1707609600,
        "mau": "94",
        "bch": "48.221737",
        "fiat": "13326.04"
    },
    {
        "time": 1707696000,
        "mau": "94",
        "bch": "48.221064",
        "fiat": "13555.31"
    },
    {
        "time": 1707782400,
        "mau": "94",
        "bch": "48.179424",
        "fiat": "13055.62"
    },
    {
        "time": 1707868800,
        "mau": "94",
        "bch": "48.167236",
        "fiat": "13525.35"
    },
    {
        "time": 1707955200,
        "mau": "94",
        "bch": "48.131416",
        "fiat": "13024.78"
    },
    {
        "time": 1708041600,
        "mau": "94",
        "bch": "48.130963",
        "fiat": "13230.25"
    },
    {
        "time": 1708128000,
        "mau": "95",
        "bch": "48.145254",
        "fiat": "12874.06"
    },
    {
        "time": 1708214400,
        "mau": "95",
        "bch": "48.082866",
        "fiat": "13003.45"
    },
    {
        "time": 1708300800,
        "mau": "95",
        "bch": "47.974537",
        "fiat": "13091.20"
    },
    {
        "time": 1708387200,
        "mau": "95",
        "bch": "47.932384",
        "fiat": "12736.74"
    },
    {
        "time": 1708473600,
        "mau": "95",
        "bch": "47.918680",
        "fiat": "12622.13"
    },
    {
        "time": 1708560000,
        "mau": "95",
        "bch": "47.907173",
        "fiat": "12469.09"
    },
    {
        "time": 1708646400,
        "mau": "95",
        "bch": "47.906264",
        "fiat": "12679.98"
    },
    {
        "time": 1708732800,
        "mau": "95",
        "bch": "47.905623",
        "fiat": "12808.94"
    },
    {
        "time": 1708819200,
        "mau": "96",
        "bch": "47.905110",
        "fiat": "12829.95"
    },
    {
        "time": 1708905600,
        "mau": "96",
        "bch": "47.904440",
        "fiat": "13159.31"
    },
    {
        "time": 1708992000,
        "mau": "96",
        "bch": "47.814212",
        "fiat": "13981.20"
    },
    {
        "time": 1709078400,
        "mau": "96",
        "bch": "47.802554",
        "fiat": "14208.40"
    },
    {
        "time": 1709164800,
        "mau": "96",
        "bch": "47.800725",
        "fiat": "14256.91"
    },
    {
        "time": 1709251200,
        "mau": "96",
        "bch": "47.757368",
        "fiat": "15065.10"
    },
    {
        "time": 1709337600,
        "mau": "96",
        "bch": "47.737319",
        "fiat": "23952.16"
    },
    {
        "time": 1709424000,
        "mau": "96",
        "bch": "47.718910",
        "fiat": "22390.54"
    },
    {
        "time": 1709510400,
        "mau": "96",
        "bch": "47.698502",
        "fiat": "22347.72"
    },
    {
        "time": 1709596800,
        "mau": "96",
        "bch": "47.690451",
        "fiat": "19243.31"
    },
    {
        "time": 1709683200,
        "mau": "96",
        "bch": "47.622525",
        "fiat": "19788.91"
    },
    {
        "time": 1709769600,
        "mau": "96",
        "bch": "47.581252",
        "fiat": "20538.13"
    },
    {
        "time": 1709856000,
        "mau": "96",
        "bch": "47.568683",
        "fiat": "20764.89"
    },
    {
        "time": 1709942400,
        "mau": "97",
        "bch": "47.564971",
        "fiat": "20641.88"
    },
    {
        "time": 1710028800,
        "mau": "99",
        "bch": "48.809915",
        "fiat": "20666.97"
    },
    {
        "time": 1710115200,
        "mau": "99",
        "bch": "48.806569",
        "fiat": "21919.03"
    },
    {
        "time": 1710201600,
        "mau": "99",
        "bch": "48.748795",
        "fiat": "21130.94"
    },
    {
        "time": 1710288000,
        "mau": "99",
        "bch": "48.702007",
        "fiat": "21544.20"
    },
    {
        "time": 1710374400,
        "mau": "99",
        "bch": "48.695174",
        "fiat": "21455.90"
    },
    {
        "time": 1710460800,
        "mau": "99",
        "bch": "48.651434",
        "fiat": "20267.79"
    },
    {
        "time": 1710547200,
        "mau": "99",
        "bch": "48.602787",
        "fiat": "18858.55"
    },
    {
        "time": 1710633600,
        "mau": "99",
        "bch": "48.599637",
        "fiat": "19550.28"
    },
    {
        "time": 1710720000,
        "mau": "99",
        "bch": "48.525006",
        "fiat": "19526.95"
    }
]