<?xml version="1.0" encoding="UTF-8" standalone="no"?>
<svg
   xmlns:dc="http://purl.org/dc/elements/1.1/"
   xmlns:cc="http://creativecommons.org/ns#"
   xmlns:rdf="http://www.w3.org/1999/02/22-rdf-syntax-ns#"
   xmlns:svg="http://www.w3.org/2000/svg"
   xmlns="http://www.w3.org/2000/svg"
   xmlns:sodipodi="http://sodipodi.sourceforge.net/DTD/sodipodi-0.dtd"
   xmlns:inkscape="http://www.inkscape.org/namespaces/inkscape"
   width="400"
   height="400"
   version="1.1"
   viewBox="0 0 105.83 105.83"
   id="svg24"
   sodipodi:docname="02.svg"
   inkscape:version="1.0.2 (e86c870879, 2021-01-15)">
  <sodipodi:namedview
     pagecolor="#ffffff"
     bordercolor="#666666"
     borderopacity="1"
     objecttolerance="10"
     gridtolerance="10"
     guidetolerance="10"
     inkscape:pageopacity="0"
     inkscape:pageshadow="2"
     inkscape:window-width="1839"
     inkscape:window-height="1145"
     id="namedview26"
     showgrid="false"
     inkscape:zoom="2.8175167"
     inkscape:cx="216.85738"
     inkscape:cy="202.67322"
     inkscape:window-x="0"
     inkscape:window-y="0"
     inkscape:window-maximized="0"
     inkscape:current-layer="svg24"
     inkscape:document-rotation="0" />
  <metadata
     id="metadata30">
    <rdf:RDF>
      <cc:Work
         rdf:about="">
        <dc:format>image/svg+xml</dc:format>
        <dc:type
           rdf:resource="http://purl.org/dc/dcmitype/StillImage" />
        <dc:title />
      </cc:Work>
    </rdf:RDF>
  </metadata>
  <defs
     id="defs28" />
  <path
     id="rect2"
     style="fill:#ffffff;stroke-width:1"
     d="M 0.13327999,0 C 35.20776,0 70.282241,0 105.35672,0 c 0.31106,6.3986819 0.0444,13.036681 0.13328,19.527381 0,28.609779 0,57.219561 0,85.829339 -6.398682,0.31106 -13.036681,0.0444 -19.527381,0.13328 -28.609781,0 -57.219559,0 -85.82933901,0 C -0.17778451,99.091317 0.08891157,92.45332 0,85.96262 0,57.352838 0,28.74306 0,0.13327999 Z" />
  <path
     d="m 83.654216,46.019243 c 0.296924,0 0.535363,0.103477 0.715317,0.310418 0.182954,0.206948 0.274431,0.518869 0.274431,0.935763 0,0.410896 -0.09148,0.722815 -0.274431,0.93576 -0.179954,0.212945 -0.419893,0.319418 -0.719816,0.319418 -0.185952,0 -0.340413,-0.03449 -0.463381,-0.103464 -0.119959,-0.07197 -0.214442,-0.15446 -0.283429,-0.247437 h -0.027 c 0.006,0.05098 0.01193,0.115464 0.01806,0.193443 0.006,0.07797 0.0089,0.145461 0.0089,0.202455 v 0.989747 h -0.395809 v -3.491111 h 0.323916 l 0.05398,0.328414 H 82.903 c 0.07197,-0.104977 0.166458,-0.193449 0.28343,-0.265431 0.116976,-0.07197 0.272934,-0.107973 0.467882,-0.107973 z m -0.07199,0.332913 c -0.245937,0 -0.419894,0.06898 -0.521868,0.20694 -0.09898,0.137959 -0.151466,0.347906 -0.157459,0.62984 v 0.07647 c 0,0.296924 0.04799,0.526364 0.143961,0.688323 0.09898,0.158958 0.280431,0.238437 0.544359,0.238437 0.146964,0 0.266932,-0.04048 0.359909,-0.121471 0.09597,-0.08098 0.166457,-0.19045 0.211446,-0.328415 0.04799,-0.140965 0.07199,-0.301423 0.07199,-0.481377 0,-0.27593 -0.05398,-0.496374 -0.161964,-0.661331 -0.104976,-0.164959 -0.268429,-0.247437 -0.490375,-0.247437 z"
     style="font-style:normal;font-variant:normal;font-weight:normal;font-stretch:normal;font-size:160px;line-height:1.25;font-family:'Noto Sans';-inkscape-font-specification:'Noto Sans';white-space:pre;shape-inside:url(#rect1660);stroke-width:0.0281177"
     id="path1668"
     sodipodi:nodetypes="ccscsccccsccccccscccccscsccsccc" />
  <g
     transform="matrix(0.04302731,0,0,0.04302731,15.198614,34.799754)"
     id="g58">
    <g
       transform="matrix(0.04188,0,0,0.04188,75.616,54.993)"
       fill="#8dc351"
       id="g52">
      <path
         d="m 7525,15989 c -349,-23 -745,-74 -1074,-139 -1411,-279 -2741,-944 -3806,-1903 -103,-94 -479,-466 -575,-572 -245,-266 -540,-648 -754,-974 -84,-128 -216,-339 -216,-346 0,-2 -17,-32 -38,-66 -48,-80 -130,-233 -220,-414 C 359,10611 82,9566 10,8445 -3,8240 -3,7750 10,7545 113,5935 655,4458 1610,3185 c 239,-319 428,-535 744,-850 286,-286 436,-420 706,-632 C 4666,442 6732,-162 8765,35 c 1734,169 3354,891 4645,2071 632,577 1156,1241 1589,2014 64,113 231,450 301,605 345,767 574,1625 659,2470 32,311 41,496 41,810 0,808 -118,1588 -356,2359 -526,1697 -1613,3186 -3064,4197 -1216,848 -2616,1332 -4135,1429 -181,11 -740,11 -920,-1 z"
         id="path50" />
    </g>
    <g
       transform="matrix(0.04188,0,0,0.04188,75.616,54.993)"
       fill="#ffffff"
       id="g56">
      <path
         d="m 7751,13046 c -6,-17 -62,-222 -127,-456 -195,-713 -262,-951 -266,-956 -3,-2 -398,103 -879,234 -481,131 -875,238 -877,237 -3,-3 -112,-1041 -112,-1071 0,-17 8,-23 33,-28 75,-14 558,-147 627,-172 101,-38 181,-113 204,-193 28,-95 21,-155 -43,-390 -33,-119 -139,-504 -236,-856 -97,-352 -239,-867 -315,-1145 -76,-278 -193,-703 -260,-945 -67,-242 -142,-514 -166,-605 -25,-91 -57,-185 -72,-210 -44,-77 -110,-138 -190,-177 -67,-34 -84,-38 -171,-41 -134,-6 -233,16 -734,162 -81,23 -120,30 -122,22 -7,-20 -247,-901 -249,-910 0,-4 87,-33 194,-62 107,-30 499,-138 870,-241 371,-102 678,-189 682,-192 4,-3 -81,-323 -188,-711 -107,-388 -192,-710 -190,-715 2,-6 28,-17 57,-24 30,-8 222,-61 428,-117 206,-57 376,-103 377,-101 1,1 88,315 193,697 106,382 194,696 196,698 2,2 137,-35 302,-83 164,-48 318,-92 343,-100 35,-10 44,-17 42,-31 -2,-11 -87,-320 -188,-689 -101,-368 -184,-674 -184,-680 0,-9 858,-250 865,-243 2,2 91,322 198,711 107,389 196,710 199,712 2,3 42,-2 89,-10 416,-74 899,-94 1184,-51 672,104 1078,440 1283,1061 196,592 97,1085 -302,1499 l -73,76 h 118 c 828,0 1344,393 1564,1190 130,470 135,910 15,1273 -41,126 -137,313 -218,427 -145,205 -419,444 -699,612 -277,166 -754,378 -1083,483 -30,10 -58,20 -62,24 -4,3 71,290 166,636 96,347 185,671 198,721 l 25,91 -426,117 c -234,64 -431,116 -436,116 -6,0 -98,-318 -204,-707 -107,-390 -195,-709 -196,-710 -1,-2 -143,35 -316,81 -173,46 -329,87 -346,91 -18,3 -33,12 -33,18 0,11 16,68 259,952 71,259 128,471 126,473 -1,1 -196,56 -433,121 l -431,118 z m 442,-2762 c 928,-243 1429,-470 1733,-785 93,-98 132,-151 179,-252 54,-113 70,-186 69,-317 0,-211 -79,-419 -214,-563 -317,-339 -883,-384 -1824,-143 -226,58 -696,197 -696,207 0,4 117,433 260,953 143,520 260,948 260,951 0,10 22,5 233,-51 z M 7391,7495 c 657,-172 1015,-321 1295,-540 97,-76 161,-145 225,-243 60,-91 87,-161 107,-277 19,-113 7,-234 -39,-369 -102,-305 -310,-473 -660,-532 -82,-13 -140,-16 -298,-11 -227,6 -400,32 -681,103 -171,42 -609,170 -618,179 -4,4 126,484 431,1588 24,87 46,147 53,147 6,0 90,-20 185,-45 z"
         fill="#ffffff"
         id="path54" />
    </g>
  </g>
  <g
     aria-label=":"
     id="text94"
     style="font-size:28.5869px;line-height:1.25;font-family:sans-serif;fill:#000000;stroke-width:0.714685"
     transform="matrix(0.58673199,0,0,0.58673199,22.009958,39.580739)">
    <path
       d="m 51.209944,25.892041 h 2.945233 v 3.545446 h -2.945233 z m 0,-11.23655 h 2.945233 v 3.545445 h -2.945233 z"
       style="stroke-width:0.714685"
       id="path2626" />
  </g>
  <path
     d="M 71.502589,49.380117 V 48.698293 H 70.506135 V 48.173832 H 71.1879 v -3.251661 h -0.681765 v -0.524458 h 0.996454 v -0.681826 h 0.524477 v 0.681826 h 0.78666 v -0.681826 h 0.524455 v 0.710651 c 0.279713,0.06294 0.506989,0.204987 0.681829,0.426128 0.174817,0.22115 0.262225,0.471579 0.262225,0.75129 0,0.148599 -0.02796,0.294135 -0.08391,0.436607 -0.05594,0.142489 -0.136346,0.270544 -0.241233,0.384166 0.197528,0.106633 0.353552,0.255231 0.468071,0.44579 0.114497,0.190543 0.17175,0.397704 0.17175,0.621484 0,0.332156 -0.117135,0.616245 -0.351399,0.852268 -0.234251,0.236006 -0.519197,0.354009 -0.854836,0.354009 h -0.05251 v 0.681825 h -0.52444 V 48.69828 h -0.786723 v 0.681825 z m 0.209792,-3.09432 h 1.363589 c 0.190543,0 0.351809,-0.06687 0.483801,-0.200593 0.131999,-0.13373 0.198,-0.294127 0.198,-0.481193 0,-0.190543 -0.06601,-0.351814 -0.198,-0.483815 -0.131999,-0.131999 -0.293265,-0.197998 -0.483801,-0.197998 h -1.363589 z m 0,1.888075 h 1.678277 c 0.190542,0 0.35181,-0.06687 0.483808,-0.200596 0.131999,-0.133728 0.197999,-0.294127 0.197999,-0.481194 0,-0.190543 -0.06601,-0.351814 -0.197999,-0.483813 -0.131999,-0.132 -0.293266,-0.198001 -0.483808,-0.198001 h -1.678277 z"
     stroke-width="0.00786661"
     id="path4"
     sodipodi:nodetypes="cccccccccccccccccsscssssccccccccssssscccssssscc" />
  <g
     aria-label=":"
     id="text94-3"
     style="font-size:153.357px;line-height:1.25;font-family:sans-serif;fill:#000000;stroke-width:3.83401"
     transform="matrix(0.04138515,0,0,0.04138515,59.650749,74.745942)">
    <path
       d="m 384.43828,-660.48467 h 15.79996 v 19.01986 h -15.79996 z m 0,-60.27949 h 15.79996 v 19.01986 h -15.79996 z"
       style="stroke-width:3.83401"
       id="path1671" />
  </g>
  <path
     d="m 78.314087,46.019243 c 0.296923,0 0.535361,0.103477 0.715316,0.310418 0.182953,0.206948 0.274431,0.518869 0.274431,0.935763 0,0.410896 -0.09148,0.722815 -0.274431,0.93576 -0.179955,0.212945 -0.419893,0.319418 -0.719816,0.319418 -0.185953,0 -0.340412,-0.03449 -0.463381,-0.103464 -0.119959,-0.07197 -0.21444,-0.15446 -0.283428,-0.247437 h -0.027 c 0.006,0.05098 0.01193,0.115464 0.01807,0.193443 0.006,0.07797 0.0089,0.145461 0.0089,0.202455 v 0.989747 H 77.16686 v -3.491111 h 0.323915 l 0.05398,0.328414 h 0.01806 c 0.07197,-0.104977 0.166457,-0.193449 0.283427,-0.265431 0.116976,-0.07197 0.272934,-0.107973 0.467881,-0.107973 z m -0.07199,0.332913 c -0.245938,0 -0.419893,0.06898 -0.521866,0.20694 -0.09898,0.137959 -0.151464,0.347906 -0.157457,0.62984 v 0.07647 c 0,0.296924 0.04799,0.526364 0.14396,0.688323 0.09897,0.158958 0.280432,0.238437 0.544362,0.238437 0.146961,0 0.266933,-0.04048 0.359907,-0.121471 0.09597,-0.08098 0.166457,-0.19045 0.211446,-0.328415 0.04799,-0.140965 0.07197,-0.301423 0.07197,-0.481377 0,-0.27593 -0.05399,-0.496374 -0.161963,-0.661331 -0.104977,-0.164959 -0.268431,-0.247437 -0.490377,-0.247437 z"
     style="font-style:normal;font-variant:normal;font-weight:normal;font-stretch:normal;font-size:160px;line-height:1.25;font-family:'Noto Sans';-inkscape-font-specification:'Noto Sans';white-space:pre;shape-inside:url(#rect1660);stroke-width:0.0281177"
     id="path1664"
     sodipodi:nodetypes="ccscsccccsccccccscccccscsccsccc" />
  <path
     d="m 81.89067,48.475614 h -2.123456 v -0.328417 l 0.841285,-0.850281 c 0.161959,-0.161957 0.298426,-0.305922 0.409398,-0.431891 0.110956,-0.125966 0.194942,-0.248941 0.251934,-0.368905 0.05699,-0.12297 0.08549,-0.256434 0.08549,-0.400399 0,-0.176954 -0.05248,-0.310421 -0.157459,-0.400398 -0.104976,-0.09298 -0.241437,-0.139454 -0.409398,-0.139454 -0.155959,0 -0.293923,0.027 -0.413892,0.08098 -0.116976,0.05399 -0.236941,0.128975 -0.359908,0.224943 l -0.211448,-0.265434 c 0.125966,-0.104976 0.269935,-0.19345 0.43189,-0.265432 0.164957,-0.07498 0.34941,-0.112455 0.553357,-0.112455 0.299923,0 0.536862,0.07648 0.710819,0.229442 0.173956,0.14996 0.260932,0.358408 0.260932,0.625339 0,0.167958 -0.03449,0.325417 -0.103464,0.472381 -0.06898,0.146961 -0.164952,0.292424 -0.287925,0.436387 -0.12297,0.140963 -0.266933,0.292426 -0.431892,0.454386 l -0.670325,0.661322 v 0.01806 h 1.624083 z"
     style="font-style:normal;font-variant:normal;font-weight:normal;font-stretch:normal;font-size:160px;line-height:1.25;font-family:'Noto Sans';-inkscape-font-specification:'Noto Sans';white-space:pre;shape-inside:url(#rect1660);stroke-width:0.0281177"
     id="path1666"
     sodipodi:nodetypes="ccccscscsccccscsscccccc" />
  <path
     d="m 78.597627,60.582013 c -0.161764,0 -0.299264,-0.05673 -0.412498,-0.170175 -0.113231,-0.113446 -0.169847,-0.251204 -0.169847,-0.413273 0,-0.02269 0.0023,-0.04898 0.0067,-0.07886 0.0045,-0.02988 0.01118,-0.05678 0.02008,-0.08069 L 76.55611,58.975548 c -0.05243,0.05467 -0.114907,0.09845 -0.187421,0.131364 -0.07251,0.0329 -0.14726,0.04936 -0.224239,0.04936 -0.16176,0 -0.299258,-0.05662 -0.412492,-0.169848 -0.113232,-0.113236 -0.169847,-0.250735 -0.169847,-0.412496 0,-0.161761 0.05661,-0.299259 0.169847,-0.412494 0.113234,-0.113232 0.250732,-0.169848 0.412492,-0.169848 0.07698,0 0.15061,0.01478 0.220892,0.04434 0.07028,0.02956 0.133871,0.07168 0.190768,0.126343 l 1.485978,-0.856783 c -0.0089,-0.02248 -0.01562,-0.04775 -0.02008,-0.07584 -0.0045,-0.02809 -0.0067,-0.05524 -0.0067,-0.08146 0,-0.161761 0.05662,-0.29926 0.169847,-0.412495 0.113234,-0.113233 0.250734,-0.169849 0.412498,-0.169849 0.161761,0 0.299256,0.05662 0.412487,0.169849 0.113237,0.113235 0.169856,0.250734 0.169856,0.412495 0,0.16176 -0.05662,0.299257 -0.169856,0.412489 -0.113231,0.113236 -0.250726,0.169854 -0.412487,0.169854 -0.07777,0 -0.152151,-0.01311 -0.223156,-0.03933 -0.071,-0.02621 -0.132722,-0.06665 -0.185157,-0.121319 l -1.485979,0.836703 c 0.0067,0.02454 0.01225,0.05271 0.01672,0.08451 0.0045,0.03179 0.0067,0.05967 0.0067,0.08364 0,0.02396 -0.0023,0.04879 -0.0067,0.07446 -0.0045,0.02568 -0.01005,0.05079 -0.01672,0.07533 l 1.485979,0.85009 c 0.05244,-0.04797 0.112676,-0.08618 0.180727,-0.114631 0.06805,-0.02845 0.143915,-0.04268 0.227586,-0.04268 0.161761,0 0.299256,0.05662 0.412487,0.169854 0.113237,0.113233 0.169856,0.25073 0.169856,0.41249 0,0.161761 -0.05662,0.29926 -0.169856,0.412495 -0.113231,0.113233 -0.250726,0.169849 -0.412487,0.169849 z m 1.13e-4,-3.186157 c 0.07021,0 0.129017,-0.02374 0.176432,-0.07124 0.04741,-0.04749 0.07112,-0.106337 0.07112,-0.17654 0,-0.07021 -0.02374,-0.129016 -0.07124,-0.17643 -0.04749,-0.04742 -0.106339,-0.07112 -0.176544,-0.07112 -0.0702,0 -0.129013,0.02374 -0.176428,0.07124 -0.04742,0.04749 -0.07112,0.106343 -0.07112,0.176545 0,0.0702 0.02374,0.129017 0.07124,0.176431 0.04749,0.04741 0.106343,0.07112 0.176546,0.07112 z m -2.453205,1.425742 c 0.07021,0 0.129015,-0.02375 0.176428,-0.07124 0.04741,-0.04749 0.07112,-0.106338 0.07112,-0.17654 0,-0.07021 -0.02374,-0.129016 -0.07124,-0.17643 -0.04749,-0.04742 -0.10634,-0.07112 -0.176546,-0.07112 -0.0702,0 -0.129012,0.02375 -0.176428,0.07124 -0.04741,0.04749 -0.07112,0.106337 -0.07112,0.17654 0,0.07021 0.02374,0.129016 0.07124,0.176431 0.04749,0.04741 0.106343,0.07112 0.176546,0.07112 z m 2.453205,1.425738 c 0.07021,0 0.129017,-0.02374 0.176432,-0.07124 0.04741,-0.04749 0.07112,-0.106342 0.07112,-0.176545 0,-0.07021 -0.02374,-0.129016 -0.07124,-0.17643 -0.04749,-0.04741 -0.106339,-0.07112 -0.176544,-0.07112 -0.0702,0 -0.129013,0.02374 -0.176428,0.07124 -0.04742,0.04749 -0.07112,0.10634 -0.07112,0.176545 0,0.0702 0.02374,0.129012 0.07124,0.176426 0.04749,0.04741 0.106343,0.07112 0.176546,0.07112 z"
     id="path945"
     style="stroke-width:0.00502022"
     sodipodi:nodetypes="ssssccssssssscccsssssssscccssccssssssssssssssssssssssssssssssssss" />
  <path
     d="m 53.098376,25.360188 q -1.092267,0 -2.082098,-0.4399 Q 50.026495,24.480357 49.3916,23.63302 l -6.151308,-8.143399 0.38245,-0.422419 q 0.229958,-0.262452 0.564871,-0.326201 0.334945,-0.06372 0.65738,0.08624 l 4.291663,2.047098 V 6.4138812 q 0,-0.212469 0.145728,-0.356193 0.145729,-0.143712 0.361205,-0.143712 0.215441,0 0.354139,0.143712 0.138721,0.143711 0.138721,0.356193 V 18.424053 l -5.35395,-2.552021 5.493935,7.208589 q 0.50231,0.66989 1.252593,0.974811 0.750283,0.304954 1.569349,0.304954 h 5.361447 q 1.434727,0 2.429527,-0.982318 0.994825,-0.982314 0.994825,-2.417008 v -4.749078 q 0,-0.913591 -0.617997,-1.531589 -0.618032,-0.617992 -1.531597,-0.617992 h -5.998844 v -0.999828 h 5.996175 q 1.313367,0 2.232712,0.918595 0.919344,0.918564 0.919344,2.23082 v 4.74729 q 0,1.848922 -1.292406,3.124915 -1.292407,1.275995 -3.131739,1.275995 z M 45.534863,8.7759102 q -0.309858,-0.509403 -0.47863,-1.117685 -0.168741,-0.60828 -0.168741,-1.252337 0,-1.974122 1.390792,-3.3576031 1.390795,-1.383484 3.358286,-1.383484 1.967484,0 3.358286,1.391217 1.39079,1.3911851 1.39079,3.3636161 0,0.64162 -0.168775,1.245382 -0.168775,0.603732 -0.478596,1.110894 l -0.86485,-0.499914 q 0.252442,-0.414912 0.382417,-0.885582 0.129987,-0.470672 0.129987,-0.992064 0,-1.552095 -1.095079,-2.6429051 -1.095067,-1.090844 -2.659471,-1.090844 -1.564407,0 -2.654179,1.093606 -1.089806,1.0935741 -1.089806,2.6558371 0,0.51223 0.129967,0.979652 0.129985,0.467388 0.382417,0.8823 z m 7.810985,9.9355858 z"
     id="path1085"
     style="stroke-width:0.0324934" />
  <path
     d="M 70.26915,63.951541 H 84.75103 V 62.362709 H 70.26915 Z m 0,-9.558386 H 84.75103 V 52.804374 H 70.26915 Z m -4.3573,17.025704 c -0.793693,0 -1.468755,-0.278196 -2.025188,-0.834589 -0.556402,-0.556429 -0.834603,-1.231499 -0.834603,-2.02521 V 37.100854 c 0,-0.79371 0.278201,-1.46878 0.834603,-2.02521 0.556433,-0.556392 1.231495,-0.834588 2.025188,-0.834588 h 17.250349 l 8.80593,8.805924 v 25.51208 c 0,0.793711 -0.278204,1.468781 -0.834611,2.02521 -0.556424,0.556393 -1.231487,0.834589 -2.025189,0.834589 z M 82.367829,43.765907 v -7.93607 H 65.91185 c -0.317723,0 -0.609,0.132395 -0.873829,0.397185 -0.264777,0.264823 -0.397165,0.556101 -0.397165,0.873832 V 68.55906 c 0,0.317732 0.132388,0.60901 0.397165,0.873833 0.264829,0.26479 0.556106,0.397185 0.873829,0.397185 h 23.196479 c 0.317733,0 0.609013,-0.132395 0.873842,-0.397185 0.264769,-0.264823 0.397153,-0.556101 0.397153,-0.873833 V 43.765907 Z m -17.726973,-7.93607 v 7.93607 -7.93607 34.000241 z"
     id="path884"
     style="stroke-width:0.0516357"
     sodipodi:nodetypes="ccccccccccscsscsccscssccscsscsscsccccccc" />
</svg>
