<?xml version="1.0" encoding="UTF-8" standalone="no"?>
<svg
   xmlns:dc="http://purl.org/dc/elements/1.1/"
   xmlns:cc="http://creativecommons.org/ns#"
   xmlns:rdf="http://www.w3.org/1999/02/22-rdf-syntax-ns#"
   xmlns:svg="http://www.w3.org/2000/svg"
   xmlns="http://www.w3.org/2000/svg"
   xmlns:xlink="http://www.w3.org/1999/xlink"
   xmlns:sodipodi="http://sodipodi.sourceforge.net/DTD/sodipodi-0.dtd"
   xmlns:inkscape="http://www.inkscape.org/namespaces/inkscape"
   width="400"
   height="400"
   viewBox="0 0 105.83334 105.83334"
   version="1.1"
   id="svg952"
   inkscape:version="1.0.2 (e86c870879, 2021-01-15)"
   sodipodi:docname="header.prop.maskable.svg"
   inkscape:export-filename="/home/amnesia/projects/unspent/packages/chi/static/maskable_icon.png"
   inkscape:export-xdpi="243.92737"
   inkscape:export-ydpi="243.92737">
  <defs
     id="defs946">
    <rect
       x="-18.674404"
       y="112.11519"
       width="81.390377"
       height="67.624909"
       id="rect874" />
    <linearGradient
       inkscape:collect="always"
       id="linearGradient1761">
      <stop
         style="stop-color:#ffffff;stop-opacity:1"
         offset="0"
         id="stop1765" />
      <stop
         style="stop-color:#ffffff;stop-opacity:0"
         offset="1"
         id="stop1767" />
    </linearGradient>
    <rect
       x="150.25812"
       y="141.84801"
       width="58.539791"
       height="28.168673"
       id="rect861" />
    <rect
       x="63.911766"
       y="253.59293"
       width="133.07562"
       height="32.357372"
       id="rect5059" />
    <rect
       x="63.768539"
       y="90.97361"
       width="102.59476"
       height="75.930298"
       id="rect1553" />
    <rect
       x="36.332966"
       y="86.086327"
       width="108.56127"
       height="129.21553"
       id="rect1547" />
    <rect
       x="37.265877"
       y="99.138695"
       width="104.75438"
       height="26.873564"
       id="rect1541" />
    <rect
       x="36.844879"
       y="96.043076"
       width="273.35172"
       height="153.82468"
       id="rect1517" />
    <filter
       style="color-interpolation-filters:sRGB"
       inkscape:label="Feather"
       id="filter1599"
       x="-0.58364236"
       y="-0.13983202"
       width="2.2290349"
       height="1.1333871">
      <feGaussianBlur
         stdDeviation="0.5"
         result="blur"
         id="feGaussianBlur1591" />
      <feComposite
         in="SourceGraphic"
         in2="blur"
         operator="atop"
         result="composite1"
         id="feComposite1593" />
      <feComposite
         in2="composite1"
         operator="in"
         result="composite2"
         id="feComposite1595" />
      <feComposite
         in2="composite2"
         operator="in"
         result="composite3"
         id="feComposite1597" />
    </filter>
    <radialGradient
       inkscape:collect="always"
       xlink:href="#linearGradient1761"
       id="radialGradient1763"
       cx="67.288666"
       cy="117.13188"
       fx="67.288666"
       fy="117.13188"
       r="29.077202"
       gradientUnits="userSpaceOnUse"
       gradientTransform="matrix(1.1097016,0,0,1.1097016,-8.6652957,-23.688256)" />
  </defs>
  <sodipodi:namedview
     id="base"
     pagecolor="#ffffff"
     bordercolor="#666666"
     borderopacity="1.0"
     inkscape:pageopacity="0.0"
     inkscape:pageshadow="2"
     inkscape:zoom="0.86855189"
     inkscape:cx="-127.3684"
     inkscape:cy="147.83461"
     inkscape:document-units="mm"
     inkscape:current-layer="layer1"
     inkscape:document-rotation="0"
     showgrid="false"
     fit-margin-top="0"
     fit-margin-left="0"
     fit-margin-right="0"
     fit-margin-bottom="0"
     units="px"
     inkscape:window-width="1920"
     inkscape:window-height="1176"
     inkscape:window-x="0"
     inkscape:window-y="0"
     inkscape:window-maximized="1"
     showguides="true"
     inkscape:guide-bbox="true" />
  <metadata
     id="metadata949">
    <rdf:RDF>
      <cc:Work
         rdf:about="">
        <dc:format>image/svg+xml</dc:format>
        <dc:type
           rdf:resource="http://purl.org/dc/dcmitype/StillImage" />
        <dc:title />
      </cc:Work>
    </rdf:RDF>
  </metadata>
  <g
     inkscape:label="Layer 1"
     inkscape:groupmode="layer"
     id="layer1"
     transform="translate(0.05822718,-72.521118)"
     style="display:inline">
    <rect
       style="fill:#ffb200;fill-opacity:1;stroke-width:0.00372563;stroke-dashoffset:7.35"
       id="rect910"
       width="106.59203"
       height="106.62846"
       x="-0.058227181"
       y="72.521118"
       ry="0.062602744" />
    <path
       style="fill:#ffffff;fill-opacity:1;stroke-width:0.00353363;stroke-dashoffset:7.35"
       d="m 29.302934,95.995089 v 7.978741 l 4.577746,0.77051 12.782294,15.68246 -13.235336,15.95458 -4.57824,0.72515 v 7.93243 h 21.84708 v -7.61495 l -3.943783,-0.4984 7.161909,-9.60902 13.234841,17.72237 h 12.917862 v -7.93243 l -4.6231,-0.72515 -13.280688,-16.18184 12.600385,-15.4552 4.441686,-0.77101 V 95.996073 H 57.042024 v 7.659787 l 4.577746,0.54425 -6.843942,9.06477 -12.328759,-17.223945 z"
       id="path888" />
    <text
       xml:space="preserve"
       style="font-style:normal;font-weight:normal;font-size:8.07687px;line-height:1.25;font-family:sans-serif;fill:#000000;fill-opacity:1;stroke:#fefefe;stroke-width:0.252799;stroke-miterlimit:4;stroke-dasharray:none;stroke-opacity:1"
       x="27.210037"
       y="152.97301"
       id="text1744"><tspan
         sodipodi:role="line"
         id="tspan1742"
         x="27.210037"
         y="152.97301"
         style="font-style:normal;font-variant:normal;font-weight:800;font-stretch:normal;font-size:8.07687px;font-family:'Noto Sans';-inkscape-font-specification:'Noto Sans Ultra-Bold';stroke:#fefefe;stroke-width:0.252799;stroke-linejoin:round;stroke-miterlimit:4;stroke-dasharray:none;stroke-opacity:1">unspent.cash</tspan></text>
    <circle
       style="opacity:1;mix-blend-mode:normal;fill:url(#radialGradient1763);fill-opacity:1;stroke:none;stroke-width:0.294069;stroke-linejoin:round;stroke-miterlimit:4;stroke-dasharray:none;stroke-dashoffset:7.35;stroke-opacity:1"
       id="path1747"
       cx="66.005043"
       cy="106.29319"
       r="32.267021" />
  </g>
</svg>
