<?xml version="1.0" encoding="UTF-8" standalone="no"?>
<svg
   xmlns:dc="http://purl.org/dc/elements/1.1/"
   xmlns:cc="http://creativecommons.org/ns#"
   xmlns:rdf="http://www.w3.org/1999/02/22-rdf-syntax-ns#"
   xmlns:svg="http://www.w3.org/2000/svg"
   xmlns="http://www.w3.org/2000/svg"
   xmlns:sodipodi="http://sodipodi.sourceforge.net/DTD/sodipodi-0.dtd"
   xmlns:inkscape="http://www.inkscape.org/namespaces/inkscape"
   width="400"
   height="400"
   version="1.1"
   viewBox="0 0 105.83 105.83"
   id="svg24"
   sodipodi:docname="03.svg"
   inkscape:version="1.0.2 (e86c870879, 2021-01-15)">
  <path
     id="rect2"
     style="fill:#ffffff;stroke-width:1"
     d="M 0.13327999,0 C 35.20776,0 70.282241,0 105.35672,0 c 0.31106,6.3986819 0.0444,13.036681 0.13328,19.527381 0,28.609779 0,57.219561 0,85.829339 -6.398682,0.31106 -13.036681,0.0444 -19.527381,0.13328 -28.609781,0 -57.219559,0 -85.82933901,0 C -0.17778451,99.091317 0.08891157,92.45332 0,85.96262 0,57.352838 0,28.74306 0,0.13327999 Z" />
  <g
     aria-label=":"
     id="text94-36-3"
     style="font-size:28.5869px;line-height:1.25;font-family:sans-serif;fill:#000000;stroke-width:0.714685"
     transform="matrix(0.5742718,0,0,0.5742718,19.302303,47.293881)">
    <path
       d="m 51.209944,57.977103 h 2.945233 v 3.545446 h -2.945233 z m 0,-11.23655 h 2.945233 v 3.545445 h -2.945233 z"
       style="stroke-width:0.714685"
       id="path2629-6" />
  </g>
  <sodipodi:namedview
     pagecolor="#ffffff"
     bordercolor="#666666"
     borderopacity="1"
     objecttolerance="10"
     gridtolerance="10"
     guidetolerance="10"
     inkscape:pageopacity="0"
     inkscape:pageshadow="2"
     inkscape:window-width="1751"
     inkscape:window-height="1092"
     id="namedview37"
     showgrid="false"
     inkscape:zoom="1.4094604"
     inkscape:cx="125.55291"
     inkscape:cy="268.2568"
     inkscape:window-x="0"
     inkscape:window-y="0"
     inkscape:window-maximized="0"
     inkscape:current-layer="svg24"
     inkscape:document-rotation="0" />
  <metadata
     id="metadata30">
    <rdf:RDF>
      <cc:Work
         rdf:about="">
        <dc:format>image/svg+xml</dc:format>
        <dc:type
           rdf:resource="http://purl.org/dc/dcmitype/StillImage" />
        <dc:title />
      </cc:Work>
    </rdf:RDF>
  </metadata>
  <defs
     id="defs28" />
  <g
     transform="matrix(0.21321463,0,0,0.21321463,12.885675,65.242468)"
     id="g16">
    <path
       d="m 65.419,0.36106 a 63.719,63.72 0 0 0 -63.72,63.72 63.719,63.72 0 0 0 63.72,63.719 63.719,63.72 0 0 0 63.719,-63.719 63.719,63.72 0 0 0 -63.719,-63.72 z m -34.705,28.607 18.962,0.06599 17.785,24.847 9.8729,-13.077 -6.6037,-0.78448 v -11.05 h 31.973 v 11.508 l -6.4077,1.1117 -18.177,22.296 19.158,23.343 6.6697,1.0464 v 11.443 h -18.635 l -19.093,-25.566 -10.331,13.862 5.6886,0.71916 v 10.985 h -31.516 v -11.443 l 6.6044,-1.0464 19.093,-23.016 -18.439,-22.623 -6.6044,-1.1117 z"
       fill="#ffb200"
       stroke="#000000"
       stroke-dasharray="0, 6.182"
       stroke-linejoin="bevel"
       stroke-miterlimit="4.1"
       stroke-opacity="0.25297"
       stroke-width="0.562"
       id="path14" />
  </g>
  <g
     aria-label=":"
     id="text94-36"
     style="font-size:28.5869px;line-height:1.25;font-family:sans-serif;fill:#000000;stroke-width:0.714685"
     transform="matrix(0.5742718,0,0,0.5742718,18.60028,-4.7358783)">
    <path
       d="m 51.209944,57.977103 h 2.945233 v 3.545446 h -2.945233 z m 0,-11.23655 h 2.945233 v 3.545445 h -2.945233 z"
       style="stroke-width:0.714685"
       id="path2629" />
  </g>
  <rect
     style="fill:#ffffff;fill-opacity:1;stroke:none;stroke-width:0.391608;stroke-dashoffset:7.35"
     id="rect884-6"
     width="14.108685"
     height="1.8833308"
     x="103.25244"
     y="6.2394676"
     transform="matrix(0.70710678,0.70710678,0.70710678,-0.70710678,0,0)"
     inkscape:transform-center-x="-0.41560554"
     inkscape:transform-center-y="1.4014227" />
  <rect
     style="fill:#8dc351;fill-opacity:1;stroke:none;stroke-width:0.784812;stroke-miterlimit:4;stroke-dasharray:none;stroke-dashoffset:7.35"
     id="rect2226"
     width="7.8094435"
     height="9.7195463"
     x="31.711411"
     y="22.498037" />
  <rect
     style="fill:#8dc351;fill-opacity:1;stroke-width:1.42214;stroke-linejoin:round;stroke-dashoffset:7.35"
     id="rect3960-5"
     width="21.092026"
     height="21.489084"
     x="16.694633"
     y="16.610373" />
  <g
     transform="matrix(8.8302066e-4,0,0,8.8302066e-4,15.824958,20.956305)"
     fill="#8dc351"
     id="g52-2-9">
    <path
       d="m 7525,15989 c -349,-23 -745,-74 -1074,-139 -1411,-279 -2741,-944 -3806,-1903 -103,-94 -479,-466 -575,-572 -245,-266 -540,-648 -754,-974 -84,-128 -216,-339 -216,-346 0,-2 -17,-32 -38,-66 -48,-80 -130,-233 -220,-414 C 359,10611 82,9566 10,8445 -3,8240 -3,7750 10,7545 113,5935 655,4458 1610,3185 c 239,-319 428,-535 744,-850 286,-286 436,-420 706,-632 C 4666,442 6732,-162 8765,35 c 1734,169 3354,891 4645,2071 632,577 1156,1241 1589,2014 64,113 231,450 301,605 345,767 574,1625 659,2470 32,311 41,496 41,810 0,808 -118,1588 -356,2359 -526,1697 -1613,3186 -3064,4197 -1216,848 -2616,1332 -4135,1429 -181,11 -740,11 -920,-1 z"
       id="path50-9-2" />
  </g>
  <g
     transform="matrix(0.0012864,0,0,0.0012864,12.041454,14.961059)"
     fill="#ffffff"
     id="g56-1-2">
    <path
       d="m 7751,13046 c -6,-17 -62,-222 -127,-456 -195,-713 -262,-951 -266,-956 -3,-2 -398,103 -879,234 -481,131 -875,238 -877,237 -3,-3 -112,-1041 -112,-1071 0,-17 8,-23 33,-28 75,-14 558,-147 627,-172 101,-38 181,-113 204,-193 28,-95 21,-155 -43,-390 -33,-119 -139,-504 -236,-856 -97,-352 -239,-867 -315,-1145 -76,-278 -193,-703 -260,-945 -67,-242 -142,-514 -166,-605 -25,-91 -57,-185 -72,-210 -44,-77 -110,-138 -190,-177 -67,-34 -84,-38 -171,-41 -134,-6 -233,16 -734,162 -81,23 -120,30 -122,22 -7,-20 -247,-901 -249,-910 0,-4 87,-33 194,-62 107,-30 499,-138 870,-241 371,-102 678,-189 682,-192 4,-3 -81,-323 -188,-711 -107,-388 -192,-710 -190,-715 2,-6 28,-17 57,-24 30,-8 222,-61 428,-117 206,-57 376,-103 377,-101 1,1 88,315 193,697 106,382 194,696 196,698 2,2 137,-35 302,-83 164,-48 318,-92 343,-100 35,-10 44,-17 42,-31 -2,-11 -87,-320 -188,-689 -101,-368 -184,-674 -184,-680 0,-9 858,-250 865,-243 2,2 91,322 198,711 107,389 196,710 199,712 2,3 42,-2 89,-10 416,-74 899,-94 1184,-51 672,104 1078,440 1283,1061 196,592 97,1085 -302,1499 l -73,76 h 118 c 828,0 1344,393 1564,1190 130,470 135,910 15,1273 -41,126 -137,313 -218,427 -145,205 -419,444 -699,612 -277,166 -754,378 -1083,483 -30,10 -58,20 -62,24 -4,3 71,290 166,636 96,347 185,671 198,721 l 25,91 -426,117 c -234,64 -431,116 -436,116 -6,0 -98,-318 -204,-707 -107,-390 -195,-709 -196,-710 -1,-2 -143,35 -316,81 -173,46 -329,87 -346,91 -18,3 -33,12 -33,18 0,11 16,68 259,952 71,259 128,471 126,473 -1,1 -196,56 -433,121 l -431,118 z m 442,-2762 c 928,-243 1429,-470 1733,-785 93,-98 132,-151 179,-252 54,-113 70,-186 69,-317 0,-211 -79,-419 -214,-563 -317,-339 -883,-384 -1824,-143 -226,58 -696,197 -696,207 0,4 117,433 260,953 143,520 260,948 260,951 0,10 22,5 233,-51 z M 7391,7495 c 657,-172 1015,-321 1295,-540 97,-76 161,-145 225,-243 60,-91 87,-161 107,-277 19,-113 7,-234 -39,-369 -102,-305 -310,-473 -660,-532 -82,-13 -140,-16 -298,-11 -227,6 -400,32 -681,103 -171,42 -609,170 -618,179 -4,4 126,484 431,1588 24,87 46,147 53,147 6,0 90,-20 185,-45 z"
       fill="#ffffff"
       id="path54-2-8" />
  </g>
  <path
     d="m 16.775597,33.765998 v 3.715215 -20.3457 z m 0.867146,4.778864 q -0.782209,0 -1.356501,-0.574295 -0.574257,-0.574292 -0.574257,-1.356501 V 18.002661 q 0,-0.782212 0.574257,-1.356502 0.574292,-0.574295 1.356501,-0.574295 h 18.607356 q 0.782209,0 1.3565,0.574295 0.574297,0.57429 0.574297,1.356502 v 4.705694 h -1.06365 v -4.705694 q 0,-0.379376 -0.243878,-0.623261 -0.243879,-0.243877 -0.62326,-0.243877 H 17.642752 q -0.379373,0 -0.623259,0.243877 -0.243879,0.243879 -0.243879,0.623261 v 18.611405 q 0,0.379376 0.243879,0.62326 0.243879,0.243879 0.623259,0.243879 h 18.607356 q 0.379375,0 0.62326,-0.243879 0.243878,-0.243879 0.243878,-0.62326 v -4.697557 h 1.06365 v 4.697557 q 0,0.782209 -0.574297,1.356501 -0.574291,0.574295 -1.3565,0.574295 z m 11.864585,-5.842479 q -0.878278,0 -1.518059,-0.626501 -0.639746,-0.626499 -0.639746,-1.517775 v -6.481909 q 0,-0.896559 0.636999,-1.52514 0.637032,-0.628577 1.508863,-0.628577 h 7.944763 q 0.91132,0 1.550258,0.6265 0.638901,0.626466 0.638901,1.517776 v 6.481906 q 0,0.896562 -0.636154,1.525142 -0.636153,0.628578 -1.541028,0.628578 z m 8.191185,-1.063648 q 0.352283,0 0.60973,-0.243878 0.25746,-0.243879 0.25746,-0.62326 v -6.918314 q 0,-0.352285 -0.25746,-0.609731 -0.257433,-0.257407 -0.60973,-0.257407 h -8.418197 q -0.352284,0 -0.609731,0.257407 -0.25746,0.257459 -0.25746,0.609731 v 6.918314 q 0,0.379373 0.25746,0.62326 0.25746,0.243878 0.609731,0.243878 z m -4.913542,-2.161118 q 0.904312,0 1.533668,-0.625373 0.629351,-0.625373 0.629351,-1.54994 0,-0.940349 -0.634743,-1.551774 -0.634745,-0.611423 -1.532433,-0.611423 -0.931543,0 -1.564983,0.609346 -0.63344,0.609344 -0.63344,1.549694 0,0.924568 0.633335,1.552017 0.633335,0.627453 1.569245,0.627453 z"
     id="path1628"
     style="stroke-width:0.0352283" />
  <path
     d="m 67.603811,68.598505 h 9.818633 v -3.400623 q 0,-2.080987 -1.431736,-3.517765 -1.431723,-1.43682 -3.477042,-1.43682 -2.045344,0 -3.477568,1.44049 -1.432287,1.440528 -1.432287,3.528777 z M 74.844813,87.35525 H 63.666055 q -0.882233,0 -1.522744,-0.640458 -0.640449,-0.64046 -0.640449,-1.51615 V 70.755113 q 0,-0.875652 0.640449,-1.51615 0.640511,-0.640458 1.522744,-0.640458 h 2.746125 v -3.404096 q 0,-2.596608 1.766658,-4.369698 1.76667,-1.773091 4.333964,-1.773091 2.567318,0 4.334301,1.774749 1.766984,1.77475 1.766984,4.383907 v 3.388229 h 2.746088 q 0.88227,0 1.522743,0.640458 0.640486,0.640498 0.640486,1.522741 v 2.51538 q -0.185285,-0.0078 -0.510584,-0.05466 -0.325287,-0.04705 -0.681109,-0.04705 v -2.413669 q 0,-0.425036 -0.273298,-0.698279 -0.273286,-0.273234 -0.698263,-0.273234 H 63.665992 q -0.425027,0 -0.698263,0.273234 -0.273298,0.273233 -0.273298,0.698279 v 14.430387 q 0,0.425037 0.273298,0.69828 0.273286,0.273234 0.698263,0.273234 H 74.05855 q 0.07192,0.303117 0.26345,0.618353 0.191838,0.315237 0.522688,0.573285 z m 7.119836,0.847076 q -2.558159,0 -4.358536,-1.800086 -1.800389,-1.80005 -1.800389,-4.343054 0,-2.543006 1.800101,-4.358568 1.800038,-1.815558 4.358222,-1.815558 2.558221,0 4.358586,1.814099 1.800364,1.814139 1.800364,4.34424 0,2.558159 -1.800064,4.358564 -1.800076,1.800363 -4.358284,1.800363 z m 2.73367,-2.576081 0.848589,-0.818225 -3.037593,-2.885159 v -4.534952 h -1.258429 v 4.939271 z m -22.0038,-6.727986 v 7.265354 -16.373429 z"
     id="path947"
     style="stroke-width:0.0394685" />
  <path
     d="m 79.309143,32.58782 q 0,-0.527797 0.36407,-0.896604 0.36407,-0.368831 0.891883,-0.368831 0.527784,0 0.89659,0.364064 0.368834,0.364085 0.368834,0.891882 0,0.527798 -0.36407,0.896605 -0.364069,0.36883 -0.891883,0.36883 -0.527781,0 -0.896588,-0.364063 -0.368836,-0.364085 -0.368836,-0.891883 z m -4.550945,-0.0044 q 0,-2.414055 1.698769,-4.112857 1.698799,-1.698778 4.112865,-1.698778 2.414066,0 4.112865,1.698778 1.698769,1.698802 1.698769,4.112857 0,1.846322 -0.987979,3.292518 -0.987976,1.446192 -2.724755,2.073188 v 10.752626 l -2.233004,2.233036 -3.305949,-3.533946 1.546797,-2.087707 -1.591486,-2.221853 1.385841,-1.933462 v -3.203107 q -1.609386,-0.569975 -2.66106,-2.001646 -1.051673,-1.431696 -1.051673,-3.369639 z m 0.89409,0 q 0,1.730059 1.096394,3.030992 1.096393,1.300908 2.616341,1.658668 v 4.211087 l -1.173486,1.613837 1.584773,2.244191 -1.53337,2.025127 2.228531,2.291111 1.30317,-1.303127 V 37.277499 q 1.470781,-0.326345 2.591756,-1.616187 1.120979,-1.289839 1.120979,-3.071999 0,-2.051113 -1.432598,-3.487245 -1.432566,-1.436132 -3.481372,-1.436132 -2.048834,0 -3.484976,1.433628 -1.436142,1.433628 -1.436142,3.483906 z"
     id="path1566"
     style="stroke-width:0.029058" />
  <path
     d="M 66.697253,19.721555 H 76.722105 V 16.24951 c 0,-1.416462 -0.487268,-2.613679 -1.461806,-3.591648 -0.974529,-0.977997 -2.157886,-1.466996 -3.55007,-1.466996 -1.392201,0 -2.575736,0.490247 -3.550607,1.470743 -0.974913,0.980523 -1.462369,2.181486 -1.462369,3.602892 z m 7.393084,19.150688 H 62.676794 c -0.600509,0 -1.11875,-0.217969 -1.554725,-0.653909 -0.435934,-0.435941 -0.653901,-0.951938 -0.653901,-1.547993 V 21.923458 c 0,-0.596028 0.217967,-1.112027 0.653901,-1.547993 0.435975,-0.43594 0.954216,-0.65391 1.554725,-0.65391 h 2.803801 v -3.475591 c 0,-1.767429 0.601254,-3.254587 1.803763,-4.461473 1.202517,-1.206888 2.677513,-1.810331 4.424988,-1.810331 1.747493,0 3.222605,0.604008 4.425334,1.812024 1.20273,1.208016 1.804096,2.700009 1.804096,4.47598 v 3.459391 h 2.803763 c 0.600534,0 1.118775,0.21797 1.554725,0.65391 0.435959,0.435966 0.653937,0.954208 0.653937,1.554722 v 2.56821 c -0.126117,-0.0052 -0.299887,-0.02388 -0.521307,-0.0558 -0.221413,-0.03202 -0.453218,-0.04804 -0.695414,-0.04804 v -2.464363 c 0,-0.289309 -0.09301,-0.526958 -0.279039,-0.712945 -0.186016,-0.185982 -0.423659,-0.278973 -0.712928,-0.278973 H 62.67673 c -0.289303,0 -0.526946,0.093 -0.712929,0.278973 -0.186025,0.185981 -0.279038,0.42363 -0.279038,0.712945 v 14.733465 c 0,0.289309 0.09301,0.526957 0.279038,0.712945 0.186017,0.185982 0.42366,0.278973 0.712929,0.278973 h 10.61083 c 0.04896,0.206322 0.138617,0.41677 0.268983,0.63134 0.130579,0.214572 0.308467,0.40968 0.533666,0.585325 z M 61.684853,30.237632 v 7.417947 -16.717316 z"
     id="path947-3"
     style="stroke-width:0.0402975"
     sodipodi:nodetypes="ccscsssccscsscscssssscssscccsssscsssscccccccc" />
</svg>
