<svg width="211" height="14" viewBox="0 0 211 14" fill="none" xmlns="http://www.w3.org/2000/svg">
<path d="M13.3906 0.236924C13.4192 0.236924 13.4336 0.280001 13.4336 0.366154C13.4336 0.452308 13.4192 0.495385 13.3906 0.495385C12.9464 0.495385 12.4019 0.775385 11.7571 1.33539C11.1123 1.88103 10.5391 2.57026 10.0376 3.40308L7.80222 7.15077V11.9538C7.80222 12.399 7.83804 12.7221 7.90969 12.9231C7.98134 13.1241 8.11746 13.2605 8.31807 13.3323C8.53301 13.4041 8.86974 13.44 9.32828 13.44C9.37126 13.44 9.39276 13.4831 9.39276 13.5692C9.39276 13.6554 9.37126 13.6985 9.32828 13.6985C8.85541 13.6985 8.48286 13.6913 8.2106 13.6769L6.59857 13.6554L5.00804 13.6769C4.72145 13.6913 4.33457 13.6985 3.84738 13.6985C3.81872 13.6985 3.80439 13.6554 3.80439 13.5692C3.80439 13.4831 3.81872 13.44 3.84738 13.44C4.30591 13.44 4.64264 13.4041 4.85758 13.3323C5.07252 13.2605 5.21581 13.1241 5.28746 12.9231C5.37343 12.7077 5.41642 12.3846 5.41642 11.9538V7.60308L2.27833 2.71385C1.74816 1.88103 1.30395 1.30667 0.945724 0.990769C0.601824 0.660513 0.308077 0.495385 0.0644812 0.495385C0.0214937 0.495385 0 0.452308 0 0.366154C0 0.280001 0.0214937 0.236924 0.0644812 0.236924L0.730787 0.258462C1.04603 0.28718 1.26813 0.301538 1.39709 0.301538C1.89861 0.301538 2.62223 0.28718 3.56796 0.258462L4.98654 0.236924C5.0152 0.236924 5.02953 0.280001 5.02953 0.366154C5.02953 0.452308 5.0152 0.495385 4.98654 0.495385C4.74295 0.495385 4.5495 0.552821 4.40621 0.667693C4.27725 0.782565 4.21277 0.933334 4.21277 1.12C4.21277 1.34974 4.31307 1.62256 4.51368 1.93846L7.45832 6.59077L9.43574 3.20923C9.82263 2.56308 10.0161 2.01026 10.0161 1.55077C10.0161 1.20615 9.90861 0.947693 9.69367 0.775385C9.49306 0.588718 9.19931 0.495385 8.81243 0.495385C8.76944 0.495385 8.74794 0.452308 8.74794 0.366154C8.74794 0.280001 8.76944 0.236924 8.81243 0.236924L9.95159 0.258462C10.6107 0.28718 11.1982 0.301538 11.7141 0.301538C11.9577 0.301538 12.2514 0.28718 12.5953 0.258462L13.3906 0.236924Z" fill="#4F616A"/>
<path d="M30.1214 13.44C30.1931 13.44 30.2289 13.4831 30.2289 13.5692C30.2289 13.6554 30.1931 13.6985 30.1214 13.6985C29.8349 13.6985 29.3906 13.6841 28.7888 13.6554C28.1583 13.6267 27.707 13.6123 27.4347 13.6123C27.0765 13.6123 26.6395 13.6267 26.1236 13.6554C25.6364 13.6841 25.2495 13.6985 24.9629 13.6985C24.9056 13.6985 24.877 13.6554 24.877 13.5692C24.877 13.4831 24.9056 13.44 24.9629 13.44C25.3355 13.44 25.6006 13.4041 25.7582 13.3323C25.9302 13.2462 26.0161 13.1026 26.0161 12.9015C26.0161 12.6574 25.8728 12.2482 25.5863 11.6738L23.3509 7.25846H19.525L17.999 10.64C17.8127 11.0564 17.7196 11.4441 17.7196 11.8031C17.7196 12.32 17.8987 12.7221 18.2569 13.0092C18.6295 13.2964 19.1238 13.44 19.74 13.44C19.8116 13.44 19.8474 13.4831 19.8474 13.5692C19.8474 13.6554 19.8116 13.6985 19.74 13.6985C19.482 13.6985 19.1095 13.6841 18.6223 13.6554C18.0778 13.6267 17.6049 13.6123 17.2037 13.6123C16.8168 13.6123 16.3511 13.6267 15.8066 13.6554C15.3194 13.6841 14.9254 13.6985 14.6245 13.6985C14.5671 13.6985 14.5385 13.6554 14.5385 13.5692C14.5385 13.4831 14.5671 13.44 14.6245 13.44C15.0257 13.44 15.3624 13.361 15.6347 13.2031C15.9069 13.0308 16.1792 12.7364 16.4514 12.32C16.7237 11.8892 17.0461 11.2574 17.4186 10.4246L22.0828 0.15077C22.1114 0.107693 22.1759 0.086154 22.2762 0.086154C22.3909 0.086154 22.4553 0.107693 22.4697 0.15077L27.8431 10.7477C28.3446 11.7672 28.7602 12.4708 29.0897 12.8585C29.4193 13.2462 29.7632 13.44 30.1214 13.44ZM19.8045 6.65538H23.05L21.3305 3.25231L19.8045 6.65538Z" fill="#4F616A"/>
<path d="M47.8929 13.44C47.9215 13.44 47.9359 13.4831 47.9359 13.5692C47.9359 13.6554 47.9215 13.6985 47.8929 13.6985H44.067C43.7518 13.6985 43.1643 13.1097 42.3045 11.9323C41.4448 10.7405 40.4059 9.08205 39.1879 6.95692C39.0733 6.97128 38.9085 6.97846 38.6936 6.97846C38.1347 6.97846 37.7407 6.97128 37.5114 6.95692V11.9538C37.5114 12.399 37.5472 12.7221 37.6189 12.9231C37.6905 13.1241 37.8267 13.2605 38.0273 13.3323C38.2422 13.4041 38.5789 13.44 39.0375 13.44C39.0661 13.44 39.0805 13.4831 39.0805 13.5692C39.0805 13.6554 39.0661 13.6985 39.0375 13.6985C38.5646 13.6985 38.192 13.6913 37.9198 13.6769L36.2863 13.6554L34.7172 13.6769C34.4306 13.6913 34.0438 13.6985 33.5566 13.6985C33.5136 13.6985 33.4921 13.6554 33.4921 13.5692C33.4921 13.4831 33.5136 13.44 33.5566 13.44C34.0151 13.44 34.3447 13.4041 34.5453 13.3323C34.7602 13.2605 34.9035 13.1241 34.9752 12.9231C35.0611 12.7077 35.1041 12.3846 35.1041 11.9538V1.98154C35.1041 1.55077 35.0683 1.23487 34.9966 1.03385C34.925 0.83282 34.7817 0.69641 34.5668 0.624615C34.3518 0.538461 34.0223 0.495385 33.5781 0.495385C33.5494 0.495385 33.5351 0.452308 33.5351 0.366154C33.5351 0.280001 33.5494 0.236924 33.5781 0.236924L34.7172 0.258462C35.3764 0.28718 35.8994 0.301538 36.2863 0.301538C36.7018 0.301538 37.1604 0.28 37.6619 0.236924C37.8195 0.222564 38.0201 0.208205 38.2637 0.193846C38.5216 0.179487 38.8225 0.172308 39.1664 0.172308C40.4847 0.172308 41.5021 0.41641 42.2185 0.904615C42.9493 1.37846 43.3147 2.04615 43.3147 2.90769C43.3147 3.56821 43.1141 4.2 42.7129 4.80308C42.3117 5.40615 41.7887 5.89436 41.1439 6.26769C42.2902 8.07692 43.2502 9.49128 44.024 10.5108C44.8121 11.5303 45.5071 12.2769 46.1089 12.7508C46.7251 13.2103 47.3197 13.44 47.8929 13.44ZM37.5114 6.33231C37.8553 6.38974 38.2709 6.41846 38.758 6.41846C39.2739 6.41846 39.6823 6.33949 39.9832 6.18154C40.2841 6.02359 40.499 5.75077 40.628 5.36308C40.7713 4.97538 40.8429 4.42974 40.8429 3.72615C40.8429 2.54872 40.671 1.73744 40.3271 1.29231C39.9832 0.847179 39.4888 0.624615 38.844 0.624615C38.3568 0.624615 38.0129 0.732308 37.8123 0.947693C37.6117 1.16308 37.5114 1.52205 37.5114 2.02461V6.33231Z" fill="#4F616A"/>
<path d="M57.1216 13.9569C55.789 13.9569 54.5996 13.6482 53.5536 13.0308C52.5219 12.399 51.7195 11.5518 51.1463 10.4892C50.5875 9.41231 50.3081 8.24205 50.3081 6.97846C50.3081 5.49949 50.6806 4.2359 51.4257 3.18769C52.1709 2.12513 53.1237 1.32821 54.2844 0.796923C55.4594 0.265641 56.6559 0 57.8739 0C59.2351 0 60.4316 0.323077 61.4633 0.969231C62.495 1.60103 63.2831 2.44103 63.8276 3.48923C64.3865 4.53744 64.6659 5.65026 64.6659 6.82769C64.6659 8.13436 64.322 9.33333 63.6342 10.4246C62.9464 11.5159 62.0221 12.3774 60.8615 13.0092C59.7152 13.641 58.4685 13.9569 57.1216 13.9569ZM57.8309 13.4185C58.6333 13.4185 59.3498 13.1887 59.9802 12.7292C60.6251 12.2554 61.1266 11.5733 61.4848 10.6831C61.843 9.77846 62.0221 8.70154 62.0221 7.45231C62.0221 6.13128 61.8215 4.95385 61.4203 3.92C61.0191 2.87179 60.4388 2.05333 59.6793 1.46462C58.9199 0.875898 58.0315 0.581539 57.0141 0.581539C55.7102 0.581539 54.7071 1.07692 54.005 2.06769C53.3029 3.0441 52.9518 4.41538 52.9518 6.18154C52.9518 7.57436 53.1596 8.82359 53.5751 9.92923C54.005 11.0205 54.5853 11.8749 55.3161 12.4923C56.0612 13.1097 56.8995 13.4185 57.8309 13.4185Z" fill="#4F616A"/>
<path d="M72.0302 2.41231C72.0302 2.92923 72.1591 3.38872 72.4171 3.79077C72.6893 4.19282 73.0189 4.54462 73.4058 4.84615C73.7926 5.14769 74.3157 5.51385 74.9748 5.94462C75.6913 6.4041 76.2644 6.80615 76.6943 7.15077C77.1242 7.49538 77.4896 7.91897 77.7905 8.42154C78.0914 8.90974 78.2419 9.47692 78.2419 10.1231C78.2419 10.8697 78.0412 11.5374 77.64 12.1262C77.2388 12.7005 76.68 13.1528 75.9635 13.4831C75.2614 13.799 74.4733 13.9569 73.5992 13.9569C72.9544 13.9569 72.2809 13.8708 71.5788 13.6985C70.8767 13.5118 70.4038 13.3108 70.1602 13.0954C70.0886 13.0379 70.0312 12.9877 69.9883 12.9446C69.9596 12.8872 69.9453 12.801 69.9453 12.6862L69.8808 9.26154V9.24C69.8808 9.18256 69.9166 9.15385 69.9883 9.15385C70.0599 9.13949 70.1029 9.16103 70.1172 9.21846C70.5471 10.0944 70.9197 10.8051 71.2349 11.3508C71.5645 11.8964 71.9728 12.3774 72.46 12.7938C72.9616 13.2103 73.5276 13.4185 74.158 13.4185C74.7312 13.4185 75.2041 13.2677 75.5766 12.9662C75.9492 12.6503 76.1355 12.119 76.1355 11.3723C76.1355 10.7405 75.9922 10.1877 75.7056 9.71385C75.4333 9.24 75.0966 8.83795 74.6954 8.50769C74.2942 8.17744 73.7425 7.78256 73.0404 7.32308C72.3526 6.87795 71.8152 6.49744 71.4283 6.18154C71.0558 5.86564 70.7334 5.48513 70.4611 5.04C70.1889 4.59487 70.0527 4.07077 70.0527 3.46769C70.0527 2.70667 70.2677 2.06769 70.6976 1.55077C71.1418 1.01949 71.7078 0.631795 72.3956 0.387692C73.0834 0.129231 73.807 0 74.5664 0C75.0679 0 75.5766 0.0502566 76.0925 0.15077C76.6083 0.236923 77.0239 0.344616 77.3391 0.473846C77.4681 0.531282 77.5541 0.595898 77.597 0.667693C77.64 0.725129 77.6615 0.804103 77.6615 0.904615V4.07077C77.6615 4.11385 77.6257 4.14974 77.554 4.17846C77.4824 4.19282 77.4394 4.17846 77.4251 4.13538L77.2531 3.72615C76.8949 2.82154 76.4722 2.05333 75.985 1.42154C75.5121 0.789744 74.8458 0.473846 73.9861 0.473846C73.4129 0.473846 72.9401 0.638975 72.5675 0.969231C72.2093 1.29949 72.0302 1.78051 72.0302 2.41231Z" fill="#4F616A"/>
<path d="M86.5094 11.8677C86.5094 12.241 86.538 12.5138 86.5954 12.6862C86.6527 12.8441 86.7601 12.9518 86.9178 13.0092C87.0897 13.0667 87.362 13.0954 87.7345 13.0954H88.4653C89.583 13.0954 90.5502 12.801 91.367 12.2123C92.1837 11.6092 92.7282 10.7979 93.0005 9.77846C93.0005 9.74974 93.0291 9.73538 93.0865 9.73538C93.1151 9.73538 93.1438 9.74974 93.1724 9.77846C93.2154 9.79282 93.2369 9.80718 93.2369 9.82154C93.1079 11.2431 93.0435 12.4277 93.0435 13.3754C93.0435 13.4903 93.0148 13.5764 92.9575 13.6338C92.9145 13.6769 92.8357 13.6985 92.7211 13.6985H82.576C82.5474 13.6985 82.533 13.6554 82.533 13.5692C82.533 13.4831 82.5474 13.44 82.576 13.44C83.0346 13.44 83.3641 13.4041 83.5647 13.3323C83.7797 13.2605 83.923 13.1241 83.9946 12.9231C84.0806 12.7077 84.1236 12.3846 84.1236 11.9538V1.98154C84.1236 1.55077 84.0806 1.23487 83.9946 1.03385C83.923 0.83282 83.7797 0.69641 83.5647 0.624615C83.3498 0.538461 83.0202 0.495385 82.576 0.495385C82.5474 0.495385 82.533 0.452308 82.533 0.366154C82.533 0.280001 82.5474 0.236924 82.576 0.236924L83.6722 0.258462C84.3313 0.28718 84.8759 0.301538 85.3057 0.301538C85.7356 0.301538 86.2801 0.28718 86.9392 0.258462L88.0354 0.236924C88.0784 0.236924 88.0999 0.280001 88.0999 0.366154C88.0999 0.452308 88.0784 0.495385 88.0354 0.495385C87.5912 0.495385 87.2617 0.538461 87.0467 0.624615C86.8318 0.69641 86.6885 0.84 86.6168 1.05539C86.5452 1.25641 86.5094 1.57231 86.5094 2.00308V11.8677Z" fill="#4F616A"/>
<path d="M111.634 13.44C111.706 13.44 111.741 13.4831 111.741 13.5692C111.741 13.6554 111.706 13.6985 111.634 13.6985C111.347 13.6985 110.903 13.6841 110.301 13.6554C109.671 13.6267 109.219 13.6123 108.947 13.6123C108.589 13.6123 108.152 13.6267 107.636 13.6554C107.149 13.6841 106.762 13.6985 106.475 13.6985C106.418 13.6985 106.389 13.6554 106.389 13.5692C106.389 13.4831 106.418 13.44 106.475 13.44C106.848 13.44 107.113 13.4041 107.271 13.3323C107.443 13.2462 107.529 13.1026 107.529 12.9015C107.529 12.6574 107.385 12.2482 107.099 11.6738L104.863 7.25846H101.037L99.5114 10.64C99.3251 11.0564 99.232 11.4441 99.232 11.8031C99.232 12.32 99.4111 12.7221 99.7693 13.0092C100.142 13.2964 100.636 13.44 101.252 13.44C101.324 13.44 101.36 13.4831 101.36 13.5692C101.36 13.6554 101.324 13.6985 101.252 13.6985C100.994 13.6985 100.622 13.6841 100.135 13.6554C99.5902 13.6267 99.1173 13.6123 98.7161 13.6123C98.3292 13.6123 97.8635 13.6267 97.319 13.6554C96.8318 13.6841 96.4378 13.6985 96.1369 13.6985C96.0796 13.6985 96.0509 13.6554 96.0509 13.5692C96.0509 13.4831 96.0796 13.44 96.1369 13.44C96.5381 13.44 96.8748 13.361 97.1471 13.2031C97.4193 13.0308 97.6916 12.7364 97.9639 12.32C98.2361 11.8892 98.5585 11.2574 98.9311 10.4246L103.595 0.15077C103.624 0.107693 103.688 0.086154 103.789 0.086154C103.903 0.086154 103.968 0.107693 103.982 0.15077L109.356 10.7477C109.857 11.7672 110.273 12.4708 110.602 12.8585C110.932 13.2462 111.276 13.44 111.634 13.44ZM101.317 6.65538H104.562L102.843 3.25231L101.317 6.65538Z" fill="#4F616A"/>
<path d="M126.592 0.236924C126.635 0.236924 126.656 0.280001 126.656 0.366154C126.656 0.452308 126.635 0.495385 126.592 0.495385C126.076 0.495385 125.582 0.725128 125.109 1.18462C124.636 1.6441 124.256 2.26154 123.97 3.03692L119.993 13.6769C119.979 13.7344 119.9 13.7631 119.757 13.7631C119.614 13.7631 119.535 13.7344 119.521 13.6769L114.04 2.02461C113.782 1.50769 113.524 1.12718 113.266 0.883077C113.008 0.624615 112.721 0.495385 112.406 0.495385C112.363 0.495385 112.342 0.452308 112.342 0.366154C112.342 0.280001 112.363 0.236924 112.406 0.236924C112.621 0.236924 112.772 0.244103 112.857 0.258462C113.144 0.28718 113.517 0.301538 113.975 0.301538C115.207 0.301538 116.253 0.28718 117.113 0.258462C117.343 0.244103 117.629 0.236924 117.973 0.236924C118.016 0.236924 118.037 0.280001 118.037 0.366154C118.037 0.452308 118.016 0.495385 117.973 0.495385C117.543 0.495385 117.206 0.588718 116.963 0.775385C116.734 0.947693 116.619 1.19898 116.619 1.52923C116.619 1.77333 116.698 2.06769 116.855 2.41231L120.574 10.36L123.368 2.97231C123.511 2.57026 123.583 2.22564 123.583 1.93846C123.583 1.49333 123.447 1.14154 123.174 0.883077C122.917 0.624615 122.537 0.495385 122.035 0.495385C121.992 0.495385 121.971 0.452308 121.971 0.366154C121.971 0.280001 121.992 0.236924 122.035 0.236924L123.089 0.258462C123.69 0.28718 124.228 0.301538 124.701 0.301538C124.973 0.301538 125.31 0.28718 125.711 0.258462L126.592 0.236924Z" fill="#4F616A"/>
<path d="M133.645 11.8677C133.645 12.241 133.674 12.5138 133.731 12.6862C133.789 12.8441 133.896 12.9518 134.054 13.0092C134.226 13.0667 134.498 13.0954 134.87 13.0954H135.601C136.719 13.0954 137.686 12.801 138.503 12.2123C139.32 11.6092 139.864 10.7979 140.136 9.77846C140.136 9.74974 140.165 9.73538 140.222 9.73538C140.251 9.73538 140.28 9.74974 140.308 9.77846C140.351 9.79282 140.373 9.80718 140.373 9.82154C140.244 11.2431 140.179 12.4277 140.179 13.3754C140.179 13.4903 140.151 13.5764 140.093 13.6338C140.05 13.6769 139.972 13.6985 139.857 13.6985H129.712C129.683 13.6985 129.669 13.6554 129.669 13.5692C129.669 13.4831 129.683 13.44 129.712 13.44C130.17 13.44 130.5 13.4041 130.701 13.3323C130.916 13.2605 131.059 13.1241 131.131 12.9231C131.216 12.7077 131.259 12.3846 131.259 11.9538V1.98154C131.259 1.55077 131.216 1.23487 131.131 1.03385C131.059 0.83282 130.916 0.69641 130.701 0.624615C130.486 0.538461 130.156 0.495385 129.712 0.495385C129.683 0.495385 129.669 0.452308 129.669 0.366154C129.669 0.280001 129.683 0.236924 129.712 0.236924L130.808 0.258462C131.467 0.28718 132.012 0.301538 132.442 0.301538C132.872 0.301538 133.416 0.28718 134.075 0.258462L135.171 0.236924C135.214 0.236924 135.236 0.280001 135.236 0.366154C135.236 0.452308 135.214 0.495385 135.171 0.495385C134.727 0.495385 134.398 0.538461 134.183 0.624615C133.968 0.69641 133.824 0.84 133.753 1.05539C133.681 1.25641 133.645 1.57231 133.645 2.00308V11.8677Z" fill="#4F616A"/>
<path d="M145.616 13.9354C145.214 13.9354 144.892 13.8205 144.648 13.5908C144.419 13.3467 144.304 13.0236 144.304 12.6215C144.304 12.2482 144.419 11.9467 144.648 11.7169C144.892 11.4872 145.214 11.3723 145.616 11.3723C146.017 11.3723 146.325 11.4872 146.54 11.7169C146.769 11.9323 146.884 12.2338 146.884 12.6215C146.884 13.0379 146.769 13.361 146.54 13.5908C146.325 13.8205 146.017 13.9354 145.616 13.9354Z" fill="#4F616A"/>
<path d="M159.437 0C160.067 0 160.726 0.057436 161.414 0.172308C162.102 0.27282 162.639 0.409231 163.026 0.581539C163.155 0.624616 163.234 0.682052 163.263 0.753847C163.306 0.811283 163.341 0.918975 163.37 1.07692L163.628 4.07077C163.628 4.11385 163.592 4.14256 163.521 4.15692C163.449 4.17128 163.406 4.14974 163.392 4.09231C162.904 2.95795 162.252 2.08205 161.436 1.46462C160.619 0.84718 159.673 0.538462 158.598 0.538462C157.18 0.538462 156.084 1.06256 155.31 2.11077C154.536 3.15897 154.149 4.56615 154.149 6.33231C154.149 7.65333 154.357 8.85949 154.773 9.95077C155.202 11.0421 155.797 11.9108 156.557 12.5569C157.33 13.1887 158.204 13.5046 159.179 13.5046C160.096 13.5046 160.913 13.2031 161.629 12.6C162.36 11.9826 163.012 11.0492 163.585 9.8C163.599 9.74256 163.642 9.72103 163.714 9.73538C163.8 9.74974 163.843 9.77846 163.843 9.82154L163.521 12.7508C163.492 12.9231 163.456 13.0379 163.413 13.0954C163.384 13.1385 163.306 13.1887 163.177 13.2462C161.901 13.72 160.59 13.9569 159.243 13.9569C157.495 13.9569 156.034 13.6123 154.859 12.9231C153.684 12.2195 152.817 11.3364 152.258 10.2738C151.713 9.19692 151.441 8.07692 151.441 6.91385C151.441 5.54974 151.806 4.34359 152.537 3.29538C153.282 2.24718 154.264 1.4359 155.482 0.861539C156.714 0.28718 158.032 0 159.437 0Z" fill="#4F616A"/>
<path d="M171.923 11.8677C171.923 12.241 171.952 12.5138 172.009 12.6862C172.067 12.8441 172.174 12.9518 172.332 13.0092C172.504 13.0667 172.776 13.0954 173.149 13.0954H173.879C174.997 13.0954 175.964 12.801 176.781 12.2123C177.598 11.6092 178.142 10.7979 178.415 9.77846C178.415 9.74974 178.443 9.73538 178.5 9.73538C178.529 9.73538 178.558 9.74974 178.586 9.77846C178.629 9.79282 178.651 9.80718 178.651 9.82154C178.522 11.2431 178.458 12.4277 178.458 13.3754C178.458 13.4903 178.429 13.5764 178.372 13.6338C178.329 13.6769 178.25 13.6985 178.135 13.6985H167.99C167.961 13.6985 167.947 13.6554 167.947 13.5692C167.947 13.4831 167.961 13.44 167.99 13.44C168.449 13.44 168.778 13.4041 168.979 13.3323C169.194 13.2605 169.337 13.1241 169.409 12.9231C169.495 12.7077 169.538 12.3846 169.538 11.9538V1.98154C169.538 1.55077 169.495 1.23487 169.409 1.03385C169.337 0.83282 169.194 0.69641 168.979 0.624615C168.764 0.538461 168.434 0.495385 167.99 0.495385C167.961 0.495385 167.947 0.452308 167.947 0.366154C167.947 0.280001 167.961 0.236924 167.99 0.236924L169.086 0.258462C169.745 0.28718 170.29 0.301538 170.72 0.301538C171.15 0.301538 171.694 0.28718 172.353 0.258462L173.449 0.236924C173.492 0.236924 173.514 0.280001 173.514 0.366154C173.514 0.452308 173.492 0.495385 173.449 0.495385C173.005 0.495385 172.676 0.538461 172.461 0.624615C172.246 0.69641 172.103 0.84 172.031 1.05539C171.959 1.25641 171.923 1.57231 171.923 2.00308V11.8677Z" fill="#4F616A"/>
<path d="M193.91 2.99385C193.91 2.21846 193.731 1.60821 193.372 1.16308C193.029 0.717949 192.541 0.495385 191.911 0.495385C191.882 0.495385 191.868 0.452308 191.868 0.366154C191.868 0.280001 191.882 0.236924 191.911 0.236924L192.943 0.258462C193.487 0.28718 193.924 0.301538 194.254 0.301538C194.526 0.301538 194.92 0.28718 195.436 0.258462L196.425 0.236924C196.453 0.236924 196.468 0.280001 196.468 0.366154C196.468 0.452308 196.453 0.495385 196.425 0.495385C195.866 0.495385 195.429 0.717949 195.113 1.16308C194.798 1.60821 194.641 2.21846 194.641 2.99385V8.98154C194.641 9.98667 194.418 10.8697 193.974 11.6308C193.53 12.3918 192.9 12.9805 192.083 13.3969C191.28 13.799 190.349 14 189.289 14C188.228 14 187.29 13.799 186.473 13.3969C185.656 12.9949 185.011 12.4133 184.539 11.6523C184.08 10.8769 183.851 9.97231 183.851 8.93846V1.98154C183.851 1.55077 183.808 1.23487 183.722 1.03385C183.65 0.83282 183.507 0.69641 183.292 0.624615C183.091 0.538461 182.769 0.495385 182.325 0.495385C182.282 0.495385 182.26 0.452308 182.26 0.366154C182.26 0.280001 182.282 0.236924 182.325 0.236924L183.464 0.258462C184.123 0.28718 184.646 0.301538 185.033 0.301538C185.463 0.301538 186.007 0.28718 186.666 0.258462L187.763 0.236924C187.806 0.236924 187.827 0.280001 187.827 0.366154C187.827 0.452308 187.806 0.495385 187.763 0.495385C187.318 0.495385 186.989 0.538461 186.774 0.624615C186.573 0.710769 186.43 0.861539 186.344 1.07692C186.272 1.27795 186.237 1.59385 186.237 2.02461V8.18462C186.237 9.89333 186.573 11.1569 187.247 11.9754C187.92 12.7938 188.873 13.2031 190.105 13.2031C191.295 13.2031 192.226 12.8441 192.9 12.1262C193.573 11.3938 193.91 10.3528 193.91 9.00308V2.99385Z" fill="#4F616A"/>
<path d="M207.067 6.13846C208.27 6.28205 209.223 6.6841 209.925 7.34461C210.642 8.00513 211 8.82359 211 9.8C211 10.5467 210.785 11.2215 210.355 11.8246C209.925 12.4277 209.331 12.9087 208.571 13.2677C207.812 13.6123 206.966 13.7846 206.035 13.7846C205.634 13.7846 205.175 13.7631 204.659 13.72C204.459 13.7056 204.208 13.6913 203.907 13.6769C203.62 13.6626 203.298 13.6554 202.94 13.6554L201.371 13.6769C201.084 13.6913 200.697 13.6985 200.21 13.6985C200.167 13.6985 200.146 13.6554 200.146 13.5692C200.146 13.4831 200.167 13.44 200.21 13.44C200.626 13.44 200.941 13.4041 201.156 13.3323C201.371 13.2462 201.521 13.1026 201.607 12.9015C201.708 12.6862 201.758 12.3703 201.758 11.9538V1.98154C201.758 1.37846 201.657 0.98359 201.457 0.796923C201.256 0.595897 200.848 0.495385 200.232 0.495385C200.203 0.495385 200.189 0.452308 200.189 0.366154C200.189 0.280001 200.203 0.236924 200.232 0.236924L201.371 0.258462C202.03 0.28718 202.553 0.301538 202.94 0.301538C203.341 0.301538 203.757 0.28 204.186 0.236924C204.33 0.222564 204.545 0.208205 204.831 0.193846C205.118 0.179487 205.369 0.172308 205.584 0.172308C206.888 0.172308 207.898 0.409231 208.614 0.883077C209.331 1.35692 209.689 2.04615 209.689 2.95077C209.689 3.64 209.46 4.26462 209.001 4.82462C208.557 5.38462 207.912 5.82256 207.067 6.13846ZM205.261 0.646154C204.846 0.646154 204.559 0.746667 204.401 0.947693C204.244 1.13436 204.165 1.49333 204.165 2.02461V6.11692L205.025 6.13846C205.77 6.13846 206.343 5.85846 206.744 5.29846C207.145 4.73846 207.346 4.02051 207.346 3.14462C207.346 2.32615 207.167 1.70872 206.809 1.29231C206.451 0.861539 205.935 0.646154 205.261 0.646154ZM205.67 13.2462C207.547 13.2462 208.485 12.2697 208.485 10.3169C208.485 9.21128 208.22 8.33539 207.69 7.68923C207.16 7.04308 206.357 6.72 205.283 6.72C204.867 6.72 204.495 6.73436 204.165 6.76308V11.9538C204.165 12.4277 204.258 12.7651 204.444 12.9662C204.631 13.1528 205.039 13.2462 205.67 13.2462Z" fill="#4F616A"/>
</svg>
