<svg width="121" height="67" viewBox="0 0 121 67" fill="none" xmlns="http://www.w3.org/2000/svg">
<g clip-path="url(#clip0_3341_69183)">
<path d="M73.2934 38.2671V22.2044H44.8369V38.2671C44.8369 39.0939 44.8369 40.1569 44.9565 41.338L51.7717 37.0861L59.0652 32.4798L66.3587 37.0861L73.1739 41.338L73.2934 38.2671Z" fill="white"/>
<path d="M44.8369 5.43299C44.1195 4.37002 43.4021 3.54326 42.5652 3.07082C41.7282 2.59839 40.8913 2.59839 40.413 2.59839H40.2934C40.0543 2.59839 39.3369 2.83461 38.8587 3.42515C38.6195 3.66136 38.6195 4.01569 38.6195 4.37002C38.7391 4.96056 39.2173 5.5511 40.1739 6.02353C40.8913 6.37786 41.3695 6.73218 41.7282 7.08651C42.0869 7.44084 42.2065 7.67705 42.2065 8.03138C42.2065 8.14949 42.2065 8.26759 42.0869 8.3857C41.9673 8.50381 41.8478 8.62192 41.7282 8.74003C41.4891 8.85814 41.25 8.97625 40.8913 9.09435H40.7717C40.6521 9.09435 40.6521 9.09435 40.5326 9.09435C40.2934 9.09435 40.0543 9.09435 39.8152 8.97625C39.4565 8.85814 38.8587 8.50381 38.2608 7.91327C38.1413 7.79516 37.9021 7.55894 37.5434 7.08651C37.3043 6.85029 37.1847 6.61408 36.9456 6.37786C36.7065 6.02353 36.4673 5.66921 36.1087 5.43299C36.1087 5.43299 36.1087 5.31488 35.9891 5.31488V5.19677C35.5108 4.72434 35.1521 4.25191 34.6739 3.89758C33.7173 3.18893 32.8804 2.95271 31.9239 3.07082H31.8043C31.5652 3.07082 31.326 3.18893 31.0869 3.30704C30.8478 3.42515 30.6087 3.54326 30.4891 3.77947C30.3695 3.89758 30.25 4.01569 30.25 4.25191C30.0108 4.48812 29.8913 4.72434 30.0108 4.84245C30.1304 5.43299 30.4891 5.78732 30.8478 6.02353C31.2065 6.25975 31.5652 6.49597 31.9239 6.61408H32.0434C32.7608 7.08651 33 7.55894 33 7.79516C33 8.03138 33 8.26759 32.7608 8.50381C32.6413 8.62192 32.2826 8.74003 31.9239 8.85814H31.8043C31.6847 8.85814 31.5652 8.85814 31.4456 8.85814C31.2065 8.85814 31.0869 8.85814 30.8478 8.74003C30.6087 8.62192 30.3695 8.62192 30.1304 8.50381C29.6521 8.26759 29.1739 7.67705 28.4565 6.9684C27.8586 6.61408 27.5 6.25975 27.1413 5.90543C26.3043 4.96056 25.1087 4.48812 24.1521 4.60623H24.0326C23.7934 4.60623 23.6739 4.72434 23.4347 4.84245C23.1956 4.96056 22.9565 5.07867 22.8369 5.31488C22.7173 5.31488 22.7173 5.43299 22.7173 5.5511C22.9565 5.66921 23.076 5.78732 23.3152 5.90543C23.3152 5.78732 23.4347 5.66921 23.4347 5.66921C23.6739 5.43299 23.913 5.43299 24.1521 5.31488H24.2717C24.9891 5.19677 25.9456 5.66921 26.663 6.37786C27.0217 6.73218 27.2608 6.9684 27.5 7.32273C28.3369 8.14949 28.8152 8.74003 29.413 9.09435C29.7717 9.33057 30.25 9.44868 30.6087 9.56679C30.9673 9.6849 31.326 9.6849 31.6847 9.56679H31.8043C32.4021 9.44868 32.7608 9.33057 33.1195 8.97625C33.3587 8.62192 33.5978 8.26759 33.4782 7.79516C33.3587 7.08651 33 6.61408 32.163 6.14164H32.0434C31.8043 6.02353 31.4456 5.78732 31.0869 5.5511C30.7282 5.31488 30.6087 4.96056 30.4891 4.84245C30.4891 4.72434 30.4891 4.60623 30.4891 4.60623C30.6087 4.37002 30.7282 4.25191 30.8478 4.1338C31.0869 4.01569 31.326 3.89758 31.5652 3.89758H31.6847C32.4021 3.77947 33.2391 4.01569 33.9565 4.60623C34.1956 4.72434 34.4347 4.96056 34.7934 5.31488C35.0326 5.5511 35.2717 5.78732 35.5108 6.25975C35.75 6.61408 35.9891 6.85029 36.2282 7.20462C36.7065 7.79516 37.1847 8.3857 37.4239 8.62192C38.2608 8.85814 38.7391 9.21246 39.3369 9.44868C39.576 9.56679 39.8152 9.6849 40.1739 9.6849C40.413 9.6849 40.5326 9.6849 40.7717 9.6849C40.8913 9.6849 41.0108 9.6849 41.1304 9.6849H41.25C41.4891 9.56679 41.8478 9.44868 42.2065 9.21246C42.4456 9.09435 42.6847 8.85814 42.8043 8.62192C42.9239 8.3857 43.0434 8.14949 42.9239 7.91327C42.9239 7.44084 42.6847 7.08651 42.2065 6.61408C41.7282 6.14164 41.1304 5.78732 40.413 5.43299C39.4565 4.96056 39.3369 4.48812 39.2173 4.25191C39.2173 4.01569 39.3369 3.77947 39.576 3.54326C39.6956 3.54326 39.9347 3.30704 40.2934 3.30704H40.5326C41.0108 3.30704 41.6087 3.42515 42.0869 3.66136C42.9239 4.01569 43.6413 4.72434 44.2391 5.78732L44.8369 5.43299Z" fill="white"/>
<path d="M73.1739 5.43299C73.8913 4.37002 74.6087 3.54326 75.4456 3.07082C76.2826 2.59839 77.1195 2.59839 77.5978 2.59839H77.7174C77.9565 2.59839 78.6739 2.83461 79.1521 3.42515C79.3913 3.66136 79.3913 4.01569 79.3913 4.37002C79.2717 4.96056 78.7935 5.5511 77.8369 6.02353C77.1195 6.37786 76.6413 6.73218 76.2826 7.08651C75.9239 7.44083 75.8043 7.67705 75.8043 8.03138C75.8043 8.14949 75.8043 8.26759 75.9239 8.3857C76.0435 8.50381 76.163 8.62192 76.2826 8.74003C76.5217 8.85814 76.7608 8.97624 77.1195 9.09435H77.2391C77.3587 9.09435 77.3587 9.09435 77.4782 9.09435C77.7174 9.09435 77.9565 9.09435 78.1956 8.97624C78.7935 8.85814 79.2717 8.50381 79.8695 7.91327C79.9891 7.79516 80.2282 7.55894 80.5869 7.08651C80.8261 6.85029 80.9456 6.61408 81.1848 6.37786C81.4239 6.02353 81.663 5.66921 82.0217 5.43299C82.0217 5.43299 82.0217 5.31488 82.1413 5.31488V5.19677C82.6195 4.60623 82.9782 4.1338 83.5761 3.77947C84.5326 3.07082 85.3695 2.83461 86.3261 2.95271H86.4456C86.6848 2.95271 86.9239 3.07082 87.163 3.18893C87.4022 3.30704 87.6413 3.42515 87.7609 3.66136C87.8804 3.77947 88 3.89758 88 4.1338C88.1195 4.37002 88.1195 4.48812 88.1195 4.72434C88 5.31488 87.6413 5.66921 87.2826 5.90542C86.9239 6.14164 86.5652 6.37786 86.2065 6.49597H86.0869C85.3695 6.9684 85.1304 7.44083 85.1304 7.67705C85.1304 7.91327 85.1304 8.14948 85.3695 8.3857C85.4891 8.50381 85.8478 8.62192 86.2065 8.74003H86.3261C86.4456 8.74003 86.5652 8.74003 86.6848 8.74003C86.9239 8.74003 87.0435 8.74003 87.2826 8.62192C87.5217 8.50381 87.7608 8.50381 88 8.3857C88.4782 8.14948 88.9565 7.55894 89.6739 6.85029C89.913 6.49597 90.2717 6.14164 90.6304 5.78732C91.5869 4.84245 92.663 4.37002 93.7391 4.48812H93.8587C94.0978 4.48812 94.2174 4.60623 94.4565 4.72434C94.6956 4.84245 94.9348 4.96056 95.0543 5.19677C95.1739 5.31488 95.1739 5.43299 95.1739 5.43299C94.9348 5.5511 94.8152 5.66921 94.5761 5.78732C94.5761 5.66921 94.4565 5.5511 94.4565 5.5511C94.2174 5.31488 93.9782 5.31488 93.7391 5.19677H93.6195C92.9022 5.07867 91.9456 5.5511 91.2282 6.25975C90.8695 6.61408 90.6304 6.85029 90.3913 7.20462C89.6739 8.14949 89.0761 8.74003 88.4782 9.09435C88.1195 9.33057 87.6413 9.44868 87.2826 9.56679C86.9239 9.6849 86.5652 9.6849 86.2065 9.56679H86.0869C85.6087 9.44868 85.1304 9.21246 84.8913 8.97624C84.6522 8.62192 84.413 8.26759 84.5326 7.79516C84.6521 7.08651 85.0109 6.61408 85.8478 6.14164H85.9674C86.2065 6.02353 86.5652 5.78732 86.9239 5.5511C87.0435 5.31488 87.2826 4.96056 87.2826 4.84245C87.2826 4.72434 87.2826 4.60623 87.2826 4.60623C87.163 4.37002 87.0435 4.25191 86.9239 4.1338C86.6848 4.01569 86.4456 3.89758 86.2065 3.89758H86.0869C85.3695 3.77947 84.5326 4.01569 83.8152 4.60623C83.5761 4.72434 83.3369 4.96056 82.9782 5.31488C82.7391 5.5511 82.5 5.78732 82.2609 6.25975C82.0217 6.61408 81.7826 6.85029 81.5435 7.20462C81.0652 7.79516 80.5869 8.3857 80.3478 8.62192C79.8695 9.09435 79.3913 9.44868 78.7935 9.56679C78.5543 9.6849 78.3152 9.803 77.9565 9.803C77.7174 9.803 77.5978 9.803 77.3587 9.803C77.2391 9.803 77.1195 9.803 77 9.803H76.8804C76.5217 9.56679 76.163 9.44868 75.8043 9.21246C75.5652 9.09435 75.3261 8.85814 75.2065 8.62192C75.0869 8.3857 74.9674 8.14949 75.0869 7.91327C75.0869 7.44083 75.3261 7.08651 75.8043 6.61408C76.2826 6.14164 76.8804 5.78732 77.5978 5.43299C78.5543 4.96056 78.6739 4.48812 78.7935 4.25191C78.7935 4.01569 78.6739 3.77947 78.4348 3.54326C78.3152 3.54326 78.0761 3.30704 77.7174 3.30704H77.4782C77 3.30704 76.4021 3.42515 75.9239 3.66136C75.2065 4.01569 74.4891 4.72434 73.8913 5.78732L73.1739 5.43299Z" fill="white"/>
<path d="M66.4782 37.0861L59.1847 32.4798L51.8913 37.0861L45.076 41.338C45.1956 42.4009 45.4347 43.582 45.7934 44.8812C45.913 45.3536 46.1521 45.8261 46.3913 46.2985L59.1847 38.2671L71.9782 46.4166C72.2174 45.9442 72.4565 45.3536 72.5761 44.8812C72.9347 43.7001 73.1739 42.519 73.2934 41.4561L66.4782 37.0861Z" fill="#ED1C24"/>
<path d="M32.0435 18.4249C32.0435 18.1887 31.9239 17.9525 31.9239 17.7163C24.2717 17.4801 19.6087 14.8817 16.8587 11.6927C14.3478 8.74003 13.3913 5.19677 13.1521 2.48028C17.0978 6.85029 22.4782 11.1022 31.9239 13.11H32.0435L32.4022 13.2282H32.6413L34.0761 13.4644H34.1956C36.7065 13.9368 38.9782 14.0549 40.5326 14.6455C41.3696 14.9998 41.9674 15.4722 42.4456 16.1809C42.9239 16.8895 43.163 17.8344 43.163 19.2517H43.8804C43.8804 17.7163 43.6413 16.6533 43.0435 15.8265C42.6848 15.236 42.0869 14.7636 41.4891 14.4092C39.5761 13.3463 37.0652 13.3463 34.3152 12.8738L32.6413 12.5195L32.2826 12.4014C22.4782 10.3935 17.2174 5.78732 13.2717 1.29919L12.6739 1.53541V1.65352C12.6739 4.60623 13.5108 8.62192 16.5 12.0471C19.25 15.4722 24.1522 18.1887 32.0435 18.4249Z" fill="white"/>
<path d="M86.2065 12.4014H85.8478L83.9347 12.7557C81.4239 13.2282 79.1521 13.3463 77.3586 14.0549C76.4021 14.4092 75.6847 14.9998 75.0869 15.8265C74.6086 16.6533 74.2499 17.8344 74.2499 19.2517H74.9673C74.9673 17.8344 75.2065 16.8895 75.6847 16.1809C76.0434 15.5903 76.4021 15.236 76.9999 14.9998C78.6739 14.0549 81.1847 14.0549 84.0543 13.4644L85.4891 13.2282L85.9673 13.11H86.2065H86.326C95.7717 11.1022 101.033 6.85029 104.978 2.48028C104.859 5.19677 103.902 8.74003 101.272 11.6927C98.5217 14.8817 93.8586 17.4801 86.326 17.7163C86.326 17.9525 86.326 18.1887 86.2065 18.4249C93.9782 18.1887 98.8804 15.4722 101.75 12.1652C104.739 8.74003 105.576 4.72434 105.576 1.77163V1.53541L105.217 1.29919C101.272 5.78732 96.0108 10.3935 86.2065 12.4014Z" fill="white"/>
<path d="M38.6196 30.2358L38.2609 30.1177C36.3478 33.1885 33.7174 34.0152 31.4456 34.0152C30.25 34.0152 29.1739 33.779 28.3369 33.5428C30.0109 33.1885 31.6848 32.4798 33.1196 31.6531C34.6739 30.7082 35.9891 29.6452 36.8261 28.5823C36.7065 28.4641 36.4674 28.2279 36.3478 28.1098C35.5109 29.1728 34.3152 30.2358 32.7609 31.1806C31.0869 32.1255 29.0543 32.8342 27.0217 33.1885L26.9022 33.779C27.9782 34.2515 29.5326 34.7239 31.3261 34.7239C33.8369 34.7239 36.7065 33.779 38.7391 30.5901C38.7391 30.472 38.6196 30.3539 38.6196 30.2358Z" fill="white"/>
<path d="M41.3696 32.4798C40.6522 34.0153 40.2935 36.0231 40.2935 38.149C40.2935 38.7396 40.2935 39.212 40.413 39.8026C39.5761 38.6215 38.6196 36.968 38.6196 35.0782C38.6196 33.8971 38.9783 32.598 39.8152 31.2988C39.6956 31.1806 39.4565 31.0625 39.3369 30.8263C38.3804 32.2436 38.0217 33.6609 38.0217 35.0782C38.0217 37.7947 39.5761 40.0388 40.6522 41.1018L41.25 40.7474C41.1304 39.9207 41.0109 38.9758 41.0109 38.0309C41.0109 36.1412 41.3696 34.2515 41.9674 32.7161C41.8478 32.8342 41.6087 32.7161 41.3696 32.4798Z" fill="white"/>
<path d="M36.1087 27.6374C35.9891 27.5193 35.8695 27.2831 35.75 27.1649C32.8804 29.0547 30.25 29.7633 27.8587 29.7633C24.1522 29.7633 21.163 27.9917 19.4891 26.102C21.6413 26.4563 23.5543 26.6925 25.2282 26.6925C29.2935 26.6925 32.0435 25.6295 34.1956 24.5666C34.0761 24.3303 33.9565 24.2122 33.8369 23.976C31.8043 25.039 29.1739 25.9839 25.1087 25.9839C23.3152 25.9839 21.163 25.7476 18.6522 25.2752L18.2935 25.7476C19.8478 27.9917 23.3152 30.3539 27.7391 30.3539C30.3695 30.3539 33.2391 29.6452 36.1087 27.6374Z" fill="white"/>
<path d="M33.5978 23.5036C33.4782 23.2674 33.3587 23.0311 33.3587 22.913C31.2065 23.3855 29.2935 23.5036 27.6196 23.5036C23.4348 23.5036 20.3261 22.3225 18.0543 20.669C16.1413 19.2517 14.9456 17.4801 14.1087 15.7084C19.3696 18.543 24.3913 19.7241 29.5326 19.7241C30.4891 19.7241 31.3261 19.7241 32.2826 19.606C32.2826 19.3698 32.163 19.1336 32.163 18.8974C31.3261 19.0155 30.4891 19.0155 29.5326 19.0155C24.2717 19.0155 19.1304 17.8344 13.6304 14.6454L13.1522 15.1179C13.8696 17.2438 15.3043 19.606 17.6956 21.2595C19.9674 23.0311 23.3152 24.2122 27.6196 24.2122C29.413 24.2122 31.3261 23.976 33.5978 23.5036Z" fill="white"/>
<path d="M85.3696 31.0625C83.8152 30.2358 82.6196 29.1728 81.7826 28.1098C81.663 28.2279 81.4239 28.4641 81.3043 28.5823C82.1413 29.6452 83.4565 30.7082 85.0109 31.535C86.4456 32.3617 88.1196 33.0704 89.7935 33.4247C88.9565 33.6609 87.8804 33.8971 86.6848 33.8971C84.413 33.8971 81.7826 33.0704 79.8696 29.9996C79.75 30.1177 79.5109 30.3539 79.3913 30.472C81.4239 33.5428 84.2935 34.6058 86.6848 34.6058C88.4782 34.6058 90.0326 34.1333 91.1087 33.6609V33.0704C89.0761 32.716 87.0435 32.0074 85.3696 31.0625Z" fill="white"/>
<path d="M78.4348 31.4168C79.2717 32.716 79.5109 33.8971 79.5109 35.0782C79.5109 36.9679 78.6739 38.6215 77.7174 39.8025C77.7174 39.212 77.8369 38.7396 77.8369 38.149C77.8369 36.1412 77.4782 34.1333 76.7608 32.4798C76.5217 32.5979 76.4022 32.716 76.163 32.8341C76.7609 34.2514 77.1195 36.1412 77.1195 38.0309C77.1195 38.9758 77 39.8025 76.8804 40.7474L77.4782 41.1017C78.6739 39.9207 80.1087 37.7947 80.1087 35.0782C80.1087 33.779 79.75 32.3617 78.7935 30.9444C78.7935 31.1806 78.6739 31.2987 78.4348 31.4168Z" fill="white"/>
<path d="M93.0217 25.9839C89.0761 25.9839 86.4456 25.039 84.5326 23.976C84.413 24.2122 84.2935 24.3303 84.1739 24.5666C86.2065 25.6295 88.9565 26.5744 93.0217 26.5744C94.6957 26.5744 96.6087 26.4563 98.7609 25.9839C97.0869 27.8736 94.0978 29.6452 90.3913 29.6452C88 29.6452 85.3696 28.9366 82.6196 27.1649C82.5 27.4012 82.3804 27.5193 82.2609 27.6374C85.25 29.5271 88 30.3539 90.5109 30.3539C94.9348 30.3539 98.4022 27.9917 99.9565 25.7476L99.5978 25.2752C97.087 25.7476 94.9348 25.9839 93.0217 25.9839Z" fill="white"/>
<path d="M88.7174 19.0155C87.8804 19.0155 87.0435 19.0155 86.2065 18.8974C86.2065 19.1336 86.0869 19.3698 86.0869 19.606C86.9239 19.7241 87.7609 19.7241 88.7174 19.7241C93.7391 19.7241 98.8804 18.6611 104.141 15.7084C103.304 17.4801 102.109 19.2517 100.196 20.669C98.0435 22.3225 94.9348 23.5036 90.75 23.5036C89.0761 23.5036 87.163 23.2674 85.1304 22.913C85.0109 23.1493 84.8913 23.3855 84.8913 23.5036C87.0435 23.976 88.9565 24.0941 90.75 24.0941C95.0543 24.0941 98.2826 22.913 100.674 21.1414C102.946 19.3698 104.38 17.1257 105.217 14.9998L104.739 14.6454C99.1196 17.8344 93.9783 19.0155 88.7174 19.0155Z" fill="white"/>
<path d="M65.6413 56.6921C66.2391 57.4007 66.5978 58.4637 66.5978 59.5267C66.5978 61.0621 65.8804 62.4794 64.4456 63.4242C64.4456 62.9518 64.5652 62.5975 64.5652 62.2432C64.5652 59.7629 63.7282 58.2275 63.3696 57.8731C63.1304 57.9913 63.0109 58.1094 62.7717 58.2275C62.8913 58.4637 63.8478 59.881 63.8478 62.3613C63.8478 62.9518 63.8478 63.4242 63.7282 64.1329L64.2065 64.4872C66.3587 63.5423 67.3152 61.5345 67.3152 59.6448C67.3152 58.4637 66.9565 57.2826 66.2391 56.4558L65.6413 56.6921Z" fill="white"/>
<path d="M69.7065 53.6212C70.5434 54.448 71.0217 55.6291 71.0217 56.8102C71.0217 57.9913 70.5434 59.1723 69.3478 60.1172C69.3478 59.9991 69.3478 59.881 69.3478 59.7629C69.3478 58.1094 68.6304 56.2196 67.6739 55.1567C67.5543 55.2748 67.4347 55.2748 67.3152 55.3929L67.076 55.511C67.913 56.4558 68.6304 58.3456 68.6304 59.7629C68.6304 60.1172 68.6304 60.4715 68.5108 60.7078L68.9891 61.0621C70.7826 59.9991 71.6195 58.2275 71.5 56.6921C71.5 55.2748 70.9021 53.9756 70.0652 53.0307C70.0652 53.2669 69.9456 53.5031 69.7065 53.6212Z" fill="white"/>
<path d="M73.0543 49.9599C73.6522 50.7866 73.8913 51.7315 73.8913 52.7945C73.8913 53.7393 73.6522 54.5661 73.2935 55.511C72.8152 53.5031 71.9782 52.4401 71.5 51.9677C71.3804 52.0858 71.1413 52.322 71.0217 52.4402C71.5 52.9126 72.5761 54.0937 72.8152 56.4558L73.413 56.5739C74.25 55.3929 74.6087 53.9756 74.6087 52.6764C74.6087 51.4953 74.25 50.3142 73.413 49.2512C73.2935 49.4874 73.1739 49.7237 73.0543 49.9599Z" fill="white"/>
<path d="M59.7826 10.866C59.7826 11.1022 59.7826 11.3384 59.7826 11.5746C59.7826 12.5195 60.1413 13.3462 60.8587 14.0549L61.3369 13.5825C60.8587 13.11 60.5 12.4014 60.5 11.5746C60.5 11.3384 60.5 11.2203 60.6195 10.9841C60.2609 10.9841 60.0217 10.866 59.7826 10.866Z" fill="white"/>
<path d="M47.2282 9.68491C46.75 9.33058 46.6304 8.85815 46.6304 8.38571V8.26761C46.75 7.44085 47.3478 6.61409 48.5435 6.37787C48.4239 6.7322 48.1848 7.32274 48.1848 7.91328C48.1848 8.38571 48.3043 8.85815 48.5435 9.33058C48.7826 9.33058 49.1413 9.33058 49.3804 9.33058C49.0217 8.85815 48.7826 8.38571 48.7826 7.91328C48.7826 7.55896 48.9022 7.20463 49.0217 6.8503C49.0217 6.7322 49.1413 6.61409 49.1413 6.49598C49.1413 6.49598 49.1413 6.37787 49.2609 6.37787L48.9022 6.02355L48.7826 5.90544L48.5435 5.66922C46.9891 5.90544 45.913 7.08652 45.913 8.26761V8.38571C45.913 9.09437 46.2717 9.68491 46.75 10.1573C46.8695 9.92113 46.9891 9.80302 47.2282 9.68491Z" fill="white"/>
<path d="M50.9347 6.49596L50.6956 6.73218C50.8152 7.08651 50.8152 7.32272 50.8152 7.67705C50.8152 8.26759 50.576 8.85813 49.8586 9.44867C50.0978 9.44867 50.3369 9.56678 50.6956 9.68489C51.2934 9.09435 51.5326 8.3857 51.5326 7.79516C51.5326 7.32272 51.413 7.08651 51.413 6.73218C51.8913 6.85029 52.2499 7.08651 52.4891 7.44083C52.8478 7.79516 52.9673 8.26759 52.9673 8.62192V8.74002C52.9673 9.21246 52.6086 9.68489 52.0108 10.0392C52.2499 10.1573 52.4891 10.2754 52.7282 10.3935C53.2065 9.92111 53.5652 9.44867 53.6847 8.74002V8.50381C53.6847 7.91326 53.4456 7.32272 53.0869 6.85029C52.6086 6.61407 52.1304 6.25975 51.413 6.02353L50.9347 6.49596Z" fill="white"/>
<path d="M49.9783 4.72434C49.9783 4.60623 50.0978 4.60623 50.0978 4.60623H50.2174C50.337 4.60623 50.4565 4.96055 50.4565 5.31488V5.5511L51.1739 5.6692C51.1739 5.5511 51.1739 5.5511 51.1739 5.43299C51.1739 5.31488 51.1739 5.19677 51.1739 4.96055C51.1739 4.84245 51.0543 4.60623 51.0543 4.48812C50.9348 4.37001 50.9348 4.2519 50.8152 4.13379C50.6956 4.01569 50.5761 4.01569 50.4565 4.01569H50.3369H50.2174C50.0978 4.01569 49.9783 4.13379 49.9783 4.13379C49.7391 4.2519 49.6196 4.48812 49.5 4.72434C49.3804 4.96055 49.3804 5.19677 49.2609 5.43299L49.9783 5.5511C49.8587 5.07866 49.9783 4.84245 49.9783 4.72434Z" fill="white"/>
<path d="M61.9347 58.4637C61.6956 58.5818 61.576 58.5818 61.3369 58.6999C61.4565 59.2904 61.576 59.9991 61.576 60.8259C61.576 61.7707 61.4565 62.9518 60.9782 63.8967C60.6195 64.8415 60.0217 65.6683 59.0652 66.2588C58.2282 65.6683 57.6304 64.9596 57.2717 64.1329C56.913 63.188 56.7934 62.125 56.7934 61.1802C56.7934 60.2353 56.913 59.4086 57.0326 58.818C56.7934 58.6999 56.6739 58.5818 56.4347 58.5818C56.1956 59.2904 56.076 60.2353 56.076 61.1802C56.076 62.2432 56.1956 63.3061 56.6739 64.3691C57.1521 65.4321 57.75 66.3769 58.826 66.9675H59.1847C60.2608 66.2588 61.0978 65.314 61.4565 64.1329C61.9347 63.0699 62.0543 61.8888 62.0543 60.8259C62.2934 59.881 62.1739 59.0542 61.9347 58.4637Z" fill="white"/>
<path d="M53.9239 62.1251C53.9239 62.4794 53.9239 62.9518 54.0435 63.3061C52.6087 62.3613 51.8913 60.944 51.8913 59.4086C51.8913 58.3456 52.25 57.4007 52.8478 56.574C52.6087 56.4559 52.4891 56.3377 52.25 56.2196C51.5326 57.1645 51.1739 58.2275 51.1739 59.4086C51.1739 61.2983 52.1304 63.3061 54.2826 64.251L54.7608 63.8967C54.6413 63.3061 54.6413 62.7156 54.6413 62.1251C54.6413 60.8259 54.8804 59.7629 55.2391 59.0542C55.3587 58.6999 55.4782 58.4637 55.5978 58.2275C55.5978 58.1094 55.7174 58.1094 55.7174 58.1094C55.3587 57.9913 55.2391 57.8732 55 57.8732C54.6413 58.3456 53.9239 59.7629 53.9239 62.1251Z" fill="white"/>
<path d="M51.1739 55.6291C50.9348 55.511 50.8152 55.3929 50.5761 55.2748C49.6196 56.4558 48.9022 58.2275 48.9022 59.881C48.9022 59.9991 48.9022 60.1172 48.9022 60.2353C47.7065 59.2904 47.2283 58.1094 47.2283 56.9283C47.2283 55.7472 47.7065 54.6842 48.4239 53.8575C48.3043 53.7393 48.0652 53.5031 47.9456 53.385C47.1087 54.3299 46.5109 55.6291 46.5109 56.9283C46.5109 58.4637 47.2283 60.2353 49.0217 61.2983L49.5 60.944C49.3804 60.7077 49.3804 60.3534 49.3804 59.9991C49.7391 58.4637 50.3369 56.574 51.1739 55.6291Z" fill="white"/>
<path d="M47.3478 52.5583C47.2283 52.4401 46.9891 52.2039 46.8696 52.0858C46.3913 52.5583 45.5543 53.6212 45.1956 55.511C44.7174 54.6842 44.5978 53.7393 44.5978 52.7945C44.5978 51.8496 44.837 50.9047 45.3152 50.078C45.1957 49.8418 45.0761 49.7237 44.9565 49.4874C44.2391 50.4323 43.8804 51.6134 43.8804 52.7945C43.8804 54.0937 44.3587 55.511 45.0761 56.6921L45.6739 56.5739C45.7935 55.0385 46.3913 53.9756 46.75 53.2669C46.9891 52.9126 47.2283 52.6764 47.3478 52.5583Z" fill="white"/>
<path d="M49.9782 12.0471C49.9782 12.1652 49.8587 12.1652 49.7391 12.1652C49.6195 12.1652 49.3804 12.0471 49.3804 11.929C49.6195 11.929 49.7391 12.0471 49.9782 12.0471ZM48.663 12.0471C48.7826 12.5195 49.1413 12.8738 49.6195 12.8738C49.9782 12.8738 50.3369 12.6376 50.576 12.2833C51.0543 12.5195 51.5326 12.7557 52.0108 12.8738L52.25 12.2833C51.7717 12.0471 51.2934 11.8108 50.8152 11.5746C50.3369 11.3384 49.7391 11.2203 49.2608 11.2203C49.0217 11.2203 48.663 11.2203 48.4239 11.4565C48.1847 11.5746 47.9456 11.8108 47.7065 12.0471L48.3043 12.4014C48.4239 12.2833 48.5434 12.1652 48.663 12.0471Z" fill="white"/>
<path d="M47.9457 15.8265C48.1848 15.8265 48.4239 15.8265 48.663 16.0628L49.0217 15.3541C48.663 15.1179 48.3044 15.1179 48.0652 15.1179C47.4674 15.1179 46.9891 15.3541 46.6304 15.5903C46.1522 15.8265 45.7935 15.9446 45.4348 15.9446C45.1957 15.9446 44.9565 15.9446 44.7174 15.7084L44.2391 16.4171C44.5978 16.5352 44.9565 16.6533 45.3152 16.6533C45.9131 16.6533 46.3913 16.4171 46.8696 16.1809C47.2283 15.9446 47.587 15.8265 47.9457 15.8265Z" fill="white"/>
<path d="M58.8261 0.944868C58.8261 0.826759 58.9457 0.708651 58.9457 0.708651H59.0652H59.1848C59.3044 0.826759 59.3044 0.944868 59.4239 1.18108C59.5435 1.4173 59.5435 1.77163 59.5435 2.00784H60.2609C60.2609 1.53541 60.1413 1.06298 60.0217 0.590542C59.9022 0.354325 59.7826 0.236217 59.6631 0.118108C59.5435 0.118108 59.3044 0 59.0652 0C58.8261 0 58.7065 0.118108 58.587 0.236217C58.3478 0.472434 58.2283 0.708651 58.1087 1.06298C57.9891 1.4173 57.9891 1.77163 57.9891 2.12595H58.7065C58.7065 1.65352 58.8261 1.18108 58.8261 0.944868Z" fill="white"/>
<path d="M57.5109 14.0549C58.1087 13.4644 58.5869 12.5195 58.5869 11.5746C58.5869 11.3384 58.5869 11.1022 58.4674 10.866C58.2282 10.866 57.9891 10.866 57.75 10.9841C57.75 11.2203 57.8696 11.3384 57.8696 11.5746C57.8696 12.4014 57.5109 12.9919 57.0326 13.5825L57.5109 14.0549Z" fill="white"/>
<path d="M43.7609 12.1652C43.6413 12.4014 43.6413 12.6376 43.6413 12.992C43.6413 13.7006 44 14.4093 44.9565 15.1179L45.4348 14.9998C45.913 14.2911 46.5109 14.0549 47.2283 14.0549C47.8261 14.0549 48.3043 14.173 48.7826 14.5274C49.2609 14.7636 49.5 15.1179 49.7391 15.3541C49.5 16.0628 49.1413 16.5352 48.5435 16.8895C47.9456 17.2439 47.2283 17.4801 46.3913 17.4801L46.1522 17.9525C46.6304 18.6612 47.4674 19.0155 48.3043 19.0155C48.663 19.0155 49.0217 18.8974 49.3804 18.7793C49.5 18.6612 49.7391 18.5431 49.8587 18.4249C50.0978 18.1887 50.337 17.9525 50.6956 17.7163C50.9348 17.4801 51.2935 17.362 51.413 17.2439C51.5326 17.2439 51.5326 17.2439 51.6522 17.2439C51.8913 17.2439 52.1304 17.362 52.3696 17.4801C52.6087 17.5982 52.7283 17.8344 52.7283 18.3068V18.4249C52.7283 18.5431 52.7283 18.6612 52.6087 18.8974C52.6087 19.0155 52.4891 19.2517 52.25 19.4879H53.087C53.2065 19.3698 53.2065 19.2517 53.2065 19.1336C53.3261 18.7793 53.3261 18.5431 53.3261 18.4249V18.3068C53.3261 17.8344 53.087 17.362 52.8478 17.0076C52.4891 16.6533 52.1304 16.5352 51.6522 16.5352C51.5326 16.5352 51.413 16.5352 51.2935 16.5352C50.8152 16.6533 50.3369 17.0076 49.9783 17.362C49.7391 17.4801 49.6196 17.7163 49.3804 17.8344C49.2609 17.9525 49.1413 18.0706 49.0217 18.1887C48.7826 18.3068 48.5435 18.4249 48.3043 18.4249C47.9456 18.4249 47.5869 18.3068 47.2283 18.0706C47.8261 17.9525 48.4239 17.8344 49.0217 17.4801C49.7391 17.0076 50.3369 16.299 50.4565 15.3541V15.1179C50.2174 14.6455 49.7391 14.173 49.2609 13.9368C48.663 13.5825 48.0652 13.4644 47.3478 13.4644C46.6304 13.4644 45.7935 13.7006 45.1956 14.4093C44.5978 13.9368 44.4783 13.4644 44.4783 12.992C44.4783 12.7557 44.4783 12.5195 44.5978 12.4014C44.7174 12.2833 44.7174 12.1652 44.8369 12.0471C45.1956 11.6928 45.5543 11.5747 46.0326 11.5747C46.2717 11.5747 46.6304 11.6928 46.75 11.6928C46.8696 11.6928 46.9891 11.8109 46.9891 11.8109H47.1087L47.5869 11.5747C47.5869 11.3384 47.7065 11.2203 47.9456 11.1022C48.1848 10.9841 48.5435 10.866 49.0217 10.866C49.9783 10.866 51.413 11.2203 52.9674 12.0471C53.8043 12.4014 54.6413 12.5195 55.2391 12.5195C55.3587 12.5195 55.4783 12.5195 55.4783 12.5195C55.5978 12.5195 55.5978 12.5195 55.5978 12.5195C55.5978 12.6376 55.4783 12.7557 55.3587 12.8738C55.2391 12.992 55.2391 12.992 55.1196 13.1101C55 13.2282 54.8804 13.2282 54.8804 13.3463C55.2391 13.7006 55.5978 14.0549 55.837 14.4093C57.0326 15.8266 57.75 17.7163 58.1087 19.4879H58.8261C58.4674 17.5982 57.6304 15.5903 56.4348 14.0549C56.1956 13.8187 56.0761 13.5825 55.837 13.3463H55.9565C56.5543 12.992 56.7935 12.4014 56.913 12.4014L56.1956 11.6928C56.0761 11.6928 55.5978 11.8109 55 11.8109C54.4022 11.8109 53.5652 11.6928 52.8478 11.3384H52.7283C52.4891 11.2203 52.25 11.1022 52.0109 10.9841H51.8913C51.7717 10.7479 51.5326 10.6298 51.2935 10.6298C51.1739 10.6298 51.0543 10.5117 50.9348 10.5117C50.8152 10.5117 50.6956 10.3936 50.5761 10.3936C50.4565 10.3936 50.4565 10.3936 50.3369 10.3936C50.0978 10.3936 49.9783 10.2755 49.7391 10.2755C49.3804 10.2755 49.1413 10.1573 48.7826 10.1573C48.1848 10.1573 47.7065 10.2755 47.3478 10.3936C47.2283 10.3936 47.2283 10.5117 47.1087 10.5117C46.9891 10.6298 46.8696 10.7479 46.75 10.9841C46.5109 10.866 46.1522 10.866 45.6739 10.866C45.0761 10.866 44.4783 10.9841 44 11.5747C44 11.6928 43.8804 11.929 43.7609 12.1652Z" fill="white"/>
<path d="M69.1087 6.49597C69.2283 6.73219 69.4674 7.32273 69.4674 7.91327C69.4674 8.38571 69.3478 8.97625 68.8696 9.33058C69.2283 9.33058 69.4674 9.33058 69.7065 9.33058C69.9457 8.85814 70.0652 8.38571 70.0652 7.91327C70.0652 7.44084 69.9457 6.96841 69.8261 6.61408C69.8261 6.49597 69.7065 6.49597 69.7065 6.37787C70.9022 6.61408 71.5 7.44084 71.6196 8.2676V8.38571C71.6196 8.85814 71.3804 9.33057 70.9022 9.6849C71.1413 9.80301 71.2609 9.92112 71.3804 10.1573C71.8587 9.6849 72.2174 9.09436 72.2174 8.38571V8.2676C72.0978 7.08652 71.1413 6.02354 69.587 5.78732L69.4674 5.90543L69.3478 6.14165L69.1087 6.49597Z" fill="white"/>
<path d="M64.6848 8.74003C64.6848 9.33057 65.0435 9.92111 65.6413 10.3935C65.8804 10.2754 66.1195 10.1573 66.3587 10.0392C65.7608 9.6849 65.4021 9.21246 65.4021 8.74003V8.62192C65.4021 8.14949 65.5217 7.79516 65.8804 7.44084C66.1195 7.20462 66.4782 6.9684 66.9565 6.73218C66.8369 7.08651 66.8369 7.32273 66.8369 7.67705C66.8369 8.26759 67.0761 8.97625 67.6739 9.56679C67.913 9.44868 68.1521 9.44868 68.5108 9.33057C67.7934 8.74003 67.5543 8.14949 67.5543 7.55894C67.5543 7.20462 67.6739 6.85029 67.6739 6.61408L67.4348 6.37786L67.3152 6.25975L66.9565 5.90543C66.3587 6.14164 65.7608 6.37786 65.5217 6.85029C65.163 7.32273 64.9239 7.91327 64.9239 8.50381L64.6848 8.74003Z" fill="white"/>
<path d="M67.6739 5.433V5.19678C67.6739 4.96056 67.6739 4.72435 67.7934 4.60624L67.913 4.48813H68.0326C68.1521 4.72435 68.3913 4.96056 68.3913 5.433L69.1087 5.31489C69.1087 5.07867 68.9891 4.72435 68.8695 4.48813C68.8695 4.37002 68.8695 4.37002 68.75 4.25191C68.6304 4.13381 68.5108 4.0157 68.3913 3.89759C68.2717 3.89759 68.2717 3.77948 68.1521 3.77948H68.0326H67.913C67.7934 3.77948 67.5543 3.89759 67.5543 3.89759C67.3152 4.13381 67.1956 4.37002 67.076 4.72435C67.076 4.84246 67.076 4.96056 67.076 5.19678C67.076 5.31489 67.076 5.31489 67.076 5.433H67.6739Z" fill="white"/>
<path d="M68.8696 11.929C68.8696 12.0471 68.75 12.1652 68.5109 12.1652C68.3913 12.1652 68.2717 12.0471 68.2717 12.0471C68.5109 12.0471 68.6304 11.929 68.8696 11.929ZM68.5109 12.8738C68.9891 12.8738 69.4674 12.5195 69.4674 12.0471C69.587 12.1652 69.7065 12.2833 69.9457 12.4014L70.5435 12.0471C70.3044 11.8108 70.0652 11.5746 69.8261 11.4565C69.587 11.3384 69.2283 11.2203 68.9891 11.2203C68.3913 11.2203 67.913 11.4565 67.4348 11.5746C66.9565 11.8108 66.3587 12.0471 66 12.2833L66.2391 12.8738C66.7174 12.6376 67.1957 12.4014 67.6739 12.2833C67.7935 12.6376 68.1522 12.8738 68.5109 12.8738Z" fill="white"/>
<path d="M72.9347 15.9446C72.576 15.9446 72.2173 15.8265 71.7391 15.5903C71.2608 15.3541 70.9021 15.1179 70.3043 15.1179C69.9456 15.1179 69.5869 15.236 69.3478 15.3541L69.7065 15.9446C69.9456 15.8265 70.1847 15.7084 70.4239 15.7084C70.7826 15.7084 71.1413 15.8265 71.6195 16.0628C72.0978 16.299 72.576 16.5352 73.1739 16.5352C73.5326 16.5352 73.8913 16.4171 74.25 16.299L74.0108 15.7084C73.413 15.9446 73.1739 15.9446 72.9347 15.9446Z" fill="white"/>
<path d="M71.0217 10.6297C70.9022 10.6297 70.9022 10.5116 70.7826 10.5116C70.4239 10.2754 69.9456 10.2754 69.3478 10.2754C69.1087 10.2754 68.75 10.2754 68.3913 10.3935C68.1522 10.3935 68.0326 10.3935 67.7935 10.5116C67.6739 10.5116 67.6739 10.5116 67.5543 10.5116C67.4348 10.5116 67.3152 10.6297 67.1956 10.6297C67.0761 10.6297 66.9565 10.7479 66.8369 10.7479C66.5978 10.866 66.4782 10.866 66.2391 10.9841H66.1195C65.8804 11.1022 65.6413 11.2203 65.4022 11.3384H65.2826C64.5652 11.6927 63.8478 11.8108 63.1304 11.8108C62.5326 11.8108 62.0543 11.6927 61.9348 11.6927L61.5761 12.1652C61.5761 12.1652 61.6956 12.4014 61.9348 12.7557C62.0543 12.8738 62.1739 12.9919 62.413 13.11H62.5326C62.2935 13.3462 62.0543 13.5825 61.9348 13.8187C60.6195 15.4722 59.9022 17.3619 59.5435 19.2517H60.2609C60.6195 17.48 61.3369 15.5903 62.5326 14.173C62.8913 13.8187 63.1304 13.4644 63.4891 13.11C63.3695 13.11 63.25 12.9919 63.25 12.8738C63.1304 12.7557 63.1304 12.7557 63.0109 12.6376C62.8913 12.5195 62.7717 12.4014 62.7717 12.2833H62.8913C63.0108 12.2833 63.1304 12.2833 63.1304 12.2833C63.8478 12.2833 64.6848 12.1652 65.4022 11.8108C66.8369 10.9841 68.2717 10.6297 69.3478 10.6297C69.8261 10.6297 70.1848 10.7479 70.4239 10.866C70.663 10.9841 70.7826 11.1022 70.7826 11.3384L71.2608 11.5746C71.3804 11.5746 71.8587 11.3384 72.3369 11.3384C72.8152 11.3384 73.1739 11.4565 73.5326 11.8108C73.5326 11.8108 73.6522 12.047 73.7717 12.1652C73.8913 12.2833 73.8913 12.5195 73.8913 12.7557C73.8913 13.11 73.7717 13.5825 73.1739 14.173C72.5761 13.4644 71.7391 13.2281 71.0217 13.2281C70.3043 13.2281 69.7065 13.4644 69.1087 13.7006C68.5108 14.0549 68.0326 14.4092 67.913 14.8817V15.1179C68.1522 16.0627 68.6304 16.7714 69.3478 17.2438C69.8261 17.5981 70.4239 17.7163 71.1413 17.8344C70.7826 18.0706 70.4239 18.1887 70.0652 18.1887C69.8261 18.1887 69.5869 18.0706 69.3478 17.9525C69.2282 17.9525 69.1087 17.8344 68.9891 17.5981C68.75 17.3619 68.5108 17.1257 68.1522 16.8895C67.7935 16.6533 67.5543 16.4171 67.0761 16.299C66.9565 16.299 66.8369 16.299 66.7174 16.299C66.2391 16.299 65.8804 16.4171 65.5217 16.7714C65.163 17.0076 65.0435 17.48 65.0435 18.0706V18.1887C65.0435 18.3068 65.0435 18.543 65.163 18.8973C65.163 19.0154 65.2826 19.1336 65.2826 19.2517H66.1195C65.8804 19.1336 65.7608 19.0154 65.7608 18.8973C65.6413 18.6611 65.6413 18.543 65.6413 18.4249V18.3068C65.6413 17.9525 65.7609 17.7163 66 17.48C66.2391 17.3619 66.4782 17.2438 66.7174 17.2438C66.8369 17.2438 66.8369 17.2438 66.9565 17.2438C67.1956 17.2438 67.5543 17.5981 68.0326 17.9525C68.2717 18.0706 68.3913 18.3068 68.5108 18.4249C68.6304 18.543 68.8695 18.6611 68.9891 18.7792C69.3478 19.0154 69.7065 19.0154 70.0652 19.0154C70.9022 19.0154 71.7391 18.543 72.2174 17.9525L71.9782 17.48C71.1413 17.48 70.4239 17.2438 69.8261 16.8895C69.2282 16.5352 68.8695 16.0627 68.6304 15.3541C68.75 15.1179 69.1087 14.7635 69.5869 14.5273C70.0652 14.2911 70.663 14.0549 71.1413 14.0549C71.8587 14.0549 72.4565 14.2911 72.9348 14.9998L73.413 15.1179C74.3695 14.5273 74.7282 13.7006 74.7282 12.9919C74.7282 12.6376 74.6087 12.4014 74.6087 12.1652C74.4891 11.9289 74.3695 11.8108 74.25 11.5746C73.7717 10.9841 73.0543 10.866 72.5761 10.866C72.0978 10.866 71.7391 10.9841 71.5 10.9841C71.3804 10.866 71.2609 10.7479 71.0217 10.6297Z" fill="white"/>
<path d="M43.0435 20.4328V33.6609V38.3853C43.0435 40.6293 43.0435 44.1726 45.0761 47.952C45.1956 48.1883 45.4348 48.5426 45.5543 48.7788C45.6739 49.015 45.7935 49.1331 45.913 49.3693C48.1848 52.6764 52.0108 55.9834 58.9456 58.5818H59.0652H59.1848C66.1195 55.8653 70.0652 52.5583 72.3369 49.2512C72.4565 49.1331 72.5761 48.8969 72.6956 48.7788C72.8152 48.5426 73.0543 48.3064 73.1739 47.952C75.2065 44.1726 75.2065 40.6293 75.2065 38.3853V33.779V20.5509H43.0435V20.4328ZM74.4891 34.0152V38.2672C74.4891 40.5112 74.4891 43.9364 72.5761 47.4796C70.663 51.0229 66.8369 54.8023 59.1848 57.755C51.5326 54.8023 47.7065 51.0229 45.7935 47.4796C43.8804 43.9364 43.8804 40.5112 43.8804 38.2672V34.0152V21.1414H74.6087L74.4891 34.0152Z" fill="white"/>
<path d="M61.5761 10.2754H61.6956C62.0543 10.3935 62.413 10.5117 62.6522 10.6298L63.1304 10.1573C62.7717 10.0392 62.413 9.92111 62.0543 9.803C61.6956 9.56678 60.9783 9.44867 60.3804 9.44867C60.0217 9.44867 59.5435 9.33057 59.1848 9.33057C58.7065 9.33057 58.2283 9.33057 57.6304 9.44867C57.0326 9.56678 56.4348 9.68489 55.837 9.803C55.4783 9.92111 55.2391 10.0392 54.8804 10.1573L55.4783 10.6298C56.5543 10.2754 57.75 10.0392 59.1848 10.0392C60.0217 10.0392 60.8587 10.1573 61.5761 10.2754Z" fill="white"/>
<path d="M63.3695 3.07081C62.8913 2.59837 62.0543 2.24405 61.3369 2.24405C61.0978 2.24405 60.8587 2.24405 60.5 2.36216L60.2608 2.83459C60.3804 3.30703 60.5 3.77946 60.5 4.25189C60.5 5.19676 60.1413 6.02352 59.7826 6.61406C59.663 6.85028 59.5435 6.96839 59.4239 7.0865L60.0217 7.44082C60.2608 7.2046 60.3804 6.96839 60.6195 6.61406C60.9782 6.02352 61.2174 5.07865 61.2174 4.13378C61.2174 3.77946 61.2174 3.30703 61.0978 2.9527C61.2174 2.9527 61.3369 2.9527 61.4565 2.9527C62.0543 2.9527 62.6522 3.18892 63.0108 3.54324C63.3695 3.89757 63.6087 4.37 63.6087 5.07865C63.6087 5.7873 63.3695 6.49595 63.0108 7.0865C62.6522 7.67704 62.2935 8.14947 61.8152 8.74001C61.9348 8.74001 62.0543 8.85812 62.1739 8.85812C62.2935 8.85812 62.413 8.97623 62.413 8.97623C62.7717 8.5038 63.1304 8.03136 63.4891 7.55893C63.8478 6.85028 64.2065 6.14163 64.2065 5.19676C64.2065 4.25189 63.8478 3.54324 63.3695 3.07081Z" fill="white"/>
<path d="M55.8369 8.85812C55.9565 8.85812 56.0761 8.74001 56.3152 8.74001C55.9565 8.26758 55.4782 7.67704 55.1195 7.0865C54.7608 6.49595 54.5217 5.7873 54.5217 5.07865C54.5217 4.48811 54.7608 3.89757 55.1195 3.54324C55.4782 3.18892 56.0761 2.9527 56.6739 2.9527C56.7935 2.9527 56.913 2.9527 57.0326 2.9527C56.913 3.30703 56.913 3.77946 56.913 4.13378C56.913 5.19676 57.2717 6.14163 57.6304 6.85028C57.75 7.0865 57.8695 7.2046 57.9891 7.44082L58.7065 7.0865C58.2282 6.61406 57.6304 5.55109 57.6304 4.25189C57.6304 3.77946 57.75 3.42513 57.8695 2.83459L57.5108 2.36216C57.2717 2.24405 56.913 2.24405 56.6739 2.24405C55.8369 2.24405 55.1195 2.48027 54.6413 3.07081C54.163 3.54324 53.8043 4.25189 53.8043 5.07865C53.8043 5.90541 54.0435 6.73217 54.5217 7.44082C54.8804 8.03136 55.2391 8.5038 55.5978 8.97623C55.7174 8.85812 55.7174 8.85812 55.8369 8.85812Z" fill="white"/>
<path fill-rule="evenodd" clip-rule="evenodd" d="M52.7282 31.7712L50.6956 31.2987L51.7717 29.5271C51.7717 29.5271 51.7717 29.5271 51.6522 29.409L49.8587 30.472L49.3804 28.4641H49.2609L48.7826 30.472L46.9891 29.409C46.9891 29.409 46.9891 29.409 46.8695 29.5271L47.9456 31.2987L45.913 31.7712V31.8893L47.9456 32.3617L46.8695 34.1333C46.8695 34.1333 46.8695 34.1333 46.9891 34.2515L48.7826 33.1885L49.2609 35.1963H49.3804L49.8587 33.1885L51.6522 34.2515C51.6522 34.2515 51.6522 34.2515 51.7717 34.1333L50.6956 32.3617L52.7282 31.7712Z" fill="#ED1C24"/>
<path fill-rule="evenodd" clip-rule="evenodd" d="M62.5326 26.8106L60.5 26.3382L61.576 24.5665C61.576 24.5665 61.576 24.5665 61.4565 24.4484L59.663 25.5114L59.1847 23.5036H59.0652L58.5869 25.5114L56.7934 24.4484C56.7934 24.4484 56.7934 24.4484 56.6739 24.5665L57.75 26.3382L55.7173 26.8106V26.9287L57.75 27.4012L56.6739 29.1728C56.6739 29.1728 56.6739 29.1728 56.7934 29.2909L58.5869 28.2279L59.0652 30.2358H59.1847L59.663 28.2279L61.4565 29.2909C61.4565 29.2909 61.4565 29.2909 61.576 29.1728L60.5 27.4012L62.5326 26.8106Z" fill="#ED1C24"/>
<path fill-rule="evenodd" clip-rule="evenodd" d="M72.2174 31.7712L70.1848 31.2987L71.2609 29.5271C71.2609 29.5271 71.2609 29.5271 71.1413 29.409L69.3478 30.472L68.8695 28.4641H68.75L68.2717 30.472L66.4782 29.409C66.4782 29.409 66.4782 29.409 66.3587 29.5271L67.4348 31.2987L65.4022 31.7712V31.8893L67.4348 32.3617L66.3587 34.1333C66.3587 34.1333 66.3587 34.1333 66.4782 34.2515L68.2717 33.1885L68.75 35.1963H68.8695L69.3478 33.1885L71.1413 34.2515C71.1413 34.2515 71.1413 34.2515 71.2609 34.1333L70.1848 32.3617L72.2174 31.7712Z" fill="#ED1C24"/>
<path d="M59.0652 38.149L46.2717 46.1804C47.9456 49.7237 51.413 53.5031 59.0652 56.4559C66.7174 53.5031 70.1848 49.7237 71.8587 46.1804L59.0652 38.149ZM63.6087 48.1883L60.8587 48.7788L62.2935 51.141C62.2935 51.141 62.2935 51.141 62.1739 51.2591L59.7826 49.8418L59.0652 52.5583H58.9456L58.3478 49.8418L55.9565 51.2591C55.9565 51.2591 55.9565 51.2591 55.8369 51.141L57.2717 48.7788L54.5217 48.0702V47.952L57.2717 47.3615L55.8369 44.9993C55.8369 44.9993 55.8369 44.9993 55.9565 44.8812L58.3478 46.2985L59.0652 43.582H59.1848L59.7826 46.2985L62.1739 44.8812C62.1739 44.8812 62.1739 44.8812 62.2935 44.9993L60.8587 47.3615L63.6087 48.1883Z" fill="#0054A6"/>
</g>
<defs>
<clipPath id="clip0_3341_69183">
<rect width="121" height="67" fill="white"/>
</clipPath>
</defs>
</svg>
