<?xml version="1.0"?>
<opencv_storage>
<stage6>
  <maxWeakCount>8</maxWeakCount>
  <stageThreshold>-1.6476317644119263e+00</stageThreshold>
  <weakClassifiers>
    <_>
      <internalNodes>
        0 -1 125493 2.8053149580955505e-02</internalNodes>
      <leafValues>
        -6.0392504930496216e-01 7.7019339799880981e-01</leafValues></_>
    <_>
      <internalNodes>
        0 -1 96478 -2.6909504085779190e-03</internalNodes>
      <leafValues>
        4.6457985043525696e-01 -7.1339344978332520e-01</leafValues></_>
    <_>
      <internalNodes>
        0 -1 73628 -3.8606256246566772e-02</internalNodes>
      <leafValues>
        4.6667271852493286e-01 -5.9092229604721069e-01</leafValues></_>
    <_>
      <internalNodes>
        0 -1 132825 3.9217653684318066e-03</internalNodes>
      <leafValues>
        -4.5975795388221741e-01 4.3565046787261963e-01</leafValues></_>
    <_>
      <internalNodes>
        0 -1 119534 -8.2118099089711905e-04</internalNodes>
      <leafValues>
        -8.6146610975265503e-01 2.2940418124198914e-01</leafValues></_>
    <_>
      <internalNodes>
        0 -1 100281 -1.4933003112673759e-02</internalNodes>
      <leafValues>
        1.7883704602718353e-01 -7.4006348848342896e-01</leafValues></_>
    <_>
      <internalNodes>
        0 -1 156500 -2.6069875806570053e-02</internalNodes>
      <leafValues>
        6.9419199228286743e-01 -2.8108730912208557e-01</leafValues></_>
    <_>
      <internalNodes>
        0 -1 71314 -1.9780796021223068e-02</internalNodes>
      <leafValues>
        7.8867495059967041e-01 -2.8367695212364197e-01</leafValues></_></weakClassifiers></stage6>
</opencv_storage>
