<?xml version="1.0"?>
<opencv_storage>
<stage8>
  <maxWeakCount>10</maxWeakCount>
  <stageThreshold>-9.7482508420944214e-01</stageThreshold>
  <weakClassifiers>
    <_>
      <internalNodes>
        0 -1 77373 9.9520767107605934e-03</internalNodes>
      <leafValues>
        -3.4322819113731384e-01 7.1279919147491455e-01</leafValues></_>
    <_>
      <internalNodes>
        0 -1 44563 7.4923690408468246e-03</internalNodes>
      <leafValues>
        -6.9749534130096436e-01 3.6708569526672363e-01</leafValues></_>
    <_>
      <internalNodes>
        0 -1 87055 2.7996791526675224e-02</internalNodes>
      <leafValues>
        -5.5218303203582764e-01 3.3377182483673096e-01</leafValues></_>
    <_>
      <internalNodes>
        0 -1 78895 -1.8882183940149844e-04</internalNodes>
      <leafValues>
        -7.6785945892333984e-01 2.3840305209159851e-01</leafValues></_>
    <_>
      <internalNodes>
        0 -1 14109 1.0811406373977661e-01</internalNodes>
      <leafValues>
        1.5157683193683624e-01 -9.1548854112625122e-01</leafValues></_>
    <_>
      <internalNodes>
        0 -1 84572 5.3677218966186047e-04</internalNodes>
      <leafValues>
        1.2320007383823395e-01 -9.3571174144744873e-01</leafValues></_>
    <_>
      <internalNodes>
        0 -1 74357 6.7506106570363045e-03</internalNodes>
      <leafValues>
        -3.1112384796142578e-01 5.8661705255508423e-01</leafValues></_>
    <_>
      <internalNodes>
        0 -1 43174 1.4440346509218216e-02</internalNodes>
      <leafValues>
        -6.8866354227066040e-01 2.0268236100673676e-01</leafValues></_>
    <_>
      <internalNodes>
        0 -1 101813 3.2704853219911456e-04</internalNodes>
      <leafValues>
        1.8366733193397522e-01 -6.0678368806838989e-01</leafValues></_>
    <_>
      <internalNodes>
        0 -1 45425 1.8947472795844078e-02</internalNodes>
      <leafValues>
        1.4998333156108856e-01 -8.0414587259292603e-01</leafValues></_></weakClassifiers></stage8>
</opencv_storage>
