<?xml version="1.0"?>
<opencv_storage>
<stage16>
  <maxWeakCount>15</maxWeakCount>
  <stageThreshold>-9.7048681974411011e-01</stageThreshold>
  <weakClassifiers>
    <_>
      <internalNodes>
        0 -1 67385 -1.3158810324966908e-02</internalNodes>
      <leafValues>
        6.2228518724441528e-01 -3.6054420471191406e-01</leafValues></_>
    <_>
      <internalNodes>
        0 -1 43393 2.7275951579213142e-02</internalNodes>
      <leafValues>
        -5.4027771949768066e-01 3.7713322043418884e-01</leafValues></_>
    <_>
      <internalNodes>
        0 -1 32850 -1.8927656114101410e-02</internalNodes>
      <leafValues>
        2.0416505634784698e-01 -6.6977739334106445e-01</leafValues></_>
    <_>
      <internalNodes>
        0 -1 44049 2.9608039185404778e-03</internalNodes>
      <leafValues>
        1.5094287693500519e-01 -8.2049411535263062e-01</leafValues></_>
    <_>
      <internalNodes>
        0 -1 84418 -4.3774029472842813e-04</internalNodes>
      <leafValues>
        -7.1671521663665771e-01 1.7434193193912506e-01</leafValues></_>
    <_>
      <internalNodes>
        0 -1 30525 1.2675479054450989e-02</internalNodes>
      <leafValues>
        -2.5481286644935608e-01 5.8788847923278809e-01</leafValues></_>
    <_>
      <internalNodes>
        0 -1 43888 2.7317230124026537e-03</internalNodes>
      <leafValues>
        1.4363951981067657e-01 -8.5173380374908447e-01</leafValues></_>
    <_>
      <internalNodes>
        0 -1 32291 -3.4962341189384460e-02</internalNodes>
      <leafValues>
        7.1554201841354370e-01 -1.9312210381031036e-01</leafValues></_>
    <_>
      <internalNodes>
        0 -1 5596 -4.6902209520339966e-02</internalNodes>
      <leafValues>
        7.2531819343566895e-01 -1.9071970880031586e-01</leafValues></_>
    <_>
      <internalNodes>
        0 -1 110115 -2.5997646152973175e-02</internalNodes>
      <leafValues>
        4.4836685061454773e-01 -2.7953568100929260e-01</leafValues></_>
    <_>
      <internalNodes>
        0 -1 101717 4.3684646487236023e-02</internalNodes>
      <leafValues>
        -1.8014849722385406e-01 5.9902334213256836e-01</leafValues></_>
    <_>
      <internalNodes>
        0 -1 84282 -9.3608833849430084e-03</internalNodes>
      <leafValues>
        -6.4537626504898071e-01 1.8902385234832764e-01</leafValues></_>
    <_>
      <internalNodes>
        0 -1 43509 -6.8172026658430696e-04</internalNodes>
      <leafValues>
        -7.0746415853500366e-01 1.1300337314605713e-01</leafValues></_>
    <_>
      <internalNodes>
        0 -1 69020 -7.7366642653942108e-03</internalNodes>
      <leafValues>
        6.2662202119827271e-01 -1.7582444846630096e-01</leafValues></_>
    <_>
      <internalNodes>
        0 -1 79837 9.4310771673917770e-03</internalNodes>
      <leafValues>
        -3.8250553607940674e-01 2.9241088032722473e-01</leafValues></_></weakClassifiers></stage16>
</opencv_storage>
