<?xml version="1.0"?>
<opencv_storage>
<stage10>
  <maxWeakCount>10</maxWeakCount>
  <stageThreshold>-1.2779016494750977e+00</stageThreshold>
  <weakClassifiers>
    <_>
      <internalNodes>
        0 -1 79179 -1.1379950447008014e-03</internalNodes>
      <leafValues>
        5.7595717906951904e-01 -6.9877409934997559e-01</leafValues></_>
    <_>
      <internalNodes>
        0 -1 100716 1.5430656261742115e-02</internalNodes>
      <leafValues>
        -5.1290822029113770e-01 4.6108689904212952e-01</leafValues></_>
    <_>
      <internalNodes>
        0 -1 23795 -1.4854750595986843e-02</internalNodes>
      <leafValues>
        4.0167170763015747e-01 -5.4765146970748901e-01</leafValues></_>
    <_>
      <internalNodes>
        0 -1 72929 6.6869705915451050e-04</internalNodes>
      <leafValues>
        2.3579192161560059e-01 -6.6516667604446411e-01</leafValues></_>
    <_>
      <internalNodes>
        0 -1 35548 -2.8570817783474922e-02</internalNodes>
      <leafValues>
        -7.8405147790908813e-01 1.7053350806236267e-01</leafValues></_>
    <_>
      <internalNodes>
        0 -1 83061 4.3761683627963066e-03</internalNodes>
      <leafValues>
        -7.3159712553024292e-01 2.1256078779697418e-01</leafValues></_>
    <_>
      <internalNodes>
        0 -1 80207 8.9199189096689224e-03</internalNodes>
      <leafValues>
        -2.8021463751792908e-01 5.9884554147720337e-01</leafValues></_>
    <_>
      <internalNodes>
        0 -1 64580 4.0526594966650009e-03</internalNodes>
      <leafValues>
        -4.9054226279258728e-01 2.8383764624595642e-01</leafValues></_>
    <_>
      <internalNodes>
        0 -1 84298 -4.4603654532693326e-04</internalNodes>
      <leafValues>
        -9.3494343757629395e-01 1.3628655672073364e-01</leafValues></_>
    <_>
      <internalNodes>
        0 -1 28316 4.4420750782592222e-05</internalNodes>
      <leafValues>
        -5.2534347772598267e-01 1.9860096275806427e-01</leafValues></_></weakClassifiers></stage10>
</opencv_storage>
