{
  "height": 25,
  "command": null,
  "version": 1,
  "title": "scale compose service",
  "env": {
    "SHELL": "/bin/zsh",
    "TERM": "screen-256color"
  },
  "stdout": [
    [
      0.668783,
      "\u001b[1m\u001b[3m%\u001b[23m\u001b[1m\u001b[0m                                                                                                                                                                             \r \r"
    ],
    [
      3.4e-05,
      "\u001bk../mycomposeapp\u001b\\"
    ],
    [
      0.020821,
      "\r\u001b[31m»\u001b[00m \u001b[K"
    ],
    [
      2.5e-05,
      "\u001b[?1h\u001b=\u001b[?2004h"
    ],
    [
      0.532458,
      "d"
    ],
    [
      0.128929,
      "\bdo"
    ],
    [
      0.135583,
      "c"
    ],
    [
      0.071798,
      "k"
    ],
    [
      0.166858,
      "e"
    ],
    [
      0.111374,
      "r"
    ],
    [
      0.095819,
      " "
    ],
    [
      0.18593,
      "p"
    ],
    [
      0.136178,
      "s"
    ],
    [
      0.295947,
      "\u001b[?1l\u001b>"
    ],
    [
      6.8e-05,
      "\u001b[?2004l\r\r\n"
    ],
    [
      0.059833,
      "CONTAINER ID"
    ],
    [
      4.9e-05,
      "        "
    ],
    [
      3.3e-05,
      "IMAGE"
    ],
    [
      3.3e-05,
      "        "
    ],
    [
      3.1e-05,
      "        "
    ],
    [
      3e-05,
      "        "
    ],
    [
      3.2e-05,
      "        "
    ],
    [
      2.9e-05,
      "COMMAND"
    ],
    [
      2.9e-05,
      "        "
    ],
    [
      2.8e-05,
      "        "
    ],
    [
      3e-05,
      "  "
    ],
    [
      3.2e-05,
      "CREATED"
    ],
    [
      3e-05,
      "        "
    ],
    [
      2.9e-05,
      "     "
    ],
    [
      2.9e-05,
      "STATUS"
    ],
    [
      3.6e-05,
      "              PORTS"
    ],
    [
      2e-05,
      "                    NAMES\r\n"
    ],
    [
      4.7e-05,
      "b11b11d8d02c"
    ],
    [
      2.7e-05,
      "        "
    ],
    [
      2.9e-05,
      "redis:alpine"
    ],
    [
      3e-05,
      "        "
    ],
    [
      2.9e-05,
      "        "
    ],
    [
      7e-05,
      "        "
    ],
    [
      3.3e-05,
      " "
    ],
    [
      3.5e-05,
      "\"docker-entrypoint.s…\""
    ],
    [
      2.9e-05,
      "   "
    ],
    [
      2.9e-05,
      "11 minutes ago"
    ],
    [
      3e-05,
      "      "
    ],
    [
      2.6e-05,
      "Up 10 minutes"
    ],
    [
      0.00013,
      "                                mycomposeapp_redis_1\r\n869f3b23c67c        mycomposeapp_web                     \"python app.py\"          "
    ],
    [
      2.7e-05,
      "11 minutes ago      Up 10 minutes                       "
    ],
    [
      0.000235,
      "         mycomposeapp_web_1\r\nee70f4a2c2e2"
    ],
    [
      3.5e-05,
      "        coltonv/docker-introduction-slides   \"/usr/local/bin/dumb…\"   2 hours ago         Up 2 hours          0.0.0.0:8000->8000/tcp   docker-intro\r\n"
    ],
    [
      0.00153,
      "\u001b[1m\u001b[3m%\u001b[23m\u001b[1m\u001b[0m                                                                                                                                                                             \r \r\u001bk../mycomposeapp\u001b\\"
    ],
    [
      0.02241,
      "\r\u001b[31m»\u001b[00m \u001b[K"
    ],
    [
      2.8e-05,
      "\u001b[?1h\u001b=\u001b[?2004h"
    ],
    [
      1.112943,
      "d"
    ],
    [
      0.167815,
      "\bdo"
    ],
    [
      0.109844,
      "c"
    ],
    [
      0.104034,
      "k"
    ],
    [
      0.178058,
      "e"
    ],
    [
      0.125744,
      "r"
    ],
    [
      0.384393,
      "-"
    ],
    [
      0.186012,
      "c"
    ],
    [
      0.112571,
      "o"
    ],
    [
      0.173395,
      "m"
    ],
    [
      0.218628,
      "p"
    ],
    [
      0.607437,
      "o"
    ],
    [
      0.335551,
      "s"
    ],
    [
      0.394448,
      "e"
    ],
    [
      0.196231,
      " "
    ],
    [
      0.199512,
      "u"
    ],
    [
      0.266881,
      "p"
    ],
    [
      0.134805,
      " "
    ],
    [
      0.287001,
      "-"
    ],
    [
      0.169293,
      "d"
    ],
    [
      0.119665,
      " "
    ],
    [
      0.215522,
      "-"
    ],
    [
      0.152619,
      "-"
    ],
    [
      0.104407,
      "s"
    ],
    [
      0.216048,
      "c"
    ],
    [
      0.208037,
      "a"
    ],
    [
      0.125275,
      "l"
    ],
    [
      0.071311,
      "e"
    ],
    [
      0.163422,
      " "
    ],
    [
      0.149445,
      "r"
    ],
    [
      0.106698,
      "e"
    ],
    [
      0.231007,
      "d"
    ],
    [
      0.102615,
      "i"
    ],
    [
      0.079916,
      "s"
    ],
    [
      0.296584,
      "="
    ],
    [
      0.184771,
      "4"
    ],
    [
      0.423419,
      "\u001b[?1l\u001b>"
    ],
    [
      4.7e-05,
      "\u001b[?2004l\r\r\n"
    ],
    [
      0.608976,
      "mycomposeapp_web_1 is up-to-date\r\n"
    ],
    [
      0.000368,
      "Starting mycomposeapp_redis_1 ... \r\r\n"
    ],
    [
      0.000486,
      "\u001b[1A\u001b[2K\rStarting mycomposeapp_redis_1 ... \u001b[32mdone\u001b[0m\r"
    ],
    [
      2.2e-05,
      "\u001b[1B"
    ],
    [
      0.003597,
      "Creating mycomposeapp_redis_2 ... \r\r\nCreating mycomposeapp_redis_3 ... \r\r\nCreating mycomposeapp_redis_4 ... \r\r\n"
    ],
    [
      0.008657,
      "Creating mycomposeapp_redis_2\r\n"
    ],
    [
      0.001717,
      "Creating mycomposeapp_redis_4\r\n"
    ],
    [
      0.000535,
      "Creating mycomposeapp_redis_3\r\n"
    ],
    [
      0.59493,
      "\u001b[3A\u001b[2K\rCreating mycomposeapp_redis_2 ... \u001b[32mdone\u001b[0m\r\u001b[3B"
    ],
    [
      0.216867,
      "\u001b[2A\u001b[2K\rCreating mycomposeapp_redis_3 ... \u001b[32mdone\u001b[0m\r"
    ],
    [
      6.2e-05,
      "\u001b[2B"
    ],
    [
      0.907305,
      "\u001b[1A\u001b[2K\rCreating mycomposeapp_redis_4 ... \u001b[32mdone\u001b[0m\r\u001b[1B"
    ],
    [
      0.029349,
      "\u001b[1m\u001b[3m%\u001b[23m\u001b[1m\u001b[0m                                                                                                                                                                             \r \r"
    ],
    [
      0.000151,
      "\u001bk../mycomposeapp\u001b\\"
    ],
    [
      0.008342,
      "\r\u001b[31m»\u001b[00m \u001b[K\u001b[?1h\u001b=\u001b[?2004h"
    ],
    [
      1.527822,
      "d"
    ],
    [
      0.131346,
      "\bdo"
    ],
    [
      0.111229,
      "c"
    ],
    [
      0.117046,
      "k"
    ],
    [
      0.088818,
      "e"
    ],
    [
      0.119968,
      "r"
    ],
    [
      0.069737,
      " "
    ],
    [
      0.114015,
      "p"
    ],
    [
      0.130602,
      "s"
    ],
    [
      0.232228,
      "\u001b[?1l\u001b>"
    ],
    [
      7.7e-05,
      "\u001b[?2004l\r\r\n"
    ],
    [
      0.100415,
      "CONTAINER ID"
    ],
    [
      0.000108,
      "        "
    ],
    [
      0.000201,
      "IMAGE"
    ],
    [
      0.000183,
      "        "
    ],
    [
      0.000183,
      "        "
    ],
    [
      0.000184,
      "        "
    ],
    [
      0.000158,
      "        "
    ],
    [
      5e-05,
      "COMMAND"
    ],
    [
      4.9e-05,
      "        "
    ],
    [
      5e-05,
      "        "
    ],
    [
      0.000198,
      "  "
    ],
    [
      4.2e-05,
      "CREATED"
    ],
    [
      4.3e-05,
      "        "
    ],
    [
      3.4e-05,
      "     "
    ],
    [
      4.1e-05,
      "STATUS"
    ],
    [
      3.5e-05,
      "        "
    ],
    [
      4.1e-05,
      "      "
    ],
    [
      0.000208,
      "PORTS                    NAMES\r\nd434da376ace        redis:alpine                         \"docker-entrypoint.s…\""
    ],
    [
      2.6e-05,
      "   5 seconds ago       Up 3 seconds        6379/tcp                "
    ],
    [
      1.8e-05,
      " mycomposeapp_redis_3"
    ],
    [
      1.6e-05,
      "\r\ncf0384394079"
    ],
    [
      1.6e-05,
      "        redis:alpine"
    ],
    [
      0.00042,
      "                "
    ],
    [
      3.3e-05,
      "         \"docker-entrypoint.s…\"   5 seconds ago       Up 2 seconds        6379/tcp                 mycomposeapp_redis_4\r\nbeb7167df3fb        redis:alpine                         \"docker-entrypoint.s…\"   5 seconds ago       Up 3 seconds        6379/tcp                 mycomposeapp_redis_2\r\nb11b11d8d02c        redis:alpine                         \"docker-entrypoint.s…\"   12 minutes ago      Up 10 minutes                                mycomposeapp_redis_1\r\n869f3b23c67c        mycomposeapp_web                     \"python app.py\"          12 minutes ago      Up 10 minutes                                "
    ],
    [
      2.3e-05,
      "mycomposeapp_web_1\r\nee70f4a2c2e2        coltonv/docker-introduction-slides"
    ],
    [
      4e-05,
      "   \"/usr/local/bin/dumb…\""
    ],
    [
      2.9e-05,
      "   2 hours ago         Up 2 hours          0.0.0.0:8000->8000/tcp"
    ],
    [
      6.2e-05,
      "   docker-intro\r\n"
    ],
    [
      0.00246,
      "\u001b[1m\u001b[3m%\u001b[23m\u001b[1m\u001b[0m                                                                                                                                                                             \r \r"
    ],
    [
      0.000129,
      "\u001bk../mycomposeapp\u001b\\"
    ],
    [
      0.016482,
      "\r\u001b[31m»\u001b[00m \u001b[K\u001b[?1h\u001b=\u001b[?2004h"
    ],
    [
      2.233865,
      "d"
    ],
    [
      0.15213,
      "\bdo"
    ],
    [
      0.129904,
      "c"
    ],
    [
      0.088587,
      "k"
    ],
    [
      0.151189,
      "e"
    ],
    [
      0.129064,
      "r"
    ],
    [
      0.366485,
      "-"
    ],
    [
      0.222588,
      "c"
    ],
    [
      0.106281,
      "o"
    ],
    [
      0.173548,
      "m"
    ],
    [
      0.354304,
      "p"
    ],
    [
      0.400913,
      "o"
    ],
    [
      0.187805,
      "s"
    ],
    [
      0.178882,
      "e"
    ],
    [
      0.151015,
      " "
    ],
    [
      0.201457,
      "u"
    ],
    [
      0.179507,
      "p"
    ],
    [
      0.164215,
      " "
    ],
    [
      0.26239,
      "-"
    ],
    [
      0.169737,
      "d"
    ],
    [
      0.111655,
      " "
    ],
    [
      0.256301,
      "-"
    ],
    [
      0.173673,
      "-"
    ],
    [
      0.192421,
      "s"
    ],
    [
      0.265558,
      "c"
    ],
    [
      0.205263,
      "a"
    ],
    [
      0.131036,
      "l"
    ],
    [
      0.073384,
      "e"
    ],
    [
      0.207065,
      " "
    ],
    [
      0.695699,
      "r"
    ],
    [
      0.071752,
      "e"
    ],
    [
      0.256137,
      "d"
    ],
    [
      0.592282,
      "i"
    ],
    [
      0.135659,
      "s"
    ],
    [
      0.286666,
      "="
    ],
    [
      0.249418,
      "1"
    ],
    [
      0.49846,
      "\u001b[?1l\u001b>"
    ],
    [
      0.000335,
      "\u001b[?2004l\r\r\n"
    ],
    [
      0.634465,
      "mycomposeapp_web_1 is up-to-date\r\n"
    ],
    [
      0.000215,
      "Stopping and removing mycomposeapp_redis_2 ... \r\r\n"
    ],
    [
      1.5e-05,
      "Stopping and removing mycomposeapp_redis_3 ... \r\r\n"
    ],
    [
      0.000101,
      "Stopping and removing mycomposeapp_redis_4 ... \r\r\n"
    ],
    [
      0.512544,
      "\u001b[3A\u001b[2K\rStopping and removing mycomposeapp_redis_2 ... \u001b[32mdone\u001b[0m\r\u001b[3B"
    ],
    [
      0.063957,
      "\u001b[2A\u001b[2K\rStopping and removing mycomposeapp_redis_3 ... \u001b[32mdone\u001b[0m\r\u001b[2B"
    ],
    [
      0.064231,
      "\u001b[1A\u001b[2K\rStopping and removing mycomposeapp_redis_4 ... \u001b[32mdone\u001b[0m\r\u001b[1B"
    ],
    [
      0.000289,
      "Starting mycomposeapp_redis_1 ... \r\r\n"
    ],
    [
      0.001061,
      "\u001b[1A\u001b[2K\rStarting mycomposeapp_redis_1 ... \u001b[32mdone\u001b[0m\r\u001b[1B"
    ],
    [
      0.077557,
      "\u001b[1m\u001b[3m%\u001b[23m\u001b[1m\u001b[0m                                                                                                                                                                             \r \r"
    ],
    [
      0.000254,
      "\u001bk../mycomposeapp\u001b\\"
    ],
    [
      0.037847,
      "\r\u001b[31m»\u001b[00m "
    ],
    [
      0.000156,
      "\u001b[K"
    ],
    [
      0.000231,
      "\u001b[?1h\u001b="
    ],
    [
      0.000213,
      "\u001b[?2004h"
    ],
    [
      0.840134,
      "d"
    ],
    [
      0.15423,
      "\bdo"
    ],
    [
      0.15162,
      "c"
    ],
    [
      0.080144,
      "k"
    ],
    [
      0.132877,
      "e"
    ],
    [
      0.123176,
      "r"
    ],
    [
      0.085095,
      " "
    ],
    [
      0.137522,
      "p"
    ],
    [
      0.10519,
      "s"
    ],
    [
      0.255762,
      "\u001b[?1l\u001b>\u001b[?2004l\r\r\n"
    ],
    [
      0.001739,
      "\u001bkdocker\u001b\\"
    ],
    [
      0.101529,
      "CONTAINER ID        IMAGE                                COMMAND"
    ],
    [
      3.2e-05,
      "                  "
    ],
    [
      0.000273,
      "CREATED             STATUS              PORTS                    NAMES\r\n"
    ],
    [
      2.6e-05,
      "b11b11d8d02c        "
    ],
    [
      0.000144,
      "redis:alpine"
    ],
    [
      4.2e-05,
      "        "
    ],
    [
      5e-05,
      "        "
    ],
    [
      3.9e-05,
      "        "
    ],
    [
      3.5e-05,
      " "
    ],
    [
      4.1e-05,
      "\"docker-entrypoint.s…\""
    ],
    [
      4.1e-05,
      "   "
    ],
    [
      3.5e-05,
      "12 minutes ago"
    ],
    [
      3.6e-05,
      "      "
    ],
    [
      3.9e-05,
      "Up 10 minutes"
    ],
    [
      3.6e-05,
      "       "
    ],
    [
      3.8e-05,
      "        "
    ],
    [
      3.5e-05,
      "        "
    ],
    [
      3.5e-05,
      "        "
    ],
    [
      3.7e-05,
      " "
    ],
    [
      3.6e-05,
      "mycomposeapp_redis_1"
    ],
    [
      7.9e-05,
      "\r\n"
    ],
    [
      4.1e-05,
      "869f3b23c67c"
    ],
    [
      3.8e-05,
      "        "
    ],
    [
      8.3e-05,
      "mycomposeapp_web                     \"python app.py\"          12 minutes ago      Up 10 minutes       "
    ],
    [
      3.5e-05,
      "                         mycomposeapp_web_1"
    ],
    [
      1.8e-05,
      "\r\nee70f4a2c2e2        coltonv/docker-introduction-slides   \"/usr/local/bin/dumb…\"   "
    ],
    [
      2.1e-05,
      "2 hours ago        "
    ],
    [
      1.6e-05,
      " Up 2 hours          0.0.0.0:8000->8000/tcp"
    ],
    [
      2.6e-05,
      "   docker-intro\r\n"
    ],
    [
      0.001194,
      "\u001b[1m\u001b[3m%\u001b[23m\u001b[1m\u001b[0m                                                                                                                                                                             \r \r"
    ],
    [
      0.000115,
      "\u001bk../mycomposeapp\u001b\\"
    ],
    [
      0.015727,
      "\r\u001b[31m»\u001b[00m \u001b[K"
    ],
    [
      3e-05,
      "\u001b[?1h\u001b="
    ],
    [
      1.1e-05,
      "\u001b[?2004h"
    ],
    [
      1.934563,
      "\u001b[?2004l\r\r\n"
    ]
  ],
  "duration": 32.959962,
  "width": 174
}
