<?xml version="1.0" encoding="UTF-8" standalone="no"?>
<!-- Created with Inkscape (http://www.inkscape.org/) -->

<svg
   width="25.863775mm"
   height="25.842945mm"
   viewBox="0 0 25.863776 25.842944"
   version="1.1"
   id="svg5"
   xml:space="preserve"
   inkscape:version="1.2.2 (b0a8486541, 2022-12-01)"
   sodipodi:docname="luna-prj-new.svg"
   inkscape:export-filename="luna-prj-new.png"
   inkscape:export-xdpi="785.65479"
   inkscape:export-ydpi="785.65479"
   xmlns:inkscape="http://www.inkscape.org/namespaces/inkscape"
   xmlns:sodipodi="http://sodipodi.sourceforge.net/DTD/sodipodi-0.dtd"
   xmlns="http://www.w3.org/2000/svg"
   xmlns:svg="http://www.w3.org/2000/svg"><sodipodi:namedview
     id="namedview7"
     pagecolor="#ffffff"
     bordercolor="#000000"
     borderopacity="0.25"
     inkscape:showpageshadow="2"
     inkscape:pageopacity="0.0"
     inkscape:pagecheckerboard="0"
     inkscape:deskcolor="#d1d1d1"
     inkscape:document-units="mm"
     showgrid="false"
     inkscape:zoom="7.681567"
     inkscape:cx="29.486171"
     inkscape:cy="41.85344"
     inkscape:window-width="1920"
     inkscape:window-height="1123"
     inkscape:window-x="0"
     inkscape:window-y="40"
     inkscape:window-maximized="1"
     inkscape:current-layer="layer1" /><defs
     id="defs2" /><g
     inkscape:label="Layer 1"
     inkscape:groupmode="layer"
     id="layer1"
     transform="translate(-92.882029,-183.73757)"><g
       id="breadboard"
       transform="matrix(0.35277779,0,0,0.35277779,102.74571,185.58051)"
       inkscape:label="breadboard"
       inkscape:groupmode="layer"><metadata
         id="CorelCorpID_0Corel-Layer" /><polygon
         points="0,68.0315 45.3546,68.0315 45.3546,0 0,0 "
         fill-rule="nonzero"
         fill="#373435"
         id="polygon12154" /><path
         d="m 8.93051,1.50486 h 0.15083 0.151516 2.79378 0.224874 0.07747 c 0.333197,0 0.604691,0.272178 0.604691,0.604688 v 10.4641 h 1.58372 v -10.4641 c 0,-0.33251 0.271494,-0.604688 0.604691,-0.604688 h 0.15083 0.151516 2.79378 0.224874 0.07747 c 0.333197,0 0.604691,0.272178 0.604691,0.604688 v 10.4641 h 1.58372 v -10.4641 c 0,-0.33251 0.271494,-0.604688 0.604691,-0.604688 h 0.15083 0.151516 2.79378 0.224874 0.07747 c 0.333197,0 0.604691,0.272178 0.604691,0.604688 v 10.4641 h 1.58372 v -10.4641 c 0,-0.33251 0.271494,-0.604688 0.604691,-0.604688 h 0.302346 c 0.0192,0 0.03839,6.856e-4 0.0569,0.00274 0.01783,-0.00137 0.03634,-0.00274 0.05416,-0.00274 h 11.0661 c 0.316743,0 0.576582,0.259152 0.576582,0.575893 v 0.37913 c 0,0.316741 -0.259839,0.575893 -0.576582,0.575893 h -10.5725 v 10.4641 c 0,0.33251 -0.27218,0.604688 -0.604691,0.604688 h -0.07747 -0.224874 -2.79378 -0.151516 -0.15083 c -0.333197,0 -0.604691,-0.272178 -0.604691,-0.604688 v -10.4641 h -1.58372 v 10.4641 c 0,0.33251 -0.27218,0.604688 -0.604691,0.604688 h -0.07747 -0.224874 -2.79378 -0.151516 -0.15083 c -0.333197,0 -0.604691,-0.272178 -0.604691,-0.604688 v -10.4641 h -1.58372 v 10.4641 c 0,0.33251 -0.27218,0.604688 -0.604691,0.604688 h -0.07747 -0.224874 -2.79378 -0.151516 -0.15083 c -0.333197,0 -0.604691,-0.272178 -0.604691,-0.604688 V 3.035776 H 9.8375218 v 14.7504 H 28.095522 c 0.317429,0 0.575897,0.259152 0.575897,0.575893 v 0.37913 c 0,0.316741 -0.258468,0.575893 -0.575897,0.575893 H 9.8375218 v 1.68654 h -1.51173 v -18.8955 c 0,-0.33251 0.271494,-0.604688 0.604691,-0.604688 z"
         fill="#fff39d"
         id="path12156" /><g
         id="chip-led0805_3_"><line
           y2="15.9762"
           y1="15.9762"
           gorn="0.2.11.0.0.0.0.0.0.0.0.0.0.0.0.0.0.0"
           x2="36.738098"
           id="_0.1.11.0.0.0.0.0.0"
           fill="none"
           x1="42.370899" /><rect
           gorn="0.2.11.0.0.0.0.0.0.0.0.0.0.0.0.0.0.1.0.0.0.0"
           width="5.7205701"
           id="_0.1.11.0.0.0.0.0.1.0"
           fill="#f2f2f2"
           x="36.6483"
           height="2.98436"
           y="15.9721" /><path
           fill-opacity="0.701961"
           gorn="0.2.11.0.0.0.0.0.0.0.0.0.0.0.0.0.0.2"
           d="m 38.6735,15.9714 c 0,0 -0.501853,0.363361 -0.674622,0.331824 -0.170712,-0.03222 -0.421639,0.115179 -0.526534,0 l 0.01371,-0.330453 1.18744,-0.0014 z"
           id="_0.1.11.0.0.0.0.0.2"
           fill="#22b573" /><rect
           gorn="0.2.11.0.0.0.0.0.0.0.0.0.0.0.0.0.0.3.0.0.0.0.0"
           width="0.66502303"
           id="_0.1.11.0.0.0.0.0.3.0.0"
           fill="#ffffff"
           x="39.2309"
           height="0.74797601"
           y="17.1143" /><rect
           gorn="0.2.11.0.0.0.0.0.0.0.0.0.0.0.0.0.0.3.1.0.0.0.0"
           width="0.66502303"
           id="_0.1.11.0.0.0.0.0.3.1.0"
           fill="#b3b3b3"
           x="39.2309"
           height="0.038392901"
           y="17.0937" /><polygon
           points="38.2217,16.3033 37.4724,16.2224 37.4724,16.7914 38.2217,16.7105 "
           gorn="0.2.11.0.0.0.0.0.0.0.0.0.0.0.0.0.0.4.0"
           id="_0.1.11.0.0.0.0.0.4.0"
           fill="#d1c690" /><path
           gorn="0.2.11.0.0.0.0.0.0.0.0.0.0.0.0.0.0.4.1.0"
           d="m 38.1744,16.4568 c 0.0014,0 0.0034,0 0.0062,0 0.207049,0.02674 0.347595,0.0809 0.465516,0.126148 0.162485,0.06239 0.43535,0.608801 0.644456,0.541614 0.02125,-0.0089 0.04662,0.0089 0.05142,0.03359 0.0062,0.02742 -0.0082,0.05279 -0.03085,0.06033 -0.237215,0.07404 -0.524477,-0.480597 -0.695189,-0.545727 -0.115179,-0.04662 -0.247498,-0.09598 -0.445634,-0.120663 -0.02262,-0.0034 -0.04251,-0.02605 -0.03839,-0.05279 0.0021,-0.02262 0.01988,-0.04251 0.04113,-0.04251 z"
           id="_0.1.11.0.0.0.0.0.4.1.0"
           fill="#d1c690" /><polygon
           points="40.8845,18.5499 41.636,18.6301 41.636,18.0618 40.8845,18.142 "
           gorn="0.2.11.0.0.0.0.0.0.0.0.0.0.0.0.0.0.4.2"
           id="_0.1.11.0.0.0.0.0.4.2"
           fill="#d1c690" /><path
           gorn="0.2.11.0.0.0.0.0.0.0.0.0.0.0.0.0.0.4.3.0"
           d="m 39.597,17.3659 c 0.0192,0 0.03771,0.01577 0.04251,0.03634 0.04868,0.227615 0.846705,0.896748 1.46717,0.896748 0.02537,0 0.04456,0.02057 0.04456,0.04936 -0.0014,0.02605 -0.01988,0.04936 -0.04456,0.04936 h -0.0014 c -0.582753,0 -1.47196,-0.599203 -1.55149,-0.96942 -0.0062,-0.02674 0.0096,-0.05279 0.03222,-0.06033 0.0041,-0.0014 0.0069,-0.0014 0.01097,-0.0014 z"
           id="_0.1.11.0.0.0.0.0.4.3.0"
           fill="#d1c690" /><path
           gorn="0.2.11.0.0.0.0.0.0.0.0.0.0.0.0.0.0.4.4"
           d="m 39.2316,17.355 c 0,0 0.276979,0.0014 0.298232,-0.242012 -0.05485,0 -0.298232,0 -0.298232,0 z"
           id="_0.1.11.0.0.0.0.0.4.4"
           fill="#d1c690" /><path
           gorn="0.2.11.0.0.0.0.0.0.0.0.0.0.0.0.0.0.4.5"
           d="m 39.5703,17.6038 c 0,0 -0.122721,-0.237899 -0.04114,-0.273549 0.08364,-0.03771 0.138489,-0.04045 0.187166,0.02194 0.04731,0.06376 -0.146031,0.251611 -0.14603,0.25161 z"
           id="_0.1.11.0.0.0.0.0.4.5"
           fill="#d1c690" /><path
           gorn="0.2.11.0.0.0.0.0.0.0.0.0.0.0.0.0.0.4.6"
           d="m 39.2905,17.0835 c -0.209791,0.06513 -0.481971,-0.481282 -0.644456,-0.543671 -0.113123,-0.04662 -0.257097,-0.09873 -0.465516,-0.126148 v 0.04593 c 0.207049,0.02674 0.347595,0.0809 0.465516,0.126148 0.162485,0.06239 0.43535,0.608801 0.644456,0.541614 z"
           id="_0.1.11.0.0.0.0.0.4.6"
           fill="#9d956c" /><polygon
           points="40.8845,18.1009 41.636,18.02 41.636,18.0618 40.8845,18.142 "
           gorn="0.2.11.0.0.0.0.0.0.0.0.0.0.0.0.0.0.4.7"
           id="_0.1.11.0.0.0.0.0.4.7"
           fill="#9d956c" /><path
           gorn="0.2.11.0.0.0.0.0.0.0.0.0.0.0.0.0.0.4.8"
           d="m 39.6416,17.3598 c 0.04799,0.226929 0.832993,0.943368 1.46717,0.894691 v 0.04662 c -0.682849,0.04662 -1.42192,-0.669819 -1.46922,-0.896748 l 0.0014,-0.04456 z"
           id="_0.1.11.0.0.0.0.0.4.8"
           fill="#9d956c" /><path
           gorn="0.2.11.0.0.0.0.0.0.0.0.0.0.0.0.0.0.4.9"
           d="m 39.5298,17.0691 c -0.05416,0 -0.296175,0 -0.296175,0 v 0.04456 c 0,0 0.242014,0 0.296861,0 V 17.0691 Z"
           id="_0.1.11.0.0.0.0.0.4.9"
           fill="#9d956c" /><path
           gorn="0.2.11.0.0.0.0.0.0.0.0.0.0.0.0.0.0.4.10"
           d="m 39.7163,17.3118 c -0.04936,-0.06239 -0.102153,-0.05896 -0.18511,-0.024 l -0.0014,0.04662 c 0.08296,-0.03839 0.139175,-0.04045 0.186481,0.02194 z"
           id="_0.1.11.0.0.0.0.0.4.10"
           fill="#9d956c" /><polygon
           points="41.2177,18.9181 37.9303,18.9181 37.9303,18.9572 41.2177,18.9572 "
           fill-opacity="0.501961"
           gorn="0.2.11.0.0.0.0.0.0.0.0.0.0.0.0.0.0.5.0.0.0.0"
           id="_0.1.11.0.0.0.0.0.5.0"
           fill="#ffffff"
           enable-background="new    " /><polygon
           points="41.6229,18.9558 41.6229,15.9735 37.484,15.9735 37.4806,18.9558 "
           fill-opacity="0.501961"
           gorn="0.2.11.0.0.0.0.0.0.0.0.0.0.0.0.0.0.6"
           id="_0.1.11.0.0.0.0.0.6"
           fill="#f2f2f2"
           enable-background="new    " /><path
           fill-opacity="0.54902"
           gorn="0.2.11.0.0.0.0.0.0.0.0.0.0.0.0.0.0.7"
           d="m 41.5832,18.4492 v 0.211161 c -0.01371,0.117921 0.0096,0.211161 -0.0761,0.211161 -0.4758,0 -3.66106,0 -3.77898,0 -0.130948,0 -0.137118,-0.05073 0.0089,-0.05073 0.102153,0 3.031,0 3.38339,0 0.355822,0 0.403128,-0.08159 0.403128,-0.153572 l -0.0014,-0.211847 c 6.86e-4,-0.141231 0.06102,-0.141231 0.06102,-0.0062 z"
           id="_0.1.11.0.0.0.0.0.7"
           fill="#ffffff"
           enable-background="new    " /><path
           fill-opacity="0.031373"
           gorn="0.2.11.0.0.0.0.0.0.0.0.0.0.0.0.0.0.8"
           d="m 37.5917,16.1463 c 0,-0.05279 -0.0089,-0.107637 0.07679,-0.107637 0.475115,0 3.63295,0 3.75018,0 0.130948,0 0.137118,0.05073 -0.0062,0.05073 -0.104895,0 -2.44276,0.0014 -2.79378,0.0014 -0.46346,6.85e-4 -1.02633,0.05553 -1.02633,0.05553 z"
           id="_0.1.11.0.0.0.0.0.8"
           fill="#000000"
           enable-background="new    " /><path
           gorn="0.2.11.0.0.0.0.0.0.0.0.0.0.0.0.0.0.9"
           d="m 42.3689,15.9714 h -0.600578 v 0.405868 c 0,0.09735 -0.06239,0.165912 -0.146031,0.208419 v 2.37213 h 0.786373 v -2.94597 -0.03908 m -0.03976,-0.0014 z"
           id="_0.1.11.0.0.0.0.0.9"
           fill="#d1c690" /><polygon
           points="42.4072,18.9181 41.6243,18.9181 41.6243,18.9585 42.4072,18.9585 "
           fill-opacity="0.501961"
           gorn="0.2.11.0.0.0.0.0.0.0.0.0.0.0.0.0.0.10.0.0.0.0"
           id="_0.1.11.0.0.0.0.0.10.0"
           fill="#ffffff"
           enable-background="new    " /><path
           gorn="0.2.11.0.0.0.0.0.0.0.0.0.0.0.0.0.0.11"
           d="m 36.649,15.9714 v 0.03839 2.94597 h 0.834364 v -2.6971 c -0.08159,-0.04388 -0.148773,-0.113807 -0.148773,-0.211161 v -0.07816 h -0.645827 m -0.03976,0.0014 z"
           id="_0.1.11.0.0.0.0.0.11"
           fill="#d1c690" /><polygon
           points="37.484,18.9167 36.649,18.9167 36.649,18.9572 37.484,18.9572 "
           fill-opacity="0.501961"
           gorn="0.2.11.0.0.0.0.0.0.0.0.0.0.0.0.0.0.12.0.0.0.0"
           id="_0.1.11.0.0.0.0.0.12.0"
           fill="#ffffff"
           enable-background="new    " /></g><g
         id="esp8266-chip"><polygon
           points="5.4292,64.5042 39.9247,64.5042 39.9247,21.0043 5.4292,21.0043 "
           stroke="#fefefe"
           stroke-width="0.720001"
           fill-rule="nonzero"
           fill="#606062"
           id="polygon12183" /><g
           id="g12281"><polygon
             points="25.9332,42.2459 26.433,42.2459 26.433,43.3565 26.906,43.3565 26.906,41.8016 24.4132,41.8016 24.4132,43.399 24.8828,43.399 24.8828,42.2459 25.4649,42.2459 25.4649,43.2852 25.9332,43.2852 "
             fill-rule="nonzero"
             fill="#e6e7e8"
             id="polygon12185" /><path
             fill-rule="nonzero"
             d="m 24.754,45.3872 c 0.124778,0.07062 0.260525,0.104895 0.409298,0.104895 0.148088,0 0.281778,-0.03496 0.390101,-0.100781 0.113808,-0.06719 0.203621,-0.167969 0.270123,-0.300973 0.03908,-0.07816 0.0857,-0.207047 0.141232,-0.409981 0.06239,-0.222816 0.109009,-0.297545 0.131634,-0.320855 0.06719,-0.06993 0.231044,-0.07404 0.31263,0.024 0.04731,0.05896 0.06993,0.143973 0.06993,0.258466 0,0.113122 -0.02674,0.194707 -0.08227,0.253667 -0.05416,0.05759 -0.143289,0.09324 -0.264638,0.100781 l -0.102153,0.01165 0.03908,0.433977 0.09393,-0.0034 c 0.156315,-0.0041 0.293433,-0.03908 0.409984,-0.106266 0.12135,-0.06582 0.21459,-0.163855 0.276979,-0.285204 0.06307,-0.11655 0.09393,-0.257781 0.09393,-0.409981 0,-0.231043 -0.06582,-0.417523 -0.202935,-0.558754 -0.141232,-0.135746 -0.316058,-0.207047 -0.52722,-0.207047 -0.117922,0 -0.226931,0.02399 -0.32497,0.07404 -0.09324,0.04662 -0.174826,0.117921 -0.233787,0.203619 -0.06239,0.08501 -0.117236,0.218017 -0.176197,0.409981 -0.06993,0.233785 -0.109009,0.331824 -0.128891,0.366789 -0.02331,0.04319 -0.05005,0.07404 -0.08638,0.09804 -0.03497,0.0192 -0.07816,0.03085 -0.124778,0.03085 -0.08913,0 -0.155629,-0.03085 -0.207049,-0.08981 -0.05416,-0.06307 -0.0857,-0.155628 -0.0857,-0.276977 0,-0.08981 0.01988,-0.167969 0.05485,-0.235156 0.03496,-0.0617 0.07747,-0.113122 0.136433,-0.147401 0.05553,-0.03908 0.140546,-0.06307 0.250241,-0.0713 l 0.101467,-0.01097 -0.04594,-0.426435 -0.09393,0.0041 c -0.266009,0.0041 -0.477171,0.0857 -0.633486,0.242698 -0.160428,0.155628 -0.2379,0.366789 -0.2379,0.625256 0,0.163855 0.03085,0.3092 0.09324,0.429863 0.06307,0.120663 0.161114,0.218702 0.281778,0.288632 z"
             fill="#e6e7e8"
             id="path12187" /><path
             fill-rule="nonzero"
             d="m 25.5774,47.4221 c 0.148088,0.117235 0.340053,0.180309 0.566298,0.180309 0.176197,0 0.32497,-0.03496 0.449748,-0.11038 0.124778,-0.07747 0.21459,-0.183052 0.26121,-0.311257 0.03497,-0.0905 0.05073,-0.222816 0.05073,-0.403125 V 45.96934 h -2.49212 v 0.44906 h 0.93309 v 0.383243 c 0,0.288632 0.07884,0.496365 0.231044,0.621142 z m 0.854932,-1.0037 v 0.383243 c 0,0.151515 -0.01508,0.207047 -0.02331,0.222816 -0.01577,0.03154 -0.04662,0.05828 -0.08981,0.08227 -0.05073,0.02674 -0.113123,0.03908 -0.187166,0.03908 -0.109695,0 -0.191967,-0.024 -0.2427,-0.07473 -0.05005,-0.05005 -0.07404,-0.13986 -0.07404,-0.264637 v -0.387357 h 0.617032 z"
             fill="#e6e7e8"
             id="path12189" /><path
             fill-rule="nonzero"
             d="m 25.1681,49.3993 c 0.16797,0 0.30783,-0.03634 0.422324,-0.106266 0.06993,-0.04251 0.128891,-0.09392 0.174826,-0.156314 0.03634,0.03908 0.07541,0.07404 0.117922,0.101467 0.09324,0.05485 0.202935,0.08158 0.332512,0.08158 0.202935,0 0.370905,-0.05828 0.499796,-0.178938 0.132319,-0.124777 0.198821,-0.278348 0.198821,-0.460715 0,-0.184423 -0.06719,-0.340051 -0.194708,-0.4614 -0.128891,-0.11655 -0.292747,-0.179624 -0.49294,-0.179624 -0.135747,0 -0.250241,0.02811 -0.342796,0.08158 -0.04251,0.02811 -0.08159,0.06307 -0.113808,0.09804 -0.04251,-0.05896 -0.09667,-0.106266 -0.159743,-0.145344 -0.113123,-0.07404 -0.261896,-0.109008 -0.433294,-0.109008 -0.234472,0 -0.425752,0.06582 -0.575211,0.199506 -0.148088,0.140545 -0.226245,0.312628 -0.226245,0.519675 0,0.202934 0.07404,0.375016 0.226245,0.510762 0.148773,0.133004 0.33594,0.204305 0.566984,0.204305 z m 0.273551,-0.527902 c -0.07062,0.06307 -0.160428,0.08981 -0.273551,0.08981 -0.117236,0 -0.202935,-0.02674 -0.270123,-0.0857 -0.0617,-0.05553 -0.09393,-0.113122 -0.09393,-0.19128 0,-0.07816 0.03222,-0.140545 0.09804,-0.196078 0.06719,-0.06239 0.155629,-0.08913 0.273551,-0.08913 0.109009,0 0.199507,0.02674 0.265324,0.08501 0.06308,0.05485 0.09324,0.117921 0.09324,0.191964 0,0.07404 -0.03085,0.141231 -0.09324,0.194707 z m 0.792543,-0.397641 c 0.07404,0 0.133005,0.01851 0.183738,0.0617 0.04319,0.04251 0.06582,0.0857 0.06582,0.140545 0,0.05827 -0.02262,0.101467 -0.07062,0.143973 -0.09735,0.08227 -0.28452,0.08981 -0.383245,0 -0.04251,-0.03908 -0.06582,-0.0857 -0.06582,-0.13986 0,-0.05896 0.02262,-0.102152 0.06582,-0.145344 0.04731,-0.03908 0.117236,-0.0617 0.202935,-0.0617 z"
             fill="#e6e7e8"
             id="path12191" /><path
             fill-rule="nonzero"
             d="m 25.9099,50.6491 c -0.109009,-0.06239 -0.270123,-0.199506 -0.476486,-0.406553 -0.19128,-0.191279 -0.35925,-0.324283 -0.507337,-0.398326 -0.140546,-0.07404 -0.27835,-0.109694 -0.414097,-0.109694 h -0.09804 v 1.44179 h 0.46963 v -0.839844 c 0.05005,0.03908 0.143974,0.124777 0.272865,0.253667 0.226931,0.219388 0.414097,0.370903 0.555329,0.453173 0.319485,0.183737 0.694504,0.172082 0.968055,-0.03908 0.157,-0.117235 0.234472,-0.292746 0.234472,-0.516247 0,-0.202934 -0.06719,-0.370903 -0.194708,-0.499793 -0.128891,-0.121349 -0.316743,-0.194707 -0.558757,-0.21116 l -0.09804,-0.0069 -0.05416,0.440833 h 0.113123 c 0.12135,0 0.215276,0.02674 0.276979,0.08159 0.05553,0.0473 0.08227,0.106266 0.08227,0.187851 0,0.06993 -0.02262,0.128205 -0.07404,0.178938 -0.109009,0.09392 -0.285206,0.11038 -0.496368,-0.01097 z"
             fill="#e6e7e8"
             id="path12193" /><path
             fill-rule="nonzero"
             d="m 24.8006,52.8951 c 0.132319,0.05759 0.289319,0.08913 0.457289,0.08913 0.246127,0 0.453176,-0.06239 0.601263,-0.187165 0.159743,-0.12889 0.2379,-0.285204 0.2379,-0.468942 0,-0.104895 -0.03085,-0.211161 -0.09256,-0.307829 -0.0041,-0.0082 -0.01234,-0.01988 -0.01988,-0.02811 0.124778,0.01645 0.226931,0.04319 0.304402,0.07816 0.19128,0.09393 0.19128,0.199506 0.19128,0.235156 0,0.05416 -0.02262,0.100781 -0.07404,0.143288 -0.0192,0.01988 -0.06993,0.05142 -0.202935,0.07541 l -0.08981,0.01508 0.04251,0.421636 0.09804,-0.01234 c 0.211162,-0.01851 0.370905,-0.08981 0.484027,-0.202934 0.113123,-0.113122 0.175511,-0.257781 0.175511,-0.429178 0,-0.231043 -0.109695,-0.422322 -0.327713,-0.566981 -0.207049,-0.137117 -0.532019,-0.202934 -1.00028,-0.202934 -0.426438,0 -0.726727,0.06582 -0.913893,0.202934 -0.199507,0.141231 -0.296861,0.324283 -0.296861,0.550527 0,0.124777 0.03497,0.238584 0.104895,0.344165 0.07062,0.100781 0.18031,0.187165 0.320857,0.250239 z m 0.753465,-0.429863 c -0.06993,0.05485 -0.174826,0.0857 -0.316058,0.0857 -0.140546,0 -0.253669,-0.03085 -0.328398,-0.08981 -0.105581,-0.07404 -0.105581,-0.140545 -0.105581,-0.160427 0,-0.07404 0.03976,-0.136431 0.113808,-0.194707 0.08227,-0.06307 0.19128,-0.09461 0.340053,-0.09461 0.128891,0 0.226245,0.02742 0.296175,0.08638 0.06719,0.05759 0.09804,0.116549 0.09804,0.18648 0,0.0713 -0.03085,0.129576 -0.09804,0.180309 z"
             fill="#e6e7e8"
             id="path12195" /><path
             fill-rule="nonzero"
             d="m 24.8006,54.692 c 0.132319,0.05828 0.289319,0.08913 0.457289,0.08913 0.246127,0 0.453176,-0.06239 0.601263,-0.187165 0.159743,-0.12889 0.2379,-0.285204 0.2379,-0.468942 0,-0.104895 -0.03085,-0.211161 -0.09256,-0.308514 -0.0041,-0.0075 -0.01234,-0.01988 -0.01988,-0.02742 0.124778,0.01577 0.226931,0.04251 0.304402,0.07747 0.19128,0.09393 0.19128,0.199506 0.19128,0.235156 0,0.05416 -0.02262,0.100781 -0.07404,0.143973 -0.0192,0.01988 -0.06993,0.05073 -0.202935,0.07404 l -0.08981,0.01645 0.04251,0.421636 0.102153,-0.01234 c 0.207049,-0.02262 0.370905,-0.08981 0.479914,-0.202934 0.116551,-0.113122 0.175511,-0.261894 0.175511,-0.429863 0,-0.230357 -0.109695,-0.420951 -0.323599,-0.566295 -0.207049,-0.140545 -0.536132,-0.202934 -1.00371,-0.202934 -0.422324,0 -0.723299,0.06239 -0.913893,0.199506 -0.196079,0.144659 -0.296861,0.327711 -0.296861,0.550527 0,0.124777 0.03496,0.242012 0.104895,0.347593 0.07062,0.101467 0.18031,0.187165 0.320857,0.250239 z m 0.753465,-0.429863 c -0.06993,0.05485 -0.174826,0.08638 -0.316058,0.08638 -0.140546,0 -0.253669,-0.03154 -0.328398,-0.0905 -0.105581,-0.07404 -0.105581,-0.140545 -0.105581,-0.159742 0,-0.07404 0.03976,-0.137117 0.113808,-0.196078 0.08227,-0.06239 0.19128,-0.09324 0.340053,-0.09324 0.128891,0 0.226245,0.02674 0.296175,0.0857 0.06719,0.05759 0.09804,0.11655 0.09804,0.187165 0,0.06993 -0.03085,0.124777 -0.09804,0.179624 z"
             fill="#e6e7e8"
             id="path12197" /><polygon
             points="26.906,56.7275 25.238,56.2545 25.2298,56.2504 26.906,55.7897 26.906,55.5634 27.1905,55.4811 26.906,55.4811 26.906,55.2426 24.4132,55.2426 24.4132,55.6807 25.7296,55.6807 24.4132,56.0474 24.4132,56.4225 25.7152,56.7975 24.4132,56.7975 24.4132,57.2342 26.906,57.2342 26.906,56.9963 27.1439,56.9963 26.906,56.9305 "
             fill-rule="nonzero"
             fill="#e6e7e8"
             id="polygon12199" /><path
             fill-rule="nonzero"
             d="m 25.6288,57.7031 c -0.328398,0 -0.61429,0.08227 -0.848076,0.246126 -0.269437,0.187851 -0.40587,0.442204 -0.40587,0.750032 0,0.3092 0.133005,0.562867 0.393529,0.750032 0.231044,0.163855 0.527905,0.250239 0.891269,0.250239 0.258468,0 0.484027,-0.04251 0.680106,-0.12889 0.190594,-0.0857 0.342796,-0.207047 0.449062,-0.355134 0.101467,-0.155628 0.156315,-0.324283 0.156315,-0.512134 0,-0.288632 -0.117236,-0.527217 -0.351023,-0.719181 -0.226931,-0.187165 -0.55053,-0.281091 -0.964627,-0.281091 z m 0.03428,1.53914 c -0.276979,0 -0.491569,-0.05416 -0.632801,-0.163855 -0.133005,-0.100781 -0.194708,-0.225558 -0.194708,-0.37913 0,-0.148087 0.0617,-0.26875 0.194708,-0.375016 0.137118,-0.109008 0.33594,-0.167969 0.594408,-0.167969 0.303717,0 0.52722,0.05896 0.663652,0.163855 0.133005,0.102152 0.195393,0.226929 0.195393,0.383243 0,0.09804 -0.02742,0.183737 -0.08638,0.266008 -0.0617,0.08159 -0.143289,0.143973 -0.242014,0.187165 -0.143974,0.05896 -0.309202,0.0857 -0.492253,0.0857 z"
             fill="#e6e7e8"
             id="path12201" /><path
             fill-rule="nonzero"
             d="m 24.4132,60.9261 c 0,0.211161 0.04319,0.387357 0.129577,0.51899 0.08638,0.137117 0.229673,0.246811 0.42918,0.331824 0.191966,0.08227 0.429866,0.122035 0.699989,0.122035 0.211162,0 0.394215,-0.024 0.553958,-0.0713 0.157,-0.05073 0.293433,-0.11655 0.3997,-0.207047 0.113123,-0.08981 0.186481,-0.202934 0.229673,-0.327711 0.03222,-0.09804 0.05073,-0.226244 0.05073,-0.398326 v -0.745919 h -2.49212 v 0.77677 z m 2.01975,-0.331824 v 0.297545 c 0,0.159742 -0.0192,0.237899 -0.03565,0.272864 -0.03428,0.07747 -0.104895,0.141231 -0.218704,0.194707 -0.12135,0.05485 -0.289319,0.0857 -0.503224,0.0857 -0.204306,0 -0.379132,-0.03085 -0.523792,-0.0857 -0.09393,-0.03565 -0.163856,-0.08501 -0.202935,-0.148087 -0.04251,-0.06582 -0.06239,-0.176196 -0.06239,-0.316056 v -0.300973 h 1.54601 z"
             fill="#e6e7e8"
             id="path12203" /><path
             fill-rule="nonzero"
             d="m 23.066,42.3405 -2.49212,-0.789111 v 0.473055 l 0.691076,0.207047 v 0.639653 l -0.691076,0.219388 v 0.496365 l 2.42219,-0.812421 0.07062,-0.024 v -0.187165 l 0.16797,-0.03908 -0.16797,-0.02811 V 42.3405 Z m -0.847391,0.234471 -0.50391,0.156999 v -0.36816 l 0.542988,0.167969 c 0.01508,0.0082 0.03496,0.01234 0.05416,0.01645 -0.03085,0.01165 -0.0617,0.01988 -0.09324,0.02674 z"
             fill="#e6e7e8"
             id="path12205" /><polygon
             points="20.5739,44.6372 23.066,44.6372 23.066,44.1923 20.5739,44.1923 "
             fill-rule="nonzero"
             fill="#e6e7e8"
             id="polygon12207" /><polygon
             points="21.2616,46.2579 21.7456,46.2579 21.7456,45.3523 21.2616,45.3523 "
             fill-rule="nonzero"
             fill="#e6e7e8"
             id="polygon12209" /><polygon
             points="22.5937,47.4262 20.5739,47.4262 20.5739,47.8711 22.5937,47.8711 22.5937,48.4923 23.066,48.4923 23.066,46.8057 22.5937,46.8057 "
             fill-rule="nonzero"
             fill="#e6e7e8"
             id="polygon12211" /><polygon
             points="20.5739,50.8171 23.066,50.8171 23.066,50.3673 22.1254,50.3673 22.1254,49.5906 23.066,49.5906 23.066,49.1449 20.5739,49.1449 20.5739,49.5906 21.6558,49.5906 21.6558,50.3673 20.5739,50.3673 "
             fill-rule="nonzero"
             fill="#e6e7e8"
             id="polygon12213" /><polygon
             points="20.5739,52.1334 23.066,52.1334 23.066,51.6844 20.5739,51.6844 "
             fill-rule="nonzero"
             fill="#e6e7e8"
             id="polygon12215" /><polygon
             points="21.5536,54.1991 23.066,53.3709 23.066,52.9575 20.5739,52.9575 20.5739,53.3956 22.0856,53.3956 20.5739,54.2238 20.5739,54.6372 23.066,54.6372 23.066,54.1991 "
             fill-rule="nonzero"
             fill="#e6e7e8"
             id="polygon12217" /><polygon
             points="20.5739,57.2774 22.0267,56.4026 23.066,57.2815 23.066,56.6844 22.1089,55.8952 23.066,55.8952 23.066,55.4489 20.5739,55.4489 20.5739,55.8952 21.433,55.8952 21.6599,56.0899 20.5739,56.7152 "
             fill-rule="nonzero"
             fill="#e6e7e8"
             id="polygon12219" /><polygon
             points="21.6249,59.2971 22.0939,59.2971 22.0939,58.2578 22.5937,58.2578 22.5937,59.3671 23.066,59.3671 23.066,57.8135 20.5739,57.8135 20.5739,59.4102 21.047,59.4102 21.047,58.2578 21.6249,58.2578 "
             fill-rule="nonzero"
             fill="#e6e7e8"
             id="polygon12221" /><path
             fill-rule="nonzero"
             d="m 20.5739,60.6025 h 1.02016 v 0.187165 c 0,0.08159 -0.01577,0.12889 -0.02742,0.148772 -0.0082,0.02262 -0.03565,0.05759 -0.101467,0.109008 -0.03634,0.02674 -0.128891,0.08981 -0.360621,0.211161 L 20.5739,61.535583 v 0.538872 l 0.769919,-0.405868 c 0.113123,-0.05896 0.21459,-0.12889 0.311944,-0.207047 0.0082,-0.0082 0.01234,-0.01234 0.01988,-0.0192 0.04251,0.101467 0.104895,0.187165 0.183053,0.252982 0.124778,0.10558 0.288634,0.156999 0.484713,0.156999 0.148088,0 0.281778,-0.02811 0.390101,-0.0905 0.116551,-0.06307 0.202935,-0.144659 0.257782,-0.24544 0.05073,-0.09804 0.07404,-0.23927 0.07404,-0.433977 v -0.929656 h -2.48801 v 0.449745 h -0.0041 z m 2.03552,0 v 0.491566 c 0,0.104895 -0.0192,0.183052 -0.06582,0.229672 -0.04731,0.05142 -0.113808,0.07541 -0.202935,0.07541 -0.06239,0 -0.113808,-0.01577 -0.160428,-0.04251 -0.04251,-0.02399 -0.07404,-0.05553 -0.09324,-0.09804 -0.01645,-0.03085 -0.03222,-0.09804 -0.03222,-0.222816 v -0.436719 h 0.555329 v 0.0041 z"
             fill="#e6e7e8"
             id="path12223" /><polygon
             points="16.7339,42.2898 19.226,42.2898 19.226,41.8407 16.7339,41.8407 "
             fill-rule="nonzero"
             fill="#e6e7e8"
             id="polygon12225" /><path
             fill-rule="nonzero"
             d="m 17.0774,44.3486 c 0.12135,0.06993 0.258468,0.104895 0.40587,0.104895 0.152887,0 0.281092,-0.03428 0.394901,-0.100781 0.109009,-0.06719 0.198821,-0.167969 0.265324,-0.301658 0.03908,-0.07747 0.0857,-0.207047 0.140546,-0.409981 0.06239,-0.222816 0.109009,-0.296859 0.133005,-0.320855 0.06582,-0.06993 0.22556,-0.07404 0.30783,0.024 0.04662,0.05827 0.07542,0.143973 0.07542,0.258466 0,0.113122 -0.02811,0.194707 -0.08227,0.253667 -0.05485,0.05827 -0.14466,0.09255 -0.266009,0.100781 l -0.102153,0.01165 0.03908,0.433291 0.09393,-0.0034 c 0.152887,-0.0041 0.292747,-0.03976 0.409298,-0.10558 0.12135,-0.06582 0.211162,-0.163855 0.27835,-0.285204 0.06239,-0.11655 0.09324,-0.257781 0.09324,-0.409296 0,-0.231043 -0.06993,-0.417523 -0.207049,-0.558754 -0.135747,-0.137117 -0.311944,-0.207047 -0.523106,-0.207047 -0.116551,0 -0.226931,0.024 -0.323599,0.07404 -0.09393,0.04662 -0.176197,0.117921 -0.239271,0.202934 -0.05827,0.0857 -0.117236,0.218702 -0.170712,0.410667 -0.0713,0.237899 -0.109695,0.33251 -0.128891,0.366789 -0.02468,0.04319 -0.05073,0.07404 -0.0857,0.09735 -0.03496,0.01988 -0.07816,0.03154 -0.124778,0.03154 -0.08981,0 -0.157,-0.03154 -0.207049,-0.08981 -0.05553,-0.06307 -0.08227,-0.155628 -0.08227,-0.276977 0,-0.08981 0.01508,-0.167969 0.05005,-0.234471 0.03634,-0.06239 0.07884,-0.113122 0.133005,-0.148087 0.05896,-0.03908 0.145345,-0.06376 0.250241,-0.0713 l 0.102153,-0.01097 -0.04731,-0.42575 -0.08981,0.0041 c -0.266009,0.0041 -0.479914,0.08638 -0.636914,0.242012 -0.155629,0.155628 -0.2379,0.366789 -0.2379,0.625256 0,0.163855 0.03085,0.3092 0.09804,0.429863 0.0617,0.121349 0.159743,0.218017 0.285206,0.289318 z"
             fill="#e6e7e8"
             id="path12227" /><polygon
             points="19.226,46.3916 17.558,45.9186 17.5504,45.9145 19.226,45.4572 19.226,45.2275 19.5119,45.1452 19.226,45.1452 19.226,44.9066 16.7339,44.9066 16.7339,45.3441 18.0537,45.3441 16.7339,45.7115 16.7339,46.0865 18.0386,46.4609 16.7339,46.4609 16.7339,46.899 19.226,46.899 19.226,46.6604 19.4646,46.6604 19.226,46.5939 "
             fill-rule="nonzero"
             fill="#e6e7e8"
             id="polygon12229" /><path
             fill-rule="nonzero"
             d="m 18.2299,52.7772 c -0.109009,-0.06239 -0.268752,-0.199506 -0.4758,-0.405868 -0.191966,-0.190593 -0.364049,-0.323597 -0.508023,-0.397641 -0.145345,-0.07404 -0.276979,-0.109694 -0.414097,-0.109694 h -0.09804 v 1.44179 h 0.468944 v -0.84053 c 0.05142,0.03908 0.140546,0.124777 0.272865,0.253667 0.226931,0.219388 0.414097,0.370903 0.555329,0.453173 0.320171,0.183737 0.695189,0.172082 0.969426,-0.03908 0.155629,-0.116549 0.234472,-0.292746 0.234472,-0.516247 0,-0.202934 -0.06582,-0.370903 -0.195393,-0.499792 -0.128891,-0.12135 -0.316743,-0.19128 -0.558757,-0.211161 l -0.09667,-0.0069 -0.05485,0.440833 h 0.113123 c 0.124778,0 0.21459,0.02674 0.277664,0.08227 0.05827,0.04662 0.08227,0.104895 0.08227,0.187165 0,0.07062 -0.024,0.12889 -0.07541,0.180309 -0.104895,0.09393 -0.285206,0.109694 -0.496368,-0.01234 z"
             fill="#e6e7e8"
             id="path12231" /><polygon
             points="16.7339,54.2663 17.2543,54.2663 17.2543,53.8056 16.7339,53.8056 "
             fill-rule="nonzero"
             fill="#e6e7e8"
             id="polygon12233" /><path
             fill-rule="nonzero"
             d="m 17.7417,56.1414 v -0.254353 h 1.48362 v -0.347593 l -1.53435,-0.88715 -0.02331,-0.01097 h -0.387359 v 0.811735 h -0.547102 v 0.429863 h 0.547102 v 0.258466 h 0.461403 z m 0,-0.68833 v -0.311942 l 0.555329,0.311942 z"
             fill="#e6e7e8"
             id="path12235" /><path
             fill-rule="nonzero"
             d="m 18.6638,56.6686 c -0.194708,-0.0905 -0.433979,-0.133004 -0.695189,-0.133004 -0.257782,0 -0.488827,0.04251 -0.675993,0.133004 -0.191966,0.09324 -0.340053,0.218702 -0.44632,0.37913 -0.100782,0.159742 -0.152201,0.344165 -0.152201,0.547099 0,0.148087 0.03496,0.296859 0.102153,0.440833 0.06239,0.140545 0.159743,0.274235 0.285206,0.406553 l 0.02742,0.03154 h 0.995478 v -0.996158 h -0.471687 v 0.549841 h -0.285892 c -0.04251,-0.04593 -0.08159,-0.109008 -0.117236,-0.187165 -0.04319,-0.08981 -0.0617,-0.17551 -0.0617,-0.257781 0,-0.176196 0.0617,-0.311942 0.194708,-0.42575 0.133005,-0.109008 0.344167,-0.167969 0.625259,-0.167969 0.183738,0 0.343481,0.02811 0.473058,0.08227 0.120664,0.05485 0.207049,0.122034 0.260525,0.203619 0.05896,0.08227 0.0857,0.178938 0.0857,0.296174 0,0.07884 -0.01508,0.148772 -0.04593,0.207047 -0.02811,0.06307 -0.06719,0.109694 -0.117922,0.144659 -0.05416,0.03908 -0.139861,0.06993 -0.253669,0.09804 l -0.109009,0.02674 0.141232,0.409981 0.0857,-0.0192 c 0.178939,-0.03634 0.316058,-0.08981 0.420953,-0.163855 0.109695,-0.07884 0.196079,-0.17551 0.249555,-0.293431 0.05896,-0.117921 0.08638,-0.253667 0.08638,-0.407239 0,-0.202934 -0.04593,-0.385986 -0.143974,-0.534758 -0.102153,-0.1522 -0.253669,-0.277663 -0.457289,-0.370903 z"
             fill="#e6e7e8"
             id="path12237" /><path
             fill-rule="nonzero"
             d="m 16.7339,59.352 h 1.00782 c 0.222817,0 0.316058,0.04319 0.358564,0.08227 0.05896,0.05005 0.0857,0.104895 0.0857,0.178938 0,0.05896 -0.01508,0.102152 -0.05416,0.133004 -0.04319,0.03496 -0.133005,0.05553 -0.250241,0.05553 h -1.15316 v 0.429863 h 1.15316 c 0.276979,0 0.464145,-0.05073 0.57384,-0.152886 0.117236,-0.100781 0.172083,-0.242012 0.172083,-0.418208 0,-0.09667 -0.024,-0.191279 -0.0713,-0.272864 -0.0069,-0.01165 -0.01097,-0.024 -0.0192,-0.03496 h 0.682849 v -0.429863 h -2.49212 v 0.429863 h 0.0041 z"
             fill="#e6e7e8"
             id="path12239" /><path
             fill-rule="nonzero"
             d="m 18.1682,61.2894 v 0.06307 l -1.07432,-0.76991 h -0.359935 v 1.40203 h 0.442206 v -0.726037 c 0,-0.02674 0,-0.05553 0,-0.08227 l 1.07432,0.754146 0.02674,0.01851 h 0.316743 v -1.31221 h -0.429866 v 0.651993 h 0.0041 z"
             fill="#e6e7e8"
             id="path12241" /><path
             fill-rule="nonzero"
             d="m 13.8236,42.6209 c 0,0.289318 0.07816,0.499793 0.233787,0.625256 0.145345,0.117235 0.33594,0.180309 0.566984,0.180309 0.176197,0 0.324285,-0.03428 0.444949,-0.109008 0.128891,-0.07884 0.21459,-0.183737 0.266009,-0.312628 0.03085,-0.08981 0.04731,-0.222816 0.04731,-0.401754 v -0.808993 h -2.48938 v 0.44906 h 0.930347 v 0.37913 z m 1.0894,-0.37913 v 0.37913 c 0,0.156314 -0.01988,0.211161 -0.02674,0.227615 -0.01166,0.02674 -0.04319,0.05759 -0.08981,0.08227 -0.04662,0.02674 -0.113808,0.03839 -0.183738,0.03839 -0.113123,0 -0.194708,-0.02399 -0.242699,-0.07404 -0.05073,-0.05073 -0.07747,-0.144659 -0.07747,-0.270121 v -0.383243 h 0.62046 z"
             fill="#e6e7e8"
             id="path12243" /><path
             fill-rule="nonzero"
             d="m 15.3867,44.6297 v -0.187165 l 0.167284,-0.03976 -0.167284,-0.03085 v -0.1522 l -2.49281,-0.789111 v 0.471685 l 0.692447,0.207047 v 0.641024 l -0.692447,0.218702 v 0.496365 l 2.42219,-0.813106 0.07062,-0.02262 z m -0.848076,-0.176196 -0.50391,0.156314 v -0.366789 l 0.542988,0.167969 c 0.01645,0.0041 0.03565,0.01165 0.05142,0.01577 -0.02811,0.0082 -0.05896,0.0192 -0.08981,0.02674 z"
             fill="#e6e7e8"
             id="path12245" /><polygon
             points="14.3549,51.0557 14.3549,50.5435 13.8901,50.5435 13.8901,51.0557 13.2648,51.0557 13.2648,51.4732 13.8901,51.4732 13.8901,51.9846 14.3549,51.9846 14.3549,51.4732 14.9761,51.4732 14.9761,51.0557 "
             fill-rule="nonzero"
             fill="#e6e7e8"
             id="polygon12247" /><path
             fill-rule="nonzero"
             d="m 13.3629,52.9342 c 0.05073,0.03908 0.140546,0.124777 0.273551,0.253667 0.226245,0.218017 0.414097,0.370903 0.553958,0.453173 0.320857,0.183052 0.695875,0.172082 0.96874,-0.03908 0.156315,-0.121349 0.233787,-0.293431 0.233787,-0.516247 0,-0.202934 -0.06582,-0.370903 -0.194708,-0.499793 -0.128891,-0.121349 -0.316058,-0.194707 -0.558757,-0.215274 l -0.09667,-0.0041 -0.05485,0.442204 h 0.113123 c 0.124778,0 0.215276,0.02674 0.27835,0.08159 0.05759,0.0473 0.08159,0.104895 0.08159,0.18648 0,0.0713 -0.024,0.129576 -0.07816,0.180309 -0.102153,0.09461 -0.281778,0.109008 -0.496368,-0.01165 -0.106267,-0.0617 -0.266009,-0.19882 -0.477171,-0.405868 -0.187852,-0.191279 -0.358564,-0.323597 -0.50391,-0.398326 -0.143974,-0.07541 -0.276979,-0.114493 -0.414097,-0.114493 l -0.102153,0.0041 v 1.43768 h 0.473058 v -0.835731 z"
             fill="#e6e7e8"
             id="path12249" /><path
             fill-rule="nonzero"
             d="m 13.7687,55.5785 c 0.253669,0 0.457289,-0.0617 0.610176,-0.194707 0.155629,-0.137117 0.234472,-0.300973 0.234472,-0.484025 0,-0.07884 -0.01645,-0.153572 -0.04319,-0.222816 l 0.316743,0.05073 V 55.4928 h 0.468259 v -1.11682 l -1.35953,-0.211161 -0.06307,0.386671 0.06307,0.03085 c 0.05553,0.02674 0.09804,0.06719 0.124778,0.109694 0.02674,0.04593 0.04319,0.09324 0.04319,0.143973 0,0.0857 -0.03085,0.1522 -0.102153,0.211161 -0.06993,0.06239 -0.174826,0.09392 -0.311258,0.09392 -0.153572,0 -0.270123,-0.03496 -0.352394,-0.102152 -0.07747,-0.05828 -0.113123,-0.124777 -0.113123,-0.202934 0,-0.05896 0.02331,-0.109008 0.07404,-0.155628 0.05896,-0.05142 0.148773,-0.08638 0.273551,-0.102152 l 0.09324,-0.01097 -0.04319,-0.43809 -0.09667,0.0082 c -0.222817,0.01508 -0.403128,0.0905 -0.532019,0.219388 -0.132319,0.132318 -0.199507,0.293431 -0.199507,0.484025 0,0.226929 0.09393,0.409981 0.281778,0.547099 0.174826,0.129576 0.390101,0.191279 0.632115,0.191279 z"
             fill="#e6e7e8"
             id="path12251" /><path
             fill-rule="nonzero"
             d="m 12.9364,56.8633 h -0.04251 v 0.414095 h 2.48938 v -0.433291 h -0.671879 c 0,-0.0041 0.0041,-0.0041 0.0041,-0.01166 0.05005,-0.07816 0.07404,-0.167969 0.07404,-0.261894 0,-0.128205 -0.03839,-0.242698 -0.112437,-0.346907 -0.07542,-0.106266 -0.187852,-0.183737 -0.33594,-0.242012 -0.14466,-0.05896 -0.317429,-0.0857 -0.51625,-0.0857 -0.296861,0 -0.530648,0.06582 -0.702731,0.194707 -0.176197,0.137117 -0.266009,0.305086 -0.266009,0.496365 0,0.09804 0.02811,0.187851 0.07816,0.270121 0.0034,0 0.0034,0.0034 0.0034,0.0069 z m 0.887155,-0.530644 c 0.194708,0 0.340053,0.02674 0.425752,0.0857 0.109009,0.07404 0.109009,0.144659 0.109009,0.167969 0,0.04731 -0.01234,0.11655 -0.113123,0.187851 -0.09393,0.06239 -0.245442,0.09324 -0.457289,0.09324 -0.179625,0 -0.31263,-0.03085 -0.394901,-0.08981 -0.06993,-0.05416 -0.109009,-0.109008 -0.109009,-0.174825 0,-0.06307 0.03908,-0.121349 0.113123,-0.180309 0.0905,-0.05896 0.231044,-0.08981 0.426438,-0.08981 z"
             fill="#e6e7e8"
             id="path12253" /><path
             fill-rule="nonzero"
             d="m 12.8939,58.5985 c 0,0.183052 0.02811,0.323597 0.08159,0.432606 0.05485,0.113807 0.145345,0.207047 0.270123,0.274235 0.12135,0.0617 0.258468,0.09392 0.414097,0.09392 0.156315,0 0.296861,-0.03634 0.40587,-0.109694 0.06719,-0.04388 0.120664,-0.09461 0.163856,-0.156314 0.04251,0.03496 0.08638,0.06993 0.140546,0.09804 0.199507,0.113122 0.479914,0.109008 0.686962,-0.01165 0.11038,-0.06307 0.196079,-0.145344 0.250241,-0.24544 0.05142,-0.09804 0.07884,-0.227615 0.07884,-0.383243 v -0.808993 h -2.49281 v 0.81722 z m 1.52818,-0.367475 h 0.491569 v 0.276977 c 0,0.160427 -0.01577,0.222816 -0.02331,0.246126 -0.01097,0.03085 -0.03497,0.05896 -0.06993,0.07816 -0.07816,0.04662 -0.242699,0.04319 -0.30783,-0.0041 -0.03634,-0.01851 -0.05896,-0.05073 -0.07542,-0.09667 -0.0075,-0.01988 -0.01508,-0.07473 -0.01508,-0.196078 z m -0.468944,0 v 0.335938 c 0,0.140545 -0.01988,0.207047 -0.03497,0.238584 -0.02057,0.04319 -0.04731,0.07404 -0.08981,0.100781 -0.09393,0.05485 -0.266009,0.05073 -0.352394,-0.0041 -0.04251,-0.02331 -0.07404,-0.06239 -0.09324,-0.113122 -0.0075,-0.02331 -0.01988,-0.07404 -0.01988,-0.191279 v -0.367475 h 0.589608 z"
             fill="#e6e7e8"
             id="path12255" /><polygon
             points="15.3867,61.3361 13.7187,60.8671 13.7111,60.8637 15.3867,60.4023 15.3867,60.1726 15.6719,60.0938 15.3867,60.0938 15.3867,59.8566 12.8939,59.8566 12.8939,60.2933 14.2109,60.2933 12.8939,60.6601 12.8939,61.0351 14.1952,61.4101 12.8939,61.4101 12.8939,61.8482 15.3867,61.8482 15.3867,61.6096 15.6246,61.6096 15.3867,61.5397 "
             fill-rule="nonzero"
             fill="#e6e7e8"
             id="polygon12257" /><path
             fill-rule="nonzero"
             d="m 9.80738,43.133 c 0.163856,0 0.309202,-0.03496 0.422324,-0.106266 0.0713,-0.04251 0.124778,-0.09324 0.172083,-0.156314 0.03496,0.03908 0.07816,0.07404 0.120664,0.102152 0.09393,0.05416 0.202935,0.08227 0.332512,0.08227 0.202935,0 0.366791,-0.06376 0.499796,-0.180309 0.133005,-0.124777 0.199507,-0.276977 0.199507,-0.464828 0,-0.178938 -0.06582,-0.335937 -0.194708,-0.457287 -0.129577,-0.120663 -0.293433,-0.178938 -0.492254,-0.178938 -0.137118,0 -0.250241,0.02742 -0.344167,0.08227 -0.04251,0.02674 -0.08159,0.05828 -0.113123,0.09667 -0.04319,-0.05759 -0.09804,-0.104895 -0.159743,-0.143973 -0.117236,-0.07542 -0.261896,-0.114493 -0.433979,-0.114493 -0.234472,0 -0.42918,0.0713 -0.57384,0.203619 -0.152201,0.135746 -0.226931,0.311942 -0.226931,0.51899 0,0.19882 0.074729,0.375016 0.226931,0.512134 0.14466,0.133004 0.33594,0.202934 0.565613,0.202934 z m 0.270123,-0.527217 c -0.06582,0.06239 -0.155629,0.08913 -0.273551,0.08913 -0.113123,0 -0.202935,-0.02674 -0.265324,-0.0857 -0.067188,-0.05416 -0.093926,-0.117235 -0.093926,-0.194707 0,-0.07404 0.030852,-0.137117 0.09804,-0.191279 0.065817,-0.06307 0.155629,-0.08981 0.268752,-0.08981 0.114494,0 0.202936,0.02674 0.270124,0.0857 0.06239,0.05485 0.08981,0.113122 0.08981,0.191279 0.0041,0.07816 -0.02811,0.141231 -0.09393,0.196078 z m 0.594408,-0.33251 c 0.04731,-0.04251 0.116551,-0.0665 0.202935,-0.0665 0.07404,0 0.133005,0.024 0.178939,0.0665 0.04731,0.03908 0.06719,0.08227 0.06719,0.135746 0,0.05896 -0.01988,0.102152 -0.06719,0.145344 -0.09735,0.0857 -0.289319,0.08981 -0.381874,0.0034 -0.04251,-0.04251 -0.06719,-0.0857 -0.06719,-0.144659 0,-0.05485 0.01988,-0.101467 0.06719,-0.140545 z"
             fill="#e6e7e8"
             id="path12259" /><path
             fill-rule="nonzero"
             d="m 9.36655,45.0705 c 0.21459,0.114493 0.51625,0.167969 0.918007,0.167969 0.444949,0 0.769233,-0.06582 0.97971,-0.202934 0.191966,-0.124777 0.289319,-0.293431 0.289319,-0.50802 0,-0.242012 -0.12135,-0.425064 -0.351023,-0.545727 -0.211162,-0.114493 -0.519678,-0.167969 -0.918007,-0.167969 -0.453176,0 -0.769919,0.06239 -0.961199,0.187165 -0.207049,0.133004 -0.309202,0.312628 -0.309202,0.523789 0,0.237899 0.122035,0.429178 0.352395,0.545727 z m 0.918007,-0.26875 c -0.438093,0 -0.621146,-0.05073 -0.698617,-0.09392 -0.124778,-0.07062 -0.141232,-0.133004 -0.141232,-0.176196 0,-0.04731 0.016454,-0.11655 0.141232,-0.187165 0.074044,-0.04319 0.257782,-0.09804 0.698617,-0.09804 0.437407,0 0.621146,0.05073 0.695189,0.09392 0.140546,0.07816 0.140546,0.1522 0.140546,0.176196 0,0.04731 -0.01165,0.120663 -0.136433,0.191279 -0.07404,0.04319 -0.261896,0.09392 -0.699303,0.09392 z"
             fill="#e6e7e8"
             id="path12261" /><path
             fill-rule="nonzero"
             d="m 11.3548,46.1599 c -0.124778,-0.120663 -0.311944,-0.191279 -0.553958,-0.211161 l -0.09804,-0.0069 -0.05485,0.440833 h 0.113808 c 0.124778,0 0.21459,0.02674 0.276979,0.08227 0.05828,0.04662 0.08227,0.104895 0.08227,0.187165 0,0.07061 -0.024,0.12889 -0.07816,0.180309 -0.106267,0.09804 -0.281092,0.109694 -0.496368,-0.01234 C 10.4409,46.757686 10.280472,46.62057 10.069995,46.414208 9.8828287,46.223615 9.7107447,46.089925 9.5660847,46.015882 9.4221107,45.941842 9.2891057,45.906188 9.1519877,45.906188 h -0.100782 v 1.44179 h 0.471687 v -0.84053 c 0.051419,0.03908 0.141232,0.124777 0.270123,0.253667 0.2255603,0.219388 0.4134113,0.370903 0.5580713,0.453173 0.320857,0.183737 0.691762,0.172082 0.969426,-0.03908 0.155629,-0.11655 0.233787,-0.292746 0.233787,-0.516247 0,-0.202934 -0.06582,-0.370903 -0.199507,-0.499793 z"
             fill="#e6e7e8"
             id="path12263" /><polygon
             points="9.05392,48.6493 9.5736,48.6493 9.5736,48.1844 9.05392,48.1844 "
             fill-rule="nonzero"
             fill="#e6e7e8"
             id="polygon12265" /><path
             fill-rule="nonzero"
             d="m 11.5536,50.1843 -0.06239,-0.02468 c -0.0857,-0.03428 -0.183738,-0.09667 -0.276979,-0.183052 -0.09804,-0.08981 -0.18031,-0.196078 -0.250241,-0.317427 l -0.02811,-0.04662 h -0.479914 l 0.05828,0.137117 c 0.03634,0.08158 0.08638,0.167969 0.161114,0.270121 0.01097,0.0192 0.02674,0.03496 0.04319,0.05416 H 9.0539295 v 0.429863 h 2.4996695 v -0.319484 z"
             fill="#e6e7e8"
             id="path12267" /><path
             fill-rule="nonzero"
             d="m 11.5536,52.1094 -0.06239,-0.02331 c -0.0857,-0.03085 -0.183738,-0.09804 -0.276979,-0.183737 -0.09804,-0.08913 -0.18031,-0.194707 -0.250241,-0.311942 l -0.02811,-0.05073 h -0.479914 l 0.05828,0.141231 c 0.03634,0.07747 0.08638,0.163855 0.161114,0.264637 0.01097,0.01988 0.02674,0.03634 0.04319,0.05485 H 9.0539295 v 0.429863 h 2.4996695 z"
             fill="#e6e7e8"
             id="path12269" /><path
             fill-rule="nonzero"
             d="M 11.5467,53.5396 H 9.05389 v 0.413409 h 0.04662 c -0.00411,0.0041 -0.00411,0.0082 -0.00686,0.01234 -0.050734,0.07816 -0.078843,0.167969 -0.078843,0.266008 0,0.191279 0.089812,0.355134 0.270123,0.492252 0.172083,0.133004 0.409984,0.19882 0.710958,0.19882 0.195393,0 0.367477,-0.02674 0.508023,-0.0857 0.148088,-0.06239 0.257782,-0.141231 0.331826,-0.242012 0.07747,-0.106266 0.116551,-0.223501 0.116551,-0.352392 0,-0.09324 -0.02399,-0.178938 -0.06993,-0.257781 l -0.0082,-0.01508 h 0.671879 V 53.5396 Z m -2.05472,0.55464 c 0.034965,-0.04319 0.085699,-0.07816 0.151516,-0.102152 0.075415,-0.02674 0.191966,-0.04319 0.352394,-0.04319 0.18031,0 0.316058,0.03222 0.40587,0.09393 0.116551,0.08227 0.116551,0.1522 0.116551,0.176196 0,0.04251 -0.01097,0.109008 -0.109009,0.180309 -0.08227,0.05827 -0.226931,0.08501 -0.421639,0.08501 -0.19128,0 -0.332512,-0.03085 -0.422324,-0.08913 -0.117236,-0.08158 -0.117236,-0.148772 -0.117236,-0.172082 0,-0.04731 0.012341,-0.0905 0.043192,-0.129576 z"
             fill="#e6e7e8"
             id="path12271" /><polygon
             points="9.01484,55.8562 11.5858,56.4451 11.5858,56.0557 9.01484,55.4654 "
             fill-rule="nonzero"
             fill="#e6e7e8"
             id="polygon12273" /><path
             fill-rule="nonzero"
             d="m 10.9132,58.3565 v -0.411352 h -0.05073 c 0.0041,-0.01097 0.01234,-0.0192 0.01646,-0.02674 0.04662,-0.08227 0.07404,-0.172082 0.07404,-0.269436 0,-0.12889 -0.03908,-0.250239 -0.113123,-0.35582 -0.07541,-0.101467 -0.187852,-0.187165 -0.340053,-0.246126 -0.145345,-0.06307 -0.309202,-0.08981 -0.5045947,-0.08981 -0.285206,0 -0.519678,0.06993 -0.694504,0.202934 -0.163856,0.129576 -0.246813,0.292746 -0.246813,0.48471 0,0.09324 0.023996,0.178938 0.066502,0.257095 0.0048,0.0041 0.00823,0.01234 0.00823,0.01645 -0.063074,-0.0041 -0.089812,-0.0082 -0.106267,-0.01234 -0.074044,-0.0192 -0.128891,-0.04731 -0.159743,-0.08913 -0.034965,-0.04319 -0.051419,-0.102152 -0.051419,-0.180309 0,-0.0665 0.012341,-0.11655 0.039079,-0.1522 0.028109,-0.03154 0.075415,-0.05005 0.137118,-0.05828 l 0.074044,-0.0075 0.055533,-0.301658 0.00343,-0.11655 h -0.120664 c -0.188538,0 -0.336625,0.05896 -0.449062,0.167969 -0.114494,0.113122 -0.172083,0.273549 -0.172083,0.476483 0,0.1522 0.039079,0.285204 0.113123,0.398326 0.074044,0.109008 0.176197,0.190593 0.305088,0.242012 0.124778,0.04731 0.316058,0.07062 0.582067,0.07062 H 10.913197 Z M 9.59344,57.485119 c 0.082271,-0.05827 0.226245,-0.08913 0.418211,-0.08913 0.178939,0 0.311944,0.03085 0.398328,0.08913 0.09804,0.07062 0.109009,0.133004 0.109009,0.172082 0,0.07541 -0.03428,0.137117 -0.113123,0.191964 -0.08159,0.0617 -0.219389,0.09392 -0.40587,0.09392 -0.188538,0 -0.327713,-0.03222 -0.40587,-0.08981 -0.075415,-0.05553 -0.105581,-0.114494 -0.105581,-0.187852 -0.00411,-0.04319 0.00754,-0.109008 0.105581,-0.180309 z"
             fill="#e6e7e8"
             id="path12275" /><polygon
             points="9.01484,59.3595 11.5858,59.9532 11.5858,59.5597 9.01484,58.9694 "
             fill-rule="nonzero"
             fill="#e6e7e8"
             id="polygon12277" /><path
             fill-rule="nonzero"
             d="m 10.8467,60.961 h 0.0665 V 60.555132 H 9.0538823 v 0.429178 h 1.0078197 c 0.219389,0 0.317429,0.03976 0.359935,0.07473 0.05828,0.04731 0.08638,0.104895 0.08638,0.18648 0,0.03908 -0.0082,0.06719 -0.02811,0.09804 -0.0192,0.02674 -0.04731,0.04731 -0.08638,0.05828 -0.02674,0.01234 -0.09255,0.02811 -0.229673,0.02811 H 9.0538851 v 0.429178 h 1.1216299 c 0.159743,0 0.280407,-0.01097 0.362678,-0.03154 0.0905,-0.02262 0.163856,-0.05759 0.219389,-0.104895 0.05828,-0.04731 0.104895,-0.106266 0.139861,-0.183737 0.03496,-0.07404 0.05142,-0.156314 0.05142,-0.246126 0,-0.109008 -0.02742,-0.215274 -0.08227,-0.301658 -0.0041,-0.01097 -0.01166,-0.01851 -0.01988,-0.03085 z"
             fill="#e6e7e8"
             id="path12279" /></g><g
           id="g12311"><path
             fill-rule="nonzero"
             d="m 13.3985,29.2232 c -2.95421,0 -5.3483,2.39407 -5.3483,5.35101 0,2.18839 1.31222,4.06279 3.19074,4.89098 v -2.03482 c -0.863159,-0.656107 -1.43289,-1.68449 -1.43289,-2.85616 0,-1.97998 1.60497,-3.58973 3.59318,-3.58973 1.98067,0 3.58976,1.60976 3.58976,3.58973 0,1.17235 -0.566298,2.20005 -1.43289,2.85616 v 2.03482 c 1.87921,-0.828189 3.19143,-2.70327 3.19143,-4.89098 0.0034,-2.95694 -2.39477,-5.35101 -5.35104,-5.35101 z"
             fill="#e6e7e8"
             id="path12283" /><path
             fill-rule="nonzero"
             d="m 14.3864,37.625 c 1.31222,-0.422322 2.27273,-1.63718 2.27273,-3.08994 0,-1.80104 -1.46099,-3.25791 -3.25793,-3.25791 -1.79968,0 -3.26067,1.45687 -3.26067,3.25791 0,1.45276 0.961199,2.66831 2.27342,3.08994 v -1.90593 c -0.340053,-0.281091 -0.562185,-0.707526 -0.562185,-1.18401 0,-0.854927 0.694504,-1.5508 1.55012,-1.5508 0.855618,0 1.54669,0.695871 1.54669,1.5508 0,0.481282 -0.218018,0.89949 -0.561499,1.18812 V 37.625 Z"
             fill="#e6e7e8"
             id="path12285" /><path
             fill-rule="nonzero"
             d="M 17.2844,24.0888 H 8.57328 v 1.66803 h 4.2157 v 3.33195 h 1.47676 v -3.33195 h 3.01866 v 4.23076 h 1.66873 v -4.23076 c 0,-0.922115 -0.745923,-1.66803 -1.66873,-1.66803 z"
             fill="#e6e7e8"
             id="path12287" /><polygon
             points="26.906,26.3992 26.906,26.1565 27.1446,26.1565 26.906,26.09 26.906,25.8871 25.238,25.4147 25.2304,25.4147 26.906,24.9533 26.906,24.7236 27.1947,24.6414 26.906,24.6414 26.906,24.4028 24.418,24.4028 24.418,24.8443 25.7337,24.8443 24.418,25.2111 24.418,25.5861 25.7186,25.9577 24.418,25.9577 24.418,26.3992 "
             fill-rule="nonzero"
             fill="#e6e7e8"
             id="polygon12289" /><path
             fill-rule="nonzero"
             d="m 25.6329,26.8483 c -0.332512,0 -0.617032,0.08159 -0.85219,0.24544 -0.268752,0.187165 -0.401756,0.440833 -0.401756,0.750032 0,0.308514 0.133005,0.558754 0.394901,0.750032 0.226245,0.163855 0.52722,0.250239 0.885784,0.250239 0.257782,0 0.488827,-0.04251 0.680106,-0.12889 0.194708,-0.08638 0.344167,-0.207047 0.449062,-0.359248 0.106267,-0.152886 0.155629,-0.324968 0.155629,-0.50802 0,-0.289318 -0.116551,-0.53133 -0.346909,-0.723295 -0.231044,-0.183737 -0.555329,-0.276977 -0.965312,-0.276977 z m 0.03496,1.53846 c -0.280407,0 -0.492254,-0.05485 -0.636914,-0.163855 -0.132319,-0.106266 -0.194708,-0.227615 -0.194708,-0.379815 0,-0.148772 0.06308,-0.273549 0.194708,-0.375016 0.140546,-0.109694 0.340053,-0.167969 0.597836,-0.167969 0.300975,0 0.523106,0.05485 0.663652,0.163855 0.133005,0.101467 0.194708,0.226929 0.194708,0.383243 0,0.09667 -0.02674,0.183052 -0.08913,0.264637 -0.05896,0.08159 -0.140546,0.144659 -0.242699,0.187851 -0.139861,0.05485 -0.30783,0.0857 -0.488141,0.0857 z"
             fill="#e6e7e8"
             id="path12291" /><path
             fill-rule="nonzero"
             d="m 24.418,30.0513 c 0,0.211161 0.04251,0.387357 0.124778,0.51899 0.0857,0.137117 0.231044,0.249554 0.433979,0.331824 0.19128,0.08159 0.425067,0.122035 0.698617,0.122035 0.211162,0 0.394215,-0.024 0.551215,-0.0713 0.160428,-0.04662 0.292747,-0.11655 0.401756,-0.207047 0.109009,-0.08981 0.187166,-0.202934 0.229673,-0.327711 0.03222,-0.09461 0.04731,-0.226244 0.04731,-0.398326 v -0.745919 h -2.48801 v 0.77677 z m 2.01975,-0.331824 v 0.292746 c 0,0.163855 -0.024,0.238584 -0.03908,0.277663 -0.03634,0.07747 -0.106267,0.140545 -0.218704,0.194707 -0.117236,0.05485 -0.288634,0.08296 -0.504595,0.08296 -0.202935,0 -0.379132,-0.02811 -0.523792,-0.08296 -0.09324,-0.03565 -0.163856,-0.08501 -0.202935,-0.1522 -0.04319,-0.06582 -0.0617,-0.172082 -0.0617,-0.311942 v -0.300973 h 1.55081 z"
             fill="#e6e7e8"
             id="path12293" /><polygon
             points="25.4642,32.9843 25.9339,32.9843 25.9339,31.9449 26.4378,31.9449 26.4378,33.0556 26.906,33.0556 26.906,31.4966 24.418,31.4966 24.418,33.0981 24.887,33.0981 24.887,31.9449 25.4642,31.9449 "
             fill-rule="nonzero"
             fill="#e6e7e8"
             id="polygon12295" /><polygon
             points="26.906,33.5472 24.418,33.5472 24.418,34.9224 24.887,34.9224 24.887,33.9962 26.906,33.9962 "
             fill-rule="nonzero"
             fill="#e6e7e8"
             id="polygon12297" /><polygon
             points="21.3198,25.1809 21.3315,25.1761 23.066,24.6647 23.066,24.1848 20.5739,24.9773 20.5739,25.1521 20.4807,25.1761 20.5739,25.1994 20.5739,25.3756 23.066,26.1764 23.066,25.7116 21.3315,25.1844 "
             fill-rule="nonzero"
             fill="#e6e7e8"
             id="polygon12299" /><polygon
             points="21.0463,26.9347 21.6249,26.9347 21.6249,27.9733 22.098,27.9733 22.098,26.9347 22.5978,26.9347 22.5978,28.0433 23.066,28.0433 23.066,26.4842 20.5739,26.4842 20.5739,28.0865 21.0463,28.0865 "
             fill-rule="nonzero"
             fill="#e6e7e8"
             id="polygon12301" /><polygon
             points="23.066,30.2234 23.066,29.7853 21.555,29.7853 23.066,28.9578 23.066,28.5437 20.5739,28.5437 20.5739,28.9811 22.0856,28.9811 20.5739,29.8093 20.5739,30.2234 "
             fill-rule="nonzero"
             fill="#e6e7e8"
             id="polygon12303" /><path
             fill-rule="nonzero"
             d="m 20.5739,31.5356 c 0,0.211161 0.04251,0.386671 0.129577,0.523789 0.0857,0.133004 0.231044,0.246126 0.429866,0.331824 0.190594,0.07747 0.429866,0.120663 0.699303,0.120663 0.211162,0 0.399014,-0.024 0.555329,-0.07404 0.159743,-0.04662 0.292747,-0.117921 0.401756,-0.203619 0.109695,-0.09324 0.187852,-0.202934 0.231044,-0.331824 0.03085,-0.09324 0.04594,-0.22213 0.04594,-0.394213 v -0.750032 h -2.49212 v 0.777456 z m 2.02455,-0.327711 v 0.293431 c 0,0.159742 -0.02468,0.237899 -0.03908,0.276977 -0.03496,0.07542 -0.106267,0.140545 -0.215276,0.191964 -0.120664,0.05485 -0.292747,0.08638 -0.508023,0.08638 -0.198821,0 -0.375018,-0.02811 -0.519678,-0.08159 -0.09735,-0.03908 -0.163856,-0.08638 -0.207049,-0.153572 -0.04251,-0.06582 -0.06239,-0.170711 -0.06239,-0.311942 v -0.300973 h 1.55149 z"
             fill="#e6e7e8"
             id="path12305" /><path
             fill-rule="nonzero"
             d="m 21.7929,32.9061 c -0.331826,0 -0.617032,0.0857 -0.851504,0.250239 -0.269437,0.187851 -0.40587,0.442204 -0.40587,0.750032 0,0.3092 0.137118,0.558754 0.399014,0.750032 0.226245,0.163855 0.52722,0.250239 0.885784,0.250239 0.257782,0 0.488827,-0.04319 0.680106,-0.12889 0.194708,-0.08501 0.343481,-0.207047 0.449062,-0.358562 0.106267,-0.1522 0.157,-0.324283 0.157,-0.512134 0,-0.285204 -0.117922,-0.527217 -0.34828,-0.71781 -0.231044,-0.187851 -0.554643,-0.281776 -0.964627,-0.281776 z m 0.03085,1.54257 c -0.276979,0 -0.491569,-0.05416 -0.632801,-0.163855 -0.128206,-0.104895 -0.194708,-0.226244 -0.194708,-0.37913 0,-0.148087 0.06307,-0.272864 0.194708,-0.375016 0.137118,-0.109008 0.33594,-0.167969 0.593722,-0.167969 0.305088,0 0.528591,0.05485 0.668451,0.163855 0.133005,0.101467 0.196079,0.226929 0.196079,0.382558 0,0.09804 -0.03222,0.183737 -0.08981,0.266008 -0.05896,0.08227 -0.141232,0.143973 -0.242699,0.183737 -0.140546,0.05896 -0.308516,0.08981 -0.492254,0.08981 z"
             fill="#e6e7e8"
             id="path12307" /><path
             fill-rule="nonzero"
             d="m 20.5739,35.7856 h 1.02016 v 0.188536 c 0,0.0857 -0.01577,0.12889 -0.024,0.1522 -0.01097,0.01988 -0.03908,0.05896 -0.101467,0.10558 -0.03908,0.02674 -0.133005,0.09324 -0.363363,0.211161 l -0.532019,0.281776 v 0.538872 l 0.769919,-0.405868 c 0.113123,-0.05896 0.219389,-0.12889 0.311944,-0.207047 0.0082,-0.0082 0.01577,-0.01234 0.01988,-0.01988 0.04319,0.102152 0.104895,0.183737 0.183053,0.253667 0.124778,0.101467 0.290005,0.156314 0.484713,0.156314 0.148088,0 0.281778,-0.03085 0.394215,-0.09392 0.113808,-0.05828 0.200193,-0.13986 0.253669,-0.246126 0.05073,-0.09667 0.07404,-0.237899 0.07404,-0.429178 v -0.93377 h -2.49212 v 0.44906 z m 2.03895,0 v 0.496365 c 0,0.10558 -0.02263,0.183737 -0.06993,0.231043 -0.04662,0.04731 -0.113123,0.07062 -0.202935,0.07062 -0.06307,0 -0.113123,-0.01234 -0.159743,-0.03908 -0.04251,-0.02262 -0.07404,-0.05485 -0.08981,-0.09804 -0.01988,-0.03496 -0.03496,-0.09667 -0.03496,-0.221445 v -0.43809 h 0.558071 z"
             fill="#e6e7e8"
             id="path12309" /></g><path
           d="m 38.2299,42.3809 v 15.8398 c 0,1.97998 -1.62005,3.60002 -3.60004,3.60002 h -2.04992 c -1.97999,0 -3.60004,-1.62004 -3.60004,-3.60002 V 42.3809 c 0,-1.97998 1.62005,-3.60002 3.60004,-3.60002 h 2.04992 c 1.97999,0 3.60004,1.62004 3.60004,3.60002 z m -8.49996,5.55806 v 5.69997 4.58178 c 0,1.56725 1.28274,2.84999 2.85,2.84999 h 2.04992 c 1.56726,0 2.85,-1.28273 2.85,-2.84999 v -4.58178 c 0,-1.56725 -1.28823,-2.84313 -2.85,-2.84999 h -2.04992 c -1.56589,0 -2.85,-1.28273 -2.85,-2.84999 z m 4.01071,-4.3096 c -0.0069,-0.0014 -0.01303,-0.0027 -0.01988,-0.0041 -0.04662,-0.0096 -0.09255,-0.02057 -0.136433,-0.03154 l -2.25285,-0.558068 v -1.30193 l 4.65516,-1.12231 v 1.24503 l -2.49487,0.519675 c -0.04594,0.0089 -0.09255,0.01646 -0.139175,0.02537 -0.04045,0.0075 -0.08159,0.01508 -0.122035,0.02262 0.02811,0.0055 0.05553,0.01097 0.08364,0.01645 0.04182,0.0082 0.08501,0.01645 0.124092,0.02674 l 2.54834,0.632797 v 1.06129 l -2.54697,0.632111 c -0.04114,0.01028 -0.08364,0.01851 -0.125463,0.02742 -0.02811,0.0062 -0.05553,0.01097 -0.08364,0.01645 0.04045,0.0075 0.0809,0.01508 0.12135,0.02263 0.04662,0.0089 0.09255,0.01714 0.141917,0.02605 l 2.49212,0.51899 v 1.24571 l -4.65516,-1.12231 v -1.29919 l 2.25491,-0.563553 c 0.04388,-0.01165 0.08913,-0.02125 0.13369,-0.03085 0.0069,-0.0014 0.01371,-0.0027 0.01988,-0.0041 z m 1.92034,3.70354 c 0.09461,0 0.19128,0.01371 0.27835,0.05279 0.07816,0.03496 0.146717,0.08638 0.199507,0.154257 0.05073,0.06513 0.08364,0.140545 0.102153,0.220759 0.01714,0.07473 0.02537,0.150829 0.02537,0.226929 0,0.07679 -0.0082,0.153572 -0.02537,0.225558 -0.01783,0.08021 -0.05142,0.155628 -0.102153,0.220759 -0.0521,0.06719 -0.119978,0.118607 -0.196765,0.154257 -0.08707,0.04114 -0.18511,0.05553 -0.280407,0.05553 -0.09598,0 -0.191966,-0.01508 -0.279721,-0.05553 -0.07747,-0.03565 -0.146031,-0.08707 -0.198136,-0.154257 -0.04936,-0.06376 -0.08296,-0.137803 -0.102839,-0.215274 -0.01988,-0.07541 -0.02742,-0.152886 -0.02742,-0.231043 0,-0.07816 0.0082,-0.155628 0.02742,-0.231043 0.01988,-0.07884 0.05348,-0.1522 0.103524,-0.216646 0.05279,-0.06856 0.122035,-0.119978 0.200193,-0.154943 0.08776,-0.03839 0.183053,-0.0521 0.277664,-0.0521 z m -4.32882,1.26971 V 47.3713 h 3.44989 v 1.23131 z m -0.220075,10.4161 v -1.27793 h 3.70425 v 1.27793 z m 4.62226,-1.31907 c 0.09804,0 0.199507,0.0144 0.290005,0.05485 0.0809,0.03634 0.15083,0.08913 0.205677,0.159056 0.0521,0.06719 0.08638,0.145344 0.105581,0.228301 0.01783,0.07884 0.02674,0.159056 0.02674,0.23927 0,0.0809 -0.0082,0.161113 -0.02674,0.237213 -0.01782,0.08296 -0.05348,0.161113 -0.105581,0.228301 -0.05416,0.06993 -0.124092,0.122035 -0.203621,0.159056 -0.0905,0.04251 -0.191966,0.05759 -0.291376,0.05759 -0.100096,0 -0.200193,-0.01577 -0.291376,-0.05759 -0.08021,-0.03702 -0.15083,-0.08981 -0.204992,-0.159742 -0.05073,-0.06582 -0.0857,-0.142602 -0.106267,-0.222816 -0.02057,-0.07953 -0.02879,-0.160427 -0.02879,-0.242012 0,-0.08158 0.0082,-0.163855 0.02879,-0.242698 0.02057,-0.08158 0.05485,-0.157685 0.106267,-0.224187 0.05416,-0.07062 0.126149,-0.123406 0.207049,-0.159056 0.09118,-0.04045 0.190594,-0.05485 0.289319,-0.05485 z m -0.800771,-3.69669 h -0.873443 v 2.6731 h -1.12848 v -2.6731 h -1.82024 v -1.27176 h 4.95065 v 4.0621 h -1.12848 v -2.79034 z"
           fill="#e6e7e8"
           id="path12313" /><path
           d="m 37.0007,25.6656 c -0.843963,-0.856298 -2.01769,-1.38694 -3.31483,-1.38694 -2.57165,0 -4.65585,2.08419 -4.65585,4.65582 0,1.30399 0.532704,2.47908 1.39655,3.32441 l -0.294119,0.294802 c -0.936518,-0.920058 -1.51858,-2.20211 -1.51858,-3.61921 0,-2.80131 2.27136,-5.07197 5.072,-5.07197 1.41232,0 2.68957,0.576579 3.60895,1.50829 l -0.294119,0.294802 z m 0.682163,2.82119 0.275608,0.09187 c 0.0096,0.117235 0.0144,0.235842 0.0144,0.35582 0,2.36802 -1.91966,4.28766 -4.28769,4.28766 -0.111066,0 -0.22076,-0.0041 -0.329769,-0.01303 l -0.105581,-0.30303 c 2.07666,-0.70684 3.7207,-2.34677 4.43235,-4.42067 z m -1.50487,-2.39201 0.726727,0.0082 c 0.228987,0.259838 0.426438,0.547784 0.588237,0.858355 -0.359935,3.03235 -2.78144,5.43191 -5.8241,5.75825 -0.287948,-0.153572 -0.556014,-0.339366 -0.800085,-0.551898 l 0.0055,-0.771286 c 0.02811,6.86e-4 0.0569,6.86e-4 0.08501,6.86e-4 2.88291,0 5.21941,-2.33717 5.21941,-5.21938 0,-0.02742 0,-0.05485 -6.86e-4,-0.08227 z m -4.05184,-0.767172 0.670508,-0.586863 c 0.908408,-0.189908 1.87235,-0.08501 2.71905,0.316056 0.08844,0.359248 0.135061,0.734264 0.135061,1.12094 0,2.59152 -2.10065,4.69216 -4.69219,4.69216 -0.404499,0 -0.797343,-0.05142 -1.17236,-0.147401 -0.111751,-0.244069 -0.201564,-0.499793 -0.266695,-0.765115 l 0.257782,-0.663648 c 0.366791,0.139174 0.76512,0.21596 1.18127,0.21596 1.84013,0 3.33129,-1.49184 3.33129,-3.33127 0,-0.260523 -0.02948,-0.51419 -0.08638,-0.757574 -0.18031,-0.03291 -0.351708,-0.03085 -0.517621,-0.0082 0.06856,0.243383 0.104895,0.500479 0.104895,0.765801 0,1.56382 -1.26766,2.83148 -2.83149,2.83148 -0.569726,0 -1.10037,-0.168654 -1.54464,-0.457972 0.02605,-0.294802 0.08227,-0.580692 0.165227,-0.854927 l 0.431922,-0.429178 c 0.253669,0.220759 0.584809,0.354449 0.948173,0.354449 0.797343,0 1.44386,-0.646509 1.44386,-1.44385 0,-0.317427 -0.102839,-0.611544 -0.276979,-0.850128 z m -0.417525,0.850128 c 0,0.414095 -0.33594,0.749347 -0.749351,0.749347 -0.414097,0 -0.750037,-0.335938 -0.750037,-0.749347 0,-0.414095 0.33594,-0.750032 0.750037,-0.750032 0.414097,0 0.749351,0.335938 0.749351,0.750032 z"
           fill="#e6e7e8"
           id="path12315" /></g><path
         fill-rule="nonzero"
         d="m 2.95627,23.7542 c 0,0.479911 -0.394901,0.874809 -0.874814,0.874809 -0.484713,0 -0.874814,-0.394898 -0.874814,-0.874809 0,-0.484025 0.390101,-0.874809 0.874814,-0.874809 0.484713,0 0.874814,0.39147 0.874814,0.874809 z M 0.00343,22.879391 c 0.479914,0 0.871386,0.39147 0.871386,0.874809 0,0.479911 -0.390787,0.871381 -0.871386,0.871381 v 0.542985 h 3.51914 v -2.83216 H 0.00343 Z"
         id="connector1pin"
         fill="#fff39d" /><path
         fill-rule="nonzero"
         d="m 2.95627,29.387 c 0,0.484025 -0.394901,0.874809 -0.874814,0.874809 -0.484713,0 -0.874814,-0.390785 -0.874814,-0.874809 0,-0.48471 0.390101,-0.874809 0.874814,-0.874809 0.484713,0 0.874814,0.390099 0.874814,0.874809 z M 0.00343,28.512191 c 0.479914,0 0.871386,0.390099 0.871386,0.874809 0,0.479911 -0.390787,0.874809 -0.871386,0.874809 V 30.80548 H 3.52257 V 27.96921 H 0.00343 v 0.542985 z"
         id="connector2pin"
         fill="#fff39d" /><path
         fill-rule="nonzero"
         d="m 2.95627,35.0205 c 0,0.484025 -0.394901,0.874809 -0.874814,0.874809 -0.484713,0 -0.874814,-0.390785 -0.874814,-0.874809 0,-0.480597 0.390101,-0.874809 0.874814,-0.874809 0.484713,0 0.874814,0.394213 0.874814,0.874809 z M 0.00343,34.145691 c 0.479914,0.0041 0.871386,0.394213 0.871386,0.874809 0,0.484025 -0.390787,0.874809 -0.871386,0.874809 v 0.542985 h 3.51914 v -2.83216 H 0.00343 v 0.538872 z"
         id="connector3pin"
         fill="#fff39d" /><path
         fill-rule="nonzero"
         d="m 2.95627,40.6526 c 0,0.48471 -0.394901,0.874809 -0.874814,0.874809 -0.484713,0 -0.874814,-0.390099 -0.874814,-0.874809 0,-0.479911 0.390101,-0.874809 0.874814,-0.874809 0.484713,0 0.874814,0.394898 0.874814,0.874809 z M 0.00343,39.777791 c 0.479914,0.0041 0.871386,0.394898 0.871386,0.874809 0,0.48471 -0.390787,0.874809 -0.871386,0.874809 v 0.542985 h 3.51914 v -2.83216 H 0.00343 v 0.538872 z"
         id="connector4pin"
         fill="#fff39d" /><path
         fill-rule="nonzero"
         d="m 2.95627,46.2895 c 0,0.481282 -0.394901,0.874809 -0.874814,0.874809 -0.484713,0 -0.874814,-0.394213 -0.874814,-0.874809 0,-0.479911 0.390101,-0.874809 0.874814,-0.874809 0.484713,0 0.874814,0.390785 0.874814,0.874809 z M 0.00343,45.414691 c 0.479914,0 0.871386,0.394898 0.871386,0.874809 0,0.481282 -0.390787,0.870696 -0.871386,0.874809 v 0.538872 h 3.51914 v -2.83148 H 0.00343 v 0.543671 z"
         id="connector5pin"
         fill="#fff39d" /><path
         fill-rule="nonzero"
         d="m 2.95627,51.9223 c 0,0.479911 -0.394901,0.874809 -0.874814,0.874809 -0.484713,0 -0.874814,-0.394898 -0.874814,-0.874809 0,-0.484025 0.390101,-0.874809 0.874814,-0.874809 0.484713,0 0.874814,0.390785 0.874814,0.874809 z M 0.00343,51.047491 c 0.479914,0 0.871386,0.390785 0.871386,0.874809 0,0.479911 -0.390787,0.871381 -0.871386,0.874809 v 0.538872 h 3.51914 v -2.83216 H 0.00343 v 0.542985 z"
         id="connector6pin"
         fill="#fff39d" /><path
         fill-rule="nonzero"
         d="m 2.95627,57.555 c 0,0.479911 -0.394901,0.874809 -0.874814,0.874809 -0.484713,0 -0.874814,-0.394898 -0.874814,-0.874809 0,-0.481282 0.390101,-0.874809 0.874814,-0.874809 0.484713,0 0.874814,0.390099 0.874814,0.874809 z M 0.00343,56.680191 c 0.479914,0.0034 0.871386,0.393527 0.871386,0.874809 0,0.479911 -0.390787,0.870696 -0.871386,0.874809 v 0.538872 h 3.51914 v -2.82805 H 0.00343 v 0.538872 z"
         id="connector7pin"
         fill="#fff39d" /><path
         fill-rule="nonzero"
         d="m 2.95627,63.1885 c 0,0.479911 -0.394901,0.874809 -0.874814,0.874809 -0.484713,0 -0.874814,-0.394898 -0.874814,-0.874809 0,-0.481282 0.390101,-0.874809 0.874814,-0.874809 0.484713,0 0.874814,0.390099 0.874814,0.874809 z M 0.00343,62.313691 c 0.479914,0.0041 0.871386,0.394213 0.871386,0.874809 0,0.479911 -0.390787,0.874809 -0.871386,0.874809 v 0.542985 h 3.51914 v -2.83216 H 0.00343 v 0.538872 z"
         id="connector8pin"
         fill="#fff39d" /><path
         fill-rule="nonzero"
         d="M 9.9205,68.0315 V 65.76358 H 7.08832 v 2.26792 h 0.542988 c 0,-0.484025 0.390787,-0.879608 0.874814,-0.879608 0.479914,0 0.874814,0.394898 0.874814,0.879608 h 0.538875 z"
         id="connector9pin"
         fill="#fff39d" /><path
         fill-rule="nonzero"
         d="m 15.5897,68.0315 v -2.26792 h -2.83218 v 2.26792 h 0.542988 c 0,-0.484025 0.390787,-0.879608 0.874814,-0.879608 0.479914,0 0.874814,0.394898 0.874814,0.879608 h 0.538875 z"
         id="connector10pin"
         fill="#fff39d" /><path
         fill-rule="nonzero"
         d="m 21.2588,68.0315 v -2.26792 h -2.83218 v 2.26792 h 0.542988 c 0,-0.484025 0.390787,-0.879608 0.874814,-0.879608 0.479914,0 0.874814,0.394898 0.874814,0.879608 h 0.538875 z"
         id="connector11pin"
         fill="#fff39d" /><path
         fill-rule="nonzero"
         d="m 26.928,68.0315 v -2.26792 h -2.83218 v 2.26792 h 0.542988 c 0,-0.484025 0.390787,-0.879608 0.874814,-0.879608 0.479914,0 0.874814,0.394898 0.874814,0.879608 h 0.538875 z"
         id="connector12pin"
         fill="#fff39d" /><path
         fill-rule="nonzero"
         d="m 32.5971,68.0315 v -2.26792 h -2.83218 v 2.26792 h 0.542988 c 0,-0.484025 0.390787,-0.879608 0.874814,-0.879608 0.479914,0 0.874814,0.394898 0.874814,0.879608 h 0.538875 z"
         id="connector13pin"
         fill="#fff39d" /><path
         fill-rule="nonzero"
         d="m 38.267,68.0315 v -2.26792 h -2.83218 v 2.26792 h 0.542988 c 0,-0.484025 0.390787,-0.879608 0.874814,-0.879608 0.479914,0 0.874814,0.394898 0.874814,0.879608 h 0.538875 z"
         id="connector14pin"
         fill="#fff39d" /><path
         fill-rule="nonzero"
         d="m 42.3976,63.0864 c 0,-0.479911 0.394901,-0.874809 0.879614,-0.874809 0.480599,0 0.870701,0.394898 0.870701,0.874809 0,0.480597 -0.390101,0.874809 -0.870701,0.874809 -0.484027,0 -0.879614,-0.39147 -0.879614,-0.874809 z m 2.95695,0.874809 c -0.479914,0 -0.874814,-0.394213 -0.874814,-0.874809 0,-0.479911 0.395586,-0.874809 0.874814,-0.874809 v -0.542985 h -3.51914 v 2.83559 h 3.51914 v -0.542985 z"
         id="connector15pin"
         fill="#fff39d" /><path
         fill-rule="nonzero"
         d="m 42.3976,57.4529 c 0,-0.484025 0.394901,-0.874809 0.879614,-0.874809 0.480599,0 0.870701,0.39147 0.870701,0.874809 0,0.481282 -0.390101,0.874809 -0.870701,0.874809 -0.484027,0 -0.879614,-0.390099 -0.879614,-0.874809 z m 2.95695,0.874809 c -0.479914,-0.0041 -0.874814,-0.393527 -0.874814,-0.874809 0,-0.479911 0.395586,-0.874809 0.874814,-0.874809 v -0.542985 h -3.51914 v 2.83216 h 3.51914 v -0.538872 z"
         id="connector16pin"
         fill="#fff39d" /><path
         fill-rule="nonzero"
         d="m 42.3976,51.8174 c 0,-0.481282 0.394901,-0.874809 0.879614,-0.874809 0.480599,0 0.870701,0.394213 0.870701,0.874809 0,0.484025 -0.390101,0.874809 -0.870701,0.874809 -0.484027,0 -0.879614,-0.39147 -0.879614,-0.874809 z m 2.95695,0.874809 c -0.479914,0 -0.874814,-0.39147 -0.874814,-0.874809 0,-0.481282 0.395586,-0.872067 0.874814,-0.872067 v -0.542985 h -3.51914 v 2.83148 h 3.51914 v -0.542299 z"
         id="connector17pin"
         fill="#fff39d" /><path
         fill-rule="nonzero"
         d="m 42.3976,46.188 c 0,-0.48471 0.394901,-0.874809 0.879614,-0.874809 0.480599,0 0.870701,0.390099 0.870701,0.874809 0,0.479911 -0.390101,0.874809 -0.870701,0.874809 -0.484027,0 -0.879614,-0.394898 -0.879614,-0.874809 z m 2.95695,0.874809 c -0.479914,-0.0041 -0.874814,-0.394898 -0.874814,-0.874809 0,-0.48471 0.395586,-0.874809 0.874814,-0.874809 v -0.542985 h -3.51914 v 2.83216 h 3.51914 v -0.538872 z"
         id="connector18pin"
         fill="#fff39d" /><path
         fill-rule="nonzero"
         d="m 42.3976,40.5511 c 0,-0.481282 0.394901,-0.874809 0.879614,-0.874809 0.480599,0 0.870701,0.394213 0.870701,0.874809 0,0.479911 -0.390101,0.874809 -0.870701,0.874809 -0.484027,0 -0.879614,-0.39147 -0.879614,-0.874809 z m 2.95695,0.874809 c -0.479914,0 -0.874814,-0.394898 -0.874814,-0.874809 0,-0.481282 0.395586,-0.870696 0.874814,-0.874809 v -0.538872 h -3.51914 v 2.83216 h 3.51914 v -0.542985 z"
         id="connector19pin"
         fill="#fff39d" /><path
         fill-rule="nonzero"
         d="m 42.3976,34.9183 c 0,-0.479911 0.394901,-0.874809 0.879614,-0.874809 0.480599,0 0.870701,0.394898 0.870701,0.874809 0,0.480597 -0.390101,0.874809 -0.870701,0.874809 -0.484027,0 -0.879614,-0.390785 -0.879614,-0.874809 z m 2.95695,0.874809 c -0.479914,0 -0.874814,-0.394213 -0.874814,-0.874809 0,-0.479911 0.395586,-0.871381 0.874814,-0.874809 v -0.538872 h -3.51914 v 2.83216 h 3.51914 v -0.542985 z"
         id="connector20pin"
         fill="#fff39d" /><path
         fill-rule="nonzero"
         d="m 42.3976,29.2855 c 0,-0.479911 0.394901,-0.874809 0.879614,-0.874809 0.480599,0 0.870701,0.395584 0.870701,0.874809 0,0.481282 -0.390101,0.874809 -0.870701,0.874809 -0.484027,0 -0.879614,-0.393527 -0.879614,-0.874809 z m 2.95695,0.874809 c -0.479914,-0.0041 -0.874814,-0.393527 -0.874814,-0.874809 0,-0.479911 0.395586,-0.870696 0.874814,-0.874809 v -0.538872 h -3.51914 v 2.83216 h 3.51914 v -0.542985 z"
         id="connector21pin"
         fill="#fff39d" /><path
         fill-rule="nonzero"
         d="m 42.3976,23.6528 c 0,-0.479911 0.394901,-0.874809 0.879614,-0.874809 0.480599,0 0.870701,0.394898 0.870701,0.874809 0,0.480597 -0.390101,0.874809 -0.870701,0.874809 -0.484027,0 -0.879614,-0.394213 -0.879614,-0.874809 z m 2.95695,0.874809 c -0.479914,-0.0034 -0.874814,-0.394213 -0.874814,-0.874809 0,-0.479911 0.395586,-0.874809 0.874814,-0.874809 v -0.542985 h -3.51914 v 2.83285 h 3.51914 v -0.539557 z"
         id="connector22pin"
         fill="#fff39d" /></g><g
       id="g10685"
       transform="matrix(0.01616087,0,0,0.01616087,92.87782,183.73331)">
	<path
   fill="#000080"
   d="m 835.5,473.6 c 0,-199.8 -162.2,-362 -362,-362 -199.8,0 -362,162.2 -362,362 0,199.8 162.2,362 362,362 199.8,0 362,-162.2 362,-362"
   id="path10669" />
	<path
   fill="#ffffff"
   d="m 729.5,323.6 c 0,-58.5 -47.5,-106 -106,-106 -58.5,0 -106,47.5 -106,106 0,58.5 47.5,106 106,106 58.5,0 106,-47.5 106,-106"
   id="path10671" />
	<path
   fill="#000080"
   d="m 941.5,111.5 c 0,-58.5 -47.5,-106 -106,-106 -58.5,0 -106,47.5 -106,106 0,58.5 47.5,106 106,106 58.5,0 106,-47.4 106,-106"
   id="path10673" />
	<g
   id="g10681">
		<path
   fill="#ffffff"
   d="m 258.1,627.8 h 117.3 v 26.7 H 227.8 V 417 h 30.3 z"
   id="path10675" />
		<path
   fill="#ffffff"
   d="m 515.5,654.5 v -23.8 c -16,22.5 -31.9,31.3 -57,31.3 -33.2,0 -54.4,-18.2 -54.4,-46.6 V 483.8 h 27 v 120.9 c 0,20.5 13.7,33.6 35.2,33.6 28.3,0 46.6,-22.8 46.6,-57.7 v -96.8 h 27 v 170.7 z"
   id="path10677" />
		<path
   fill="#ffffff"
   d="m 738.4,659.1 c -8.8,2.3 -13,2.9 -18.6,2.9 -17.6,0 -26.1,-7.8 -28,-25.1 -19.2,17.6 -36.5,25.1 -58,25.1 -34.5,0 -56,-19.5 -56,-50.5 0,-22.2 10.1,-37.5 30,-45.6 10.4,-4.2 16.3,-5.5 54.7,-10.4 21.5,-2.6 28.3,-7.5 28.3,-18.9 v -7.2 c 0,-16.3 -13.7,-25.4 -38.1,-25.4 -25.4,0 -37.8,9.4 -40.1,30.3 h -27.4 c 0.7,-16.9 3.9,-26.7 11.7,-35.5 11.4,-12.7 31.9,-19.9 56.7,-19.9 42,0 64.2,16.3 64.2,46.6 v 100.4 c 0,8.5 5.2,13.4 14.7,13.4 1.6,0 2.9,0 5.9,-0.7 z m -47.6,-89 c -9.1,4.2 -15,5.5 -43.7,9.4 -29,4.2 -41.1,13.4 -41.1,31.3 0,17.3 12.4,27.4 33.6,27.4 16,0 29.3,-5.2 40.4,-15.3 8.1,-7.5 10.8,-13 10.8,-22.2 z"
   id="path10679" />
	</g>
	<path
   fill="none"
   stroke="#808080"
   stroke-width="10.8612"
   stroke-miterlimit="10"
   stroke-dasharray="40.8475"
   d="m 890.6,261 c 33.5,65.8 51,138.6 51,212.5 0,258.4 -209.7,468.1 -468.1,468.1 C 215.1,941.6 5.4,731.9 5.4,473.5 5.4,215.1 215.1,5.4 473.5,5.4 c 83.1,0 164.6,22.1 236.2,63.9"
   id="path10683" />
</g></g></svg>
