@startuml
"Editor" *-- "TreeView"
"Editor" *-- "TagFile"
"Editor" *-- "Workspace"
"Editor" *-- "Log"
"Editor" *-- "Commandline"
"Editor" *-- "Menubar"
"Editor" o-- "PlugPlatform"

"Workspace" *-- "Codemirror"
"Workspace" *-- "Blockly"

class "Editor" {
  #generatedCode: string
  #log: object
  .. Props ..
  #plugPlataform:PlugPlatform[]
  #workspaceFiles[{path,ext,platform,buffer,content}]
  #pathSelect: string
  #treeFiles[]
  __
  -addWorkspaceFile(path,plugPlatform): workspaceFiles
  #setContext()
  #setContentFile()
  #setGeneratedCode()
  #setPathSelect(path): pathSelect
  #removePathSelected(path): fileWorkspace
  .. Emit ..
  #execCommand()
  #openFolder(): treeFiles[]
  #openFile()
  #newFile()
  #saveFile()
  #help()
  #selectPathToOpen(path): addFileWorkspace
}
class "PlugPlatform" {
  +prop.workspaceFiles
  +prop.pathSelect
  +platformId: string
  +extensionFile: string[]
  +blocklyOption: {}
  +codemirrorOption: {}
  +commandMenu: {}[]
  +commandLines: []
  +docs: {}
}
class "TreeView" {
  +prop.treeFiles
  +emit.selectPathToOpen(
  click.path)
  -updateTreeView(treeFiles)
}
class "TagFile" {
  +prop.filesWorkspace
  +prop.pathSelect
  +emit.setPathSelect(click)
  +emit.removePathSelected()
  -watch.fileWorkspace()
  -printFilesInTagFiles()
}
class "Workspace" {
  +prop.plugPlataform
  +prop.workspaceFiles
  +pathSelect
  #context
  #contentFile
  #blocklyXml
  #generatedCode
  +emit.setContentFile()
  +emit.setGeneratedCode()
  #setContentFile()
  #setBlocklyXml()
  -setContentFileFromBlockly()
}
class "Blockly" {
  +prop.context
  +prop.blocklyXml
  +emit.setGeneratedCode()
  +emit.setBlocklyXml()
  -watch.getContext()
  -watch.getBlocklyXml()
}
class "Codemirror" {
  +prop.context
  +prop.contentFile
  +emit.setContentFile()
  -watch.getContext()
  -watch.getContentFile()
}
class "Log" {
  #prop.log
}
class "Commandline" {
  +prop.context
  +prop.contentFile
  +prop.generatedCode
  -updatePluginsCommands()
  +emit.execCommand()
  +emit.openFolder()
  +emit.newFile()
  +emit.saveFile()
  +emit.help()
}
class "Menubar" {
  +prop.context
  +prop.contentFile
  +prop.generatedCode
  -updatePluginsCommands()
  +emit.execCommand()
  +emit.openFolder()
  +emit.newFile()
  +emit.saveFile()
  +emit.help()
}


@enduml
