@startuml
class "Editor" {
  #plugPlatform:PlugPlatform[]
  #treeFiles[]
  #pathSelect: string
  #filesWorkspace[]
  #contentFile: string
  #generatedCode: string
  #log: object
  #setContext()
  #setContentFile()
  #setGeneratedCode()
  #setPathToValidate(path): addFileWorkspace
  -addFileWorkspace(path,PlugPlataform): fileWorkspace
  #setPathSelect(path): pathSelect
  #removePathSelected(path): fileWorkspace
  ..Private setters..
  -setPlugPlatform()
}
 
note left of Editor::setPlugPlatform
Se requiere cargar todos los plugins para que sean
disponibles en el editor. Estos plugin serán disponibles
en el directorio plugins
end note
@enduml
