{
  "chunk": [
    "main:229",
    "blocks:10:main",
    "all:11:main",
    "all1:11:main",
    "all2:11:main",
    "all3:11:main",
    "all4:11:main"
  ],
  "js": [
    "./build/src/core/trashcan.js",
    "./build/src/core/toolbox/toolbox.js",
    "./build/src/core/toolbox/separator.js",
    "./build/src/core/toolbox/collapsible_category.js",
    "./build/src/core/toolbox/toolbox_item.js",
    "./build/src/core/toolbox/category.js",
    "./build/src/core/theme/zelos.js",
    "./build/src/core/theme/themes.js",
    "./build/src/core/shortcut_items.js",
    "./build/src/core/serialization/workspaces.js",
    "./build/src/core/serialization/variables.js",
    "./build/src/core/renderers/zelos/renderer.js",
    "./build/src/core/renderers/zelos/path_object.js",
    "./build/src/core/renderers/zelos/marker_svg.js",
    "./build/src/core/renderers/zelos/measurables/top_row.js",
    "./build/src/core/renderers/zelos/measurables/row_elements.js",
    "./build/src/core/renderers/zelos/measurables/inputs.js",
    "./build/src/core/renderers/zelos/measurables/bottom_row.js",
    "./build/src/core/renderers/zelos/info.js",
    "./build/src/core/renderers/zelos/drawer.js",
    "./build/src/core/renderers/zelos/constants.js",
    "./build/src/core/renderers/zelos/zelos.js",
    "./build/src/core/renderers/thrasos/renderer.js",
    "./build/src/core/renderers/thrasos/info.js",
    "./build/src/core/renderers/thrasos/thrasos.js",
    "./build/src/core/renderers/minimalist/renderer.js",
    "./build/src/core/renderers/minimalist/info.js",
    "./build/src/core/renderers/minimalist/drawer.js",
    "./build/src/core/renderers/minimalist/constants.js",
    "./build/src/core/renderers/minimalist/minimalist.js",
    "./build/src/core/renderers/geras/renderer.js",
    "./build/src/core/renderers/geras/path_object.js",
    "./build/src/core/renderers/geras/measurables/statement_input.js",
    "./build/src/core/renderers/geras/measurables/inline_input.js",
    "./build/src/core/renderers/geras/info.js",
    "./build/src/core/renderers/geras/highlight_constants.js",
    "./build/src/core/renderers/geras/highlighter.js",
    "./build/src/core/renderers/geras/drawer.js",
    "./build/src/core/renderers/geras/constants.js",
    "./build/src/core/renderers/geras/geras.js",
    "./build/src/core/workspace_drag_surface_svg.js",
    "./build/src/core/shortcut_registry.js",
    "./build/src/core/inject.js",
    "./build/src/core/generator.js",
    "./build/src/core/flyout_vertical.js",
    "./build/src/core/flyout_horizontal.js",
    "./build/src/core/sprites.js",
    "./build/src/core/positionable_helpers.js",
    "./build/src/core/zoom_controls.js",
    "./build/src/core/workspace_audio.js",
    "./build/src/core/variable_map.js",
    "./build/src/core/workspace.js",
    "./build/src/core/variables_dynamic.js",
    "./build/src/core/utils.js",
    "./build/src/core/touch_gesture.js",
    "./build/src/core/theme_manager.js",
    "./build/src/core/renderers/common/renderer.js",
    "./build/src/core/renderers/common/path_object.js",
    "./build/src/core/renderers/common/marker_svg.js",
    "./build/src/core/renderers/common/info.js",
    "./build/src/core/renderers/common/drawer.js",
    "./build/src/core/renderers/common/debugger.js",
    "./build/src/core/renderers/common/debug.js",
    "./build/src/core/renderers/common/constants.js",
    "./build/src/core/renderers/measurables/top_row.js",
    "./build/src/core/renderers/measurables/square_corner.js",
    "./build/src/core/renderers/measurables/spacer_row.js",
    "./build/src/core/renderers/measurables/round_corner.js",
    "./build/src/core/renderers/measurables/previous_connection.js",
    "./build/src/core/renderers/measurables/output_connection.js",
    "./build/src/core/renderers/measurables/next_connection.js",
    "./build/src/core/renderers/measurables/jagged_edge.js",
    "./build/src/core/renderers/measurables/statement_input.js",
    "./build/src/core/renderers/measurables/input_row.js",
    "./build/src/core/renderers/measurables/inline_input.js",
    "./build/src/core/renderers/measurables/in_row_spacer.js",
    "./build/src/core/renderers/measurables/icon.js",
    "./build/src/core/renderers/measurables/hat.js",
    "./build/src/core/renderers/measurables/field.js",
    "./build/src/core/renderers/measurables/input_connection.js",
    "./build/src/core/renderers/measurables/external_value_input.js",
    "./build/src/core/renderers/measurables/connection.js",
    "./build/src/core/renderers/measurables/row.js",
    "./build/src/core/renderers/measurables/bottom_row.js",
    "./build/src/core/renderers/measurables/types.js",
    "./build/src/core/renderers/measurables/base.js",
    "./build/src/core/renderers/common/block_rendering.js",
    "./build/src/core/names.js",
    "./build/src/core/procedures.js",
    "./build/src/core/grid.js",
    "./build/src/core/workspace_dragger.js",
    "./build/src/core/gesture.js",
    "./build/src/core/workspace_svg.js",
    "./build/src/core/scrollbar_pair.js",
    "./build/src/core/metrics_manager.js",
    "./build/src/core/flyout_metrics_manager.js",
    "./build/src/core/flyout_button.js",
    "./build/src/core/flyout_base.js",
    "./build/src/core/field_variable.js",
    "./build/src/core/field_number.js",
    "./build/src/core/field_multilineinput.js",
    "./build/src/core/field_label_serializable.js",
    "./build/src/core/field_image.js",
    "./build/src/core/field_colour.js",
    "./build/src/core/field_checkbox.js",
    "./build/src/core/field_textinput.js",
    "./build/src/core/field_angle.js",
    "./build/src/core/drag_target.js",
    "./build/src/core/delete_area.js",
    "./build/src/core/events/events_block_move.js",
    "./build/src/core/events/events_click.js",
    "./build/src/core/events/events_comment_base.js",
    "./build/src/core/events/events_comment_change.js",
    "./build/src/core/events/events_comment_create.js",
    "./build/src/core/events/events_comment_delete.js",
    "./build/src/core/events/events_comment_move.js",
    "./build/src/core/events/events_marker_move.js",
    "./build/src/core/events/events_theme_change.js",
    "./build/src/core/events/events_toolbox_item_select.js",
    "./build/src/core/events/events_trashcan_open.js",
    "./build/src/core/events/events_var_delete.js",
    "./build/src/core/events/events_var_rename.js",
    "./build/src/core/events/events_viewport.js",
    "./build/src/core/events/events.js",
    "./build/src/core/contextmenu_items.js",
    "./build/src/core/connection_db.js",
    "./build/src/core/connection_checker.js",
    "./build/src/core/bubble_dragger.js",
    "./build/src/core/warning.js",
    "./build/src/core/utils/svg_paths.js",
    "./build/src/core/rendered_connection.js",
    "./build/src/core/keyboard_nav/marker.js",
    "./build/src/core/keyboard_nav/cursor.js",
    "./build/src/core/keyboard_nav/basic_cursor.js",
    "./build/src/core/keyboard_nav/tab_navigate_cursor.js",
    "./build/src/core/internal_constants.js",
    "./build/src/core/contextmenu_registry.js",
    "./build/src/core/clipboard.js",
    "./build/src/core/contextmenu.js",
    "./build/src/core/comment.js",
    "./build/src/core/block_svg.js",
    "./build/src/core/component_manager.js",
    "./build/src/core/insertion_marker_manager.js",
    "./build/src/core/bump_objects.js",
    "./build/src/core/events/events_block_drag.js",
    "./build/src/core/block_dragger.js",
    "./build/src/core/block_drag_surface.js",
    "./build/src/core/block_animations.js",
    "./build/src/core/utils/array.js",
    "./build/src/core/keyboard_nav/ast_node.js",
    "./build/src/core/utils/toolbox.js",
    "./build/src/core/theme/classic.js",
    "./build/src/core/theme.js",
    "./build/src/core/options.js",
    "./build/src/core/icon.js",
    "./build/src/core/config.js",
    "./build/src/core/scrollbar.js",
    "./build/src/core/bubble.js",
    "./build/src/core/events/events_bubble_open.js",
    "./build/src/core/mutator.js",
    "./build/src/core/menuitem.js",
    "./build/src/core/utils/keycodes.js",
    "./build/src/core/utils/aria.js",
    "./build/src/core/menu.js",
    "./build/src/core/field_registry.js",
    "./build/src/core/widgetdiv.js",
    "./build/src/core/utils/sentinel.js",
    "./build/src/core/utils/colour.js",
    "./build/src/core/utils/parsing.js",
    "./build/src/core/tooltip.js",
    "./build/src/core/marker_manager.js",
    "./build/src/core/field.js",
    "./build/src/core/utils/math.js",
    "./build/src/core/dropdowndiv.js",
    "./build/src/core/field_dropdown.js",
    "./build/src/core/extensions.js",
    "./build/src/core/constants.js",
    "./build/src/core/connection_type.js",
    "./build/src/core/connection.js",
    "./build/src/core/events/events_block_delete.js",
    "./build/src/core/events/events_block_change.js",
    "./build/src/core/block.js",
    "./build/src/core/field_label.js",
    "./build/src/core/input.js",
    "./build/src/core/utils/object.js",
    "./build/src/core/utils/string.js",
    "./build/src/core/events/events_ui.js",
    "./build/src/core/events/workspace_events.js",
    "./build/src/core/events/events_block_base.js",
    "./build/src/core/serialization/registry.js",
    "./build/src/core/serialization/priorities.js",
    "./build/src/core/serialization/exceptions.js",
    "./build/src/core/utils/useragent.js",
    "./build/src/core/utils/dom.js",
    "./build/src/core/dialog.js",
    "./build/src/core/msg.js",
    "./build/src/core/events/events_abstract.js",
    "./build/src/core/events/events_var_base.js",
    "./build/src/core/events/events_var_create.js",
    "./build/src/core/variable_model.js",
    "./build/src/core/variables.js",
    "./build/src/core/utils/coordinate.js",
    "./build/src/core/workspace_comment.js",
    "./build/src/core/events/events_ui_base.js",
    "./build/src/core/events/events_selected.js",
    "./build/src/core/touch.js",
    "./build/src/core/browser_events.js",
    "./build/src/core/utils/deprecation.js",
    "./build/src/core/css.js",
    "./build/src/core/utils/rect.js",
    "./build/src/core/utils/svg.js",
    "./build/src/core/utils/style.js",
    "./build/src/core/utils/svg_math.js",
    "./build/src/core/workspace_comment_svg.js",
    "./build/src/core/xml.js",
    "./build/src/core/utils/xml.js",
    "./build/src/core/utils/size.js",
    "./build/src/core/input_types.js",
    "./build/src/core/utils/idgenerator.js",
    "./build/src/core/blocks.js",
    "./build/src/core/common.js",
    "./build/src/core/events/utils.js",
    "./build/src/core/serialization/blocks.js",
    "./build/src/core/registry.js",
    "./build/src/core/events/events_block_create.js",
    "./build/src/closure/goog/goog.js",
    "./build/src/core/blockly.js",
    "./build/src/closure/goog/base_minimal.js",
    "./build/src/core/main.js",
    "./blocks/variables_dynamic.js",
    "./blocks/variables.js",
    "./blocks/text.js",
    "./blocks/procedures.js",
    "./blocks/math.js",
    "./blocks/loops.js",
    "./blocks/logic.js",
    "./blocks/lists.js",
    "./blocks/colour.js",
    "./blocks/blocks.js",
    "./generators/javascript/variables_dynamic.js",
    "./generators/javascript/variables.js",
    "./generators/javascript/text.js",
    "./generators/javascript/procedures.js",
    "./generators/javascript/math.js",
    "./generators/javascript/loops.js",
    "./generators/javascript/logic.js",
    "./generators/javascript/lists.js",
    "./generators/javascript/colour.js",
    "./generators/javascript.js",
    "./generators/javascript/all.js",
    "./generators/python/variables_dynamic.js",
    "./generators/python/variables.js",
    "./generators/python/text.js",
    "./generators/python/procedures.js",
    "./generators/python/math.js",
    "./generators/python/loops.js",
    "./generators/python/logic.js",
    "./generators/python/lists.js",
    "./generators/python/colour.js",
    "./generators/python.js",
    "./generators/python/all.js",
    "./generators/php/variables_dynamic.js",
    "./generators/php/variables.js",
    "./generators/php/text.js",
    "./generators/php/procedures.js",
    "./generators/php/math.js",
    "./generators/php/loops.js",
    "./generators/php/logic.js",
    "./generators/php/lists.js",
    "./generators/php/colour.js",
    "./generators/php.js",
    "./generators/php/all.js",
    "./generators/lua/variables_dynamic.js",
    "./generators/lua/variables.js",
    "./generators/lua/text.js",
    "./generators/lua/procedures.js",
    "./generators/lua/math.js",
    "./generators/lua/loops.js",
    "./generators/lua/logic.js",
    "./generators/lua/lists.js",
    "./generators/lua/colour.js",
    "./generators/lua.js",
    "./generators/lua/all.js",
    "./generators/dart/variables_dynamic.js",
    "./generators/dart/variables.js",
    "./generators/dart/text.js",
    "./generators/dart/procedures.js",
    "./generators/dart/math.js",
    "./generators/dart/loops.js",
    "./generators/dart/logic.js",
    "./generators/dart/lists.js",
    "./generators/dart/colour.js",
    "./generators/dart.js",
    "./generators/dart/all.js",
    "./generators/chuck/variables_dynamic.js",
    "./generators/chuck/variables.js",
    "./generators/chuck.js",
    "./generators/chuck/all.js"
  ]
}
