<?xml version="1.0" encoding="UTF-8" standalone="no"?>
<!-- Uploaded to: SVG Repo, www.svgrepo.com, Generator: SVG Repo Mixer Tools -->

<svg
   width="466.66666"
   height="683.98999"
   viewBox="0 0 41.999999 61.559099"
   id="emoji"
   version="1.1"
   sodipodi:docname="led.svg"
   inkscape:version="1.2.2 (b0a8486541, 2022-12-01)"
   xmlns:inkscape="http://www.inkscape.org/namespaces/inkscape"
   xmlns:sodipodi="http://sodipodi.sourceforge.net/DTD/sodipodi-0.dtd"
   xmlns="http://www.w3.org/2000/svg"
   xmlns:svg="http://www.w3.org/2000/svg">
  <defs
     id="defs36" />
  <sodipodi:namedview
     id="namedview34"
     pagecolor="#ffffff"
     bordercolor="#666666"
     borderopacity="1.0"
     inkscape:showpageshadow="2"
     inkscape:pageopacity="0.0"
     inkscape:pagecheckerboard="0"
     inkscape:deskcolor="#d1d1d1"
     showgrid="false"
     inkscape:zoom="0.295"
     inkscape:cx="-676.27119"
     inkscape:cy="337.28814"
     inkscape:window-width="1918"
     inkscape:window-height="1150"
     inkscape:window-x="1440"
     inkscape:window-y="24"
     inkscape:window-maximized="1"
     inkscape:current-layer="emoji" />
  <g
     id="color"
     transform="translate(-15,-6.0359)">
    <path
       fill="#92d3f5"
       stroke="none"
       d="m 31.3882,26.7177 c 0,0 9.2367,-1.8188 8.4221,-9.1964 C 38.4565,5.2603 38.3425,7.0976 38.3425,7.0976 L 32.8132,8.108 c 10e-5,10e-5 3.1866,13.5938 -1.425,18.6097 z"
       id="path2" />
    <path
       fill="#92d3f5"
       stroke="none"
       stroke-linecap="round"
       stroke-linejoin="round"
       stroke-miterlimit="10"
       stroke-width="2"
       d="m 34.5417,7.0359 c -8.1462,0 -14.75,7.496 -14.75,16.7427 v 16.388 h 29.5"
       id="path4" />
    <rect
       x="26.8333"
       y="44.5"
       width="4"
       height="22.094999"
       fill="#d0cfce"
       stroke="none"
       stroke-linecap="round"
       stroke-linejoin="round"
       stroke-miterlimit="10"
       stroke-width="2"
       id="rect6" />
    <rect
       x="41.333302"
       y="44.5"
       width="4"
       height="16.4792"
       fill="#d0cfce"
       stroke="none"
       stroke-linecap="round"
       stroke-linejoin="round"
       stroke-miterlimit="10"
       stroke-width="2"
       id="rect8" />
    <path
       fill="#61b2e4"
       stroke="none"
       d="m 34.5417,7.5625 c 0,0 15.3232,0.5495 15.9047,13.875 0.9664,22.1458 0.0665,18.9191 0.0665,18.9191 l -9.3254,-0.19 c 0,10e-5 1.4372,-25.0416 -6.6458,-32.6041 z"
       id="path10" />
    <rect
       x="43.333302"
       y="40.791698"
       width="11.8333"
       height="3.0833001"
       fill="#61b2e4"
       stroke="none"
       id="rect12" />
    <rect
       x="16.3353"
       y="40.791698"
       width="26.997999"
       height="3.0833001"
       fill="#92d3f5"
       stroke="none"
       id="rect14" />
  </g>
  <g
     id="hair"
     transform="translate(-15,-6.0359)" />
  <g
     id="skin"
     transform="translate(-15,-6.0359)" />
  <g
     id="skin-shadow"
     transform="translate(-15,-6.0359)" />
  <g
     id="line"
     transform="translate(-15,-6.0359)">
    <path
       fill="none"
       stroke="#000000"
       stroke-linecap="round"
       stroke-linejoin="round"
       stroke-miterlimit="10"
       stroke-width="2"
       d="m 34.5417,7.0359 c -8.1462,0 -14.75,7.496 -14.75,16.7427 v 16.388 h 29.5"
       id="path20" />
    <rect
       x="26.8333"
       y="44.5"
       width="4"
       height="22.094999"
       fill="none"
       stroke="#000000"
       stroke-linecap="round"
       stroke-linejoin="round"
       stroke-miterlimit="10"
       stroke-width="2"
       id="rect22" />
    <rect
       x="41.333302"
       y="44.5"
       width="4"
       height="16.4792"
       fill="none"
       stroke="#000000"
       stroke-linecap="round"
       stroke-linejoin="round"
       stroke-miterlimit="10"
       stroke-width="2"
       id="rect24" />
    <path
       fill="none"
       stroke="#000000"
       stroke-linecap="round"
       stroke-linejoin="round"
       stroke-miterlimit="10"
       stroke-width="2"
       d="M 25.8125,19.0625"
       id="path26" />
    <path
       fill="none"
       stroke="#000000"
       stroke-linecap="round"
       stroke-linejoin="round"
       stroke-miterlimit="10"
       stroke-width="2"
       d="m 35.2497,7.0359 c 8.1462,0 14.75,7.496 14.75,16.7427 v 7.388"
       id="path28" />
    <polygon
       fill="none"
       stroke="#000000"
       stroke-linecap="round"
       stroke-linejoin="round"
       stroke-miterlimit="10"
       stroke-width="2"
       points="45.9063,44.5 56,44.5 56,40.1667 45.9063,40.1667 45.4999,40.1667 16,40.1667 16,44.5 45.5309,44.5 "
       id="polygon30" />
  </g>
  <path
     style="fill:#ff7f2a;fill-opacity:0.933333;stroke:#000000;stroke-width:0.320299;stroke-linecap:round;stroke-miterlimit:0;paint-order:fill markers stroke;stop-color:#000000"
     d="M 66.982146,261.86441 C 68.506051,148.20591 69.036334,144.61176 90.117158,105.06008 111.74655,64.47919 160.01588,30.008319 202.05736,25.119549 c 18.69526,-2.173967 19.15227,-2.01906 27.90739,9.459503 35.30638,46.289046 55.25743,134.857248 58.83477,261.183658 l 1.99187,70.33898 H 178.18797 65.584559 Z"
     id="path409"
     transform="scale(0.09)" />
  <path
     style="fill:#ff6600;fill-opacity:0.933333;stroke:#000000;stroke-width:0.320299;stroke-linecap:round;stroke-miterlimit:0;paint-order:fill markers stroke;stop-color:#000000"
     d="M 293.20876,321.18644 C 293.18788,240.24618 281.45642,148.25676 265.00074,100 255.96248,73.495075 240.93427,42.076342 232.96767,33.030065 c -2.88337,-3.274142 -4.263,-6.932474 -3.06585,-8.129626 3.75594,-3.755941 46.76205,8.585094 63.02425,18.085441 21.80021,12.735645 47.50347,40.077049 60.35802,64.20484 17.5328,32.90876 21.29218,53.35075 21.29218,115.77823 0,57.16509 2.21258,68.55647 13.31592,68.55647 8.86476,0 10.41289,6.34101 10.41289,42.65013 v 31.92614 h -52.54237 -52.54237 z"
     id="path480"
     transform="scale(0.09)" />
  <path
     style="fill:#ff7f2a;fill-opacity:0.933333;stroke:#000000;stroke-width:0.320299;stroke-linecap:round;stroke-miterlimit:0;paint-order:fill markers stroke;stop-color:#000000"
     d="M 25.423729,403.38983 V 393.22034 H 169.49153 313.55932 v 10.16949 10.16949 H 169.49153 25.423729 Z"
     id="path551"
     transform="scale(0.09)" />
  <path
     style="fill:#ff6600;fill-opacity:0.933333;stroke:#000000;stroke-width:0.320299;stroke-linecap:round;stroke-miterlimit:0;paint-order:fill markers stroke;stop-color:#000000"
     d="m 316.94915,403.38983 v -10.16949 h 62.71187 62.71186 v 10.16949 10.16949 h -62.71186 -62.71187 z"
     id="path553"
     transform="scale(0.09)" />
  <path
     style="fill:#f2f2f2;fill-opacity:0.933333;stroke:#000000;stroke-width:0.320299;stroke-linecap:round;stroke-miterlimit:0;paint-order:fill markers stroke;stop-color:#000000"
     d="M 68.687797,273.72881 C 69.976739,169.03616 72.759003,145.37048 87.304078,115.38047 108.73253,71.197864 161.67858,31.284251 203.45464,27.819855 l 18.20458,-1.509666 13.76488,21.296947 c 31.50046,48.737332 46.86149,127.900974 52.42797,270.189474 l 1.75713,44.91525 H 178.60074 67.592267 Z"
     id="path392"
     transform="scale(0.09)" />
  <path
     style="fill:#f2f2f2;fill-opacity:0.933333;stroke:#000000;stroke-width:0.320299;stroke-linecap:round;stroke-miterlimit:0;paint-order:fill markers stroke;stop-color:#000000"
     d="m 296.52926,350 c -0.0445,-6.99153 -1.50538,-39.40678 -3.2464,-72.0339 -5.54434,-103.90233 -18.0218,-166.16722 -43.82957,-218.717829 -17.7037,-36.048859 -17.45952,-36.501677 13.87084,-25.722452 28.47167,9.795692 37.27571,15.268573 58.16344,36.156293 12.86522,12.86523 23.90464,28.629949 33.23753,47.464498 l 13.97425,28.20122 3.0499,65.46168 c 1.67745,36.00392 3.74919,68.72518 4.60387,72.7139 0.90182,4.20871 5.12286,8.14797 10.05805,9.38662 8.36831,2.10031 8.50408,2.67458 8.50408,35.96811 v 33.83372 h -49.15254 -49.15254 z"
     id="path463"
     transform="scale(0.09)" />
  <path
     style="fill:#f9f9f9;fill-opacity:0.933333;stroke:#000000;stroke-width:0.320299;stroke-linecap:round;stroke-miterlimit:0;paint-order:fill markers stroke;stop-color:#000000"
     d="m 320.33898,403.38983 c 0,-6.52139 2.25989,-6.77966 59.32204,-6.77966 57.06214,0 59.32203,0.25827 59.32203,6.77966 0,6.52139 -2.25989,6.77966 -59.32203,6.77966 -57.06215,0 -59.32204,-0.25827 -59.32204,-6.77966 z"
     id="path465"
     transform="scale(0.09)" />
  <path
     style="fill:#f9f9f9;fill-opacity:0.933333;stroke:#000000;stroke-width:0.320299;stroke-linecap:round;stroke-miterlimit:0;paint-order:fill markers stroke;stop-color:#000000"
     d="m 28.813559,403.38983 c 0,-6.67075 2.259887,-6.77966 140.677971,-6.77966 138.41807,0 140.67796,0.10891 140.67796,6.77966 0,6.67075 -2.25989,6.77966 -140.67796,6.77966 -138.418084,0 -140.677971,-0.10891 -140.677971,-6.77966 z"
     id="path467"
     transform="scale(0.09)" />
  <path
     style="fill:#f9f9f9;fill-opacity:0.933333;stroke:#000000;stroke-width:0.320299;stroke-linecap:round;stroke-miterlimit:0;paint-order:fill markers stroke;stop-color:#000000"
     d="M 144.0678,550.84746 V 440.67797 h 10.16949 10.16949 V 550.84746 661.01695 H 154.23729 144.0678 Z"
     id="path469"
     transform="scale(0.09)" />
  <path
     style="fill:#f9f9f9;fill-opacity:0.933333;stroke:#000000;stroke-width:0.320299;stroke-linecap:round;stroke-miterlimit:0;paint-order:fill markers stroke;stop-color:#000000"
     d="m 306.77966,518.64407 v -77.9661 h 8.47458 8.47457 v 77.9661 77.9661 h -8.47457 -8.47458 z"
     id="path473"
     transform="scale(0.09)" />
</svg>
