PCBNEW-LibModule-V1  2020-05-07 16:04:52
# encoding utf-8
Units mm
$INDEX
DIOM7959X262N
$EndINDEX
$MODULE DIOM7959X262N
Po 0 0 0 15 5eb42394 00000000 ~~
Li DIOM7959X262N
Cd SMC (DO-214AB)12
Kw Schottky Diode
Sc 0
At SMD
AR 
Op 0 0 0
T0 0 0 1.27 1.27 0 0.254 N V 21 N "D**"
T1 0 0 1.27 1.27 0 0.254 N I 21 N "DIOM7959X262N"
DS -4.85 -3.36 4.85 -3.36 0.05 24
DS 4.85 -3.36 4.85 3.36 0.05 24
DS 4.85 3.36 -4.85 3.36 0.05 24
DS -4.85 3.36 -4.85 -3.36 0.05 24
DS -3.97 -2.952 3.97 -2.952 0.1 24
DS 3.97 -2.952 3.97 2.952 0.1 24
DS 3.97 2.952 -3.97 2.952 0.1 24
DS -3.97 2.952 -3.97 -2.952 0.1 24
DS -3.97 -1.852 -2.87 -2.952 0.1 24
DS 3.97 -2.952 -4.6 -2.952 0.2 21
DS -3.97 2.952 3.97 2.952 0.2 21
$PAD
Po -3.5 0
Sh "1" R 2.2 3.15 0 0 0
At SMD N 00888000
Ne 0 ""
$EndPAD
$PAD
Po 3.5 0
Sh "2" R 2.2 3.15 0 0 0
At SMD N 00888000
Ne 0 ""
$EndPAD
$EndMODULE DIOM7959X262N
$EndLIBRARY
