v 20130925 2
C 40000 40000 0 0 0 title-B.sym
C 42700 46500 1 0 0 spice-model-1.sym
{
T 42800 47200 5 10 0 1 0 0 1
device=model
T 42800 47100 5 10 1 1 0 0 1
refdes=A1
T 44000 46800 5 10 1 1 0 0 1
model-name=BSS138
T 43200 46600 5 10 1 1 0 0 1
file=BSS138.lib
}
C 52600 47600 1 0 0 vdc-ng.sym
{
T 53300 48450 5 10 0 0 0 0 1
device=VOLTAGE_SOURCE
T 53300 48650 5 10 0 0 0 0 1
footprint=none
T 53300 48250 5 10 1 1 0 0 1
refdes=Vtemp
T 53300 48050 5 10 1 1 0 0 1
value=DC 25V
}
C 52800 47100 1 0 0 gnd-1.sym
N 52900 47400 52900 47600 4
C 53200 48900 1 0 0 ng-resistor-1.sym
{
T 53500 49300 5 10 0 0 0 0 1
device=RESISTOR
T 53400 49300 5 10 1 1 0 0 1
refdes=Rtemp
T 53695 48900 5 10 1 1 0 0 1
value=100k
}
C 54200 48700 1 0 0 gnd-1.sym
N 52900 48800 52900 49700 4
N 52900 49200 53200 49200 4
N 54100 49200 54300 49200 4
N 54300 49200 54300 49000 4
C 53100 49600 1 0 0 output-ng.sym
{
T 53200 49900 5 10 0 0 0 0 1
device=OUTPUT
T 53295 49900 5 10 1 1 0 0 1
net=temp:1
}
N 53100 49700 52900 49700 4
T 54000 47800 9 7 1 0 0 0 5
La fuente Temp
es agregada para la simulación del mosfet
canal P el cual requiere ese parámetro
para su simulacion.
25V es equivalente a 25ºC
C 46600 45100 1 90 0 ng-resistor-1.sym
{
T 46200 45400 5 10 0 0 90 0 1
device=RESISTOR
T 46200 45300 5 10 1 1 90 0 1
refdes=Rsp
T 46600 45595 5 10 1 1 90 0 1
value=6
}
C 48200 44100 1 0 0 vdc-ng.sym
{
T 48900 44750 5 10 1 1 0 0 1
refdes=V1
T 48900 44950 5 10 0 0 0 0 1
device=VOLTAGE_SOURCE
T 48900 45150 5 10 0 0 0 0 1
footprint=none
T 48900 44550 5 10 1 1 0 0 1
value=DC 5V
}
C 43900 43800 1 0 0 ng-resistor-1.sym
{
T 44200 44200 5 10 0 0 0 0 1
device=RESISTOR
T 44100 44200 5 10 1 1 0 0 1
refdes=R2
T 44395 43800 5 10 1 1 0 0 1
value=100k
}
N 46300 45100 46300 44600 4
N 45700 44100 44800 44100 4
N 41400 44100 43900 44100 4
C 46200 41400 1 0 0 gnd-1.sym
N 41400 41900 48500 41900 4
N 48500 41900 48500 44100 4
N 46300 41700 46300 41900 4
N 45600 47300 48500 47300 4
N 48500 47300 48500 45300 4
C 47200 47500 1 0 0 vcc-1.sym
N 47400 47500 47400 47300 4
T 46600 46200 9 10 1 0 0 0 1
sp = speaker
C 46500 44800 1 0 0 output-ng.sym
{
T 46600 45100 5 10 0 0 0 0 1
device=OUTPUT
T 46695 45100 5 10 1 1 0 0 1
net=out:1
}
N 46500 44900 46300 44900 4
C 45700 43600 1 0 0 nmos-diode1-ng.sym
{
T 46600 44100 5 10 0 0 0 0 1
device=subcir_mosfet
T 47100 44000 5 10 1 1 0 0 1
refdes=X1
T 47095 43795 5 10 1 1 0 0 1
model-name=BSS138
}
C 46900 43200 1 0 0 output-ng.sym
{
T 47000 43500 5 10 0 0 0 0 1
device=OUTPUT
T 47095 43500 5 10 1 1 0 0 1
net=temp:1
}
N 46800 43600 46800 43300 4
N 46800 43300 46900 43300 4
C 46500 46200 1 90 0 ng-inductor-1.sym
{
T 46000 46400 5 10 0 0 90 0 1
device=INDUCTOR
T 46100 46300 5 10 1 1 90 0 1
refdes=Lsp
T 45800 46400 5 10 0 0 90 0 1
symversion=0.1
T 46505 46695 5 10 1 1 90 0 1
value=2m
}
N 46300 47300 46300 47100 4
N 46300 46200 46300 46000 4
C 46000 42100 1 0 0 ammeter-ng.sym
{
T 46700 42750 5 10 1 1 0 0 1
refdes=VAmp1
T 46700 42950 5 10 0 0 0 0 1
device=VOLTAGE_SOURCE
T 46700 43150 5 10 0 0 0 0 1
footprint=none
T 46700 42550 5 10 0 2 0 0 1
value=DC 0V
}
N 46300 43600 46300 43300 4
N 46300 42100 46300 41900 4
C 45600 42500 1 90 0 ng-resistor-1.sym
{
T 45200 42800 5 10 0 0 90 0 1
device=RESISTOR
T 45200 42700 5 10 1 1 90 0 1
refdes=R1
T 45600 42995 5 10 1 1 90 0 1
value=200k
}
N 45300 42500 45300 41900 4
N 45300 43400 45300 44100 4
C 41100 42400 1 0 0 vpulse-ng.sym
{
T 41800 42750 5 10 1 1 0 0 1
refdes=Vpulse
T 41800 43250 5 10 0 0 0 0 1
device=vpulse
T 41800 43450 5 10 0 0 0 0 1
footprint=none
T 41800 42550 5 10 1 1 0 0 1
value=dc 0 pulse 0 3.3 0 1n 1n 500u 1m
}
N 41400 43600 41400 44100 4
N 41400 42400 41400 41900 4
T 46600 46400 9 10 1 0 0 0 1
sp 8 Ohms
C 45400 44300 1 90 0 output-ng.sym
{
T 45100 44400 5 10 0 0 90 0 1
device=OUTPUT
T 45100 44495 5 10 1 1 90 0 1
net=gate:1
}
N 45300 44300 45300 44100 4
C 45800 45600 1 90 0 diode-ng.sym
{
T 45200 46000 5 10 0 0 90 0 1
device=DIODE
T 45100 45900 5 10 1 1 90 0 1
refdes=D1
T 45300 45895 5 10 1 1 90 0 1
model-name=model_name
}
N 45600 45600 45600 44900 4
N 45600 44900 46300 44900 4
N 45600 46500 45600 47300 4
