%!PS-Adobe-3.0 EPSF-3.0
%%Creator: nutmeg
%%BoundingBox: 54 54 612 612
/Re-encode { % inFont outFont encoding | -
   /MyEncoding exch def
      exch findfont
      dup length dict
      begin
         {def} forall
         /Encoding MyEncoding def
         currentdict
      end
      definefont
} def
/Helvetica /HelveticaLatin1 ISOLatin1Encoding Re-encode
1 1 scale
1.000 1.000 1.000 setrgbcolor
newpath
54 54 moveto 612 54 lineto
612 612 lineto 54 612 lineto
closepath fill
/HelveticaLatin1 findfont 10 scalefont setfont

0.000 0.000 0.000 setrgbcolor
0.502 0.502 0.502 setrgbcolor
0.000 0.000 0.000 setrgbcolor
0.000 0.000 0.000 setrgbcolor
243 66 moveto
0 rotate
(v-sweep) show
-0 rotate
0.000 0.000 0.000 setrgbcolor
0.502 0.502 0.502 setrgbcolor
0.000 0.000 0.000 setrgbcolor
0.000 0.000 0.000 setrgbcolor
54 596 moveto
0 rotate
(dc1: * gnetlist -o mosfet_channel_p.cir -g spice-sdb mosfet_channel_p.sch) show
-0 rotate
0.000 0.000 0.000 setrgbcolor
0.502 0.502 0.502 setrgbcolor
0.000 0.000 0.000 setrgbcolor
newpath
84 104 moveto
84 548 lineto
stroke
0.502 0.502 0.502 setrgbcolor
0.000 0.000 0.000 setrgbcolor
0.000 0.000 0.000 setrgbcolor
75 87 moveto
0 rotate
(0.0) show
-0 rotate
0.000 0.000 0.000 setrgbcolor
0.502 0.502 0.502 setrgbcolor
newpath
132 104 moveto
132 548 lineto
stroke
0.000 0.000 0.000 setrgbcolor
0.000 0.000 0.000 setrgbcolor
123 87 moveto
0 rotate
(2.0) show
-0 rotate
0.000 0.000 0.000 setrgbcolor
0.502 0.502 0.502 setrgbcolor
newpath
180 104 moveto
180 548 lineto
stroke
0.000 0.000 0.000 setrgbcolor
0.000 0.000 0.000 setrgbcolor
171 87 moveto
0 rotate
(4.0) show
-0 rotate
0.000 0.000 0.000 setrgbcolor
0.502 0.502 0.502 setrgbcolor
newpath
228 104 moveto
228 548 lineto
stroke
0.000 0.000 0.000 setrgbcolor
0.000 0.000 0.000 setrgbcolor
219 87 moveto
0 rotate
(6.0) show
-0 rotate
0.000 0.000 0.000 setrgbcolor
0.502 0.502 0.502 setrgbcolor
newpath
276 104 moveto
276 548 lineto
stroke
0.000 0.000 0.000 setrgbcolor
0.000 0.000 0.000 setrgbcolor
267 87 moveto
0 rotate
(8.0) show
-0 rotate
0.000 0.000 0.000 setrgbcolor
0.502 0.502 0.502 setrgbcolor
newpath
324 104 moveto
324 548 lineto
stroke
0.000 0.000 0.000 setrgbcolor
0.000 0.000 0.000 setrgbcolor
312 87 moveto
0 rotate
(10.0) show
-0 rotate
0.000 0.000 0.000 setrgbcolor
0.502 0.502 0.502 setrgbcolor
newpath
372 104 moveto
372 548 lineto
stroke
0.000 0.000 0.000 setrgbcolor
0.000 0.000 0.000 setrgbcolor
360 87 moveto
0 rotate
(12.0) show
-0 rotate
0.000 0.000 0.000 setrgbcolor
0.502 0.502 0.502 setrgbcolor
newpath
420 104 moveto
420 548 lineto
stroke
0.000 0.000 0.000 setrgbcolor
0.000 0.000 0.000 setrgbcolor
408 87 moveto
0 rotate
(14.0) show
-0 rotate
0.000 0.000 0.000 setrgbcolor
0.502 0.502 0.502 setrgbcolor
newpath
468 104 moveto
468 548 lineto
stroke
0.000 0.000 0.000 setrgbcolor
0.000 0.000 0.000 setrgbcolor
456 87 moveto
0 rotate
(16.0) show
-0 rotate
0.000 0.000 0.000 setrgbcolor
0.502 0.502 0.502 setrgbcolor
newpath
516 104 moveto
516 548 lineto
stroke
0.000 0.000 0.000 setrgbcolor
0.000 0.000 0.000 setrgbcolor
504 87 moveto
0 rotate
(18.0) show
-0 rotate
0.000 0.000 0.000 setrgbcolor
0.502 0.502 0.502 setrgbcolor
newpath
564 104 moveto
564 548 lineto
stroke
0.000 0.000 0.000 setrgbcolor
0.000 0.000 0.000 setrgbcolor
552 87 moveto
0 rotate
(20.0) show
-0 rotate
0.000 0.000 0.000 setrgbcolor
0.502 0.502 0.502 setrgbcolor
0.000 0.000 0.000 setrgbcolor
0.000 0.000 0.000 setrgbcolor
382 66 moveto
0 rotate
(V) show
-0 rotate
0.000 0.000 0.000 setrgbcolor
0.502 0.502 0.502 setrgbcolor
0.000 0.000 0.000 setrgbcolor
newpath
84 104 moveto
564 104 lineto
stroke
0.502 0.502 0.502 setrgbcolor
0.000 0.000 0.000 setrgbcolor
0.000 0.000 0.000 setrgbcolor
60 101 moveto
0 rotate
(-0.0) show
-0 rotate
0.000 0.000 0.000 setrgbcolor
0.502 0.502 0.502 setrgbcolor
newpath
84 215 moveto
564 215 lineto
stroke
0.000 0.000 0.000 setrgbcolor
0.000 0.000 0.000 setrgbcolor
66 212 moveto
0 rotate
(5.0) show
-0 rotate
0.000 0.000 0.000 setrgbcolor
0.502 0.502 0.502 setrgbcolor
newpath
84 326 moveto
564 326 lineto
stroke
0.000 0.000 0.000 setrgbcolor
0.000 0.000 0.000 setrgbcolor
60 323 moveto
0 rotate
(10.0) show
-0 rotate
0.000 0.000 0.000 setrgbcolor
0.502 0.502 0.502 setrgbcolor
newpath
84 437 moveto
564 437 lineto
stroke
0.000 0.000 0.000 setrgbcolor
0.000 0.000 0.000 setrgbcolor
60 434 moveto
0 rotate
(15.0) show
-0 rotate
0.000 0.000 0.000 setrgbcolor
0.502 0.502 0.502 setrgbcolor
newpath
84 548 moveto
564 548 lineto
stroke
0.000 0.000 0.000 setrgbcolor
0.000 0.000 0.000 setrgbcolor
60 545 moveto
0 rotate
(20.0) show
-0 rotate
0.000 0.000 0.000 setrgbcolor
0.502 0.502 0.502 setrgbcolor
0.000 0.000 0.000 setrgbcolor
0.000 0.000 0.000 setrgbcolor
54 582 moveto
0 rotate
(V) show
-0 rotate
0.000 0.000 0.000 setrgbcolor
0.502 0.502 0.502 setrgbcolor
1.000 0.000 0.000 setrgbcolor
newpath
288 586 moveto
312 586 lineto
stroke
0.000 0.000 0.000 setrgbcolor
0.000 0.000 0.000 setrgbcolor
318 582 moveto
0 rotate
(v(out)) show
-0 rotate
0.000 0.000 0.000 setrgbcolor
1.000 0.000 0.000 setrgbcolor
newpath
84 104 moveto
86 104 lineto
89 104 lineto
91 104 lineto
94 104 lineto
96 104 lineto
98 104 lineto
101 104 lineto
103 104 lineto
106 104 lineto
108 104 lineto
110 104 lineto
113 104 lineto
115 104 lineto
118 104 lineto
120 104 lineto
122 104 lineto
125 104 lineto
127 104 lineto
130 104 lineto
132 104 lineto
134 104 lineto
137 104 lineto
139 104 lineto
142 104 lineto
144 104 lineto
146 104 lineto
149 104 lineto
151 104 lineto
154 104 lineto
156 104 lineto
158 104 lineto
161 104 lineto
163 104 lineto
166 104 lineto
168 104 lineto
170 104 lineto
173 104 lineto
175 104 lineto
178 104 lineto
180 105 lineto
182 109 lineto
185 113 lineto
187 120 lineto
190 128 lineto
192 137 lineto
194 148 lineto
197 159 lineto
199 171 lineto
202 184 lineto
204 195 lineto
206 200 lineto
209 204 lineto
211 207 lineto
214 210 lineto
216 213 lineto
218 216 lineto
221 219 lineto
223 222 lineto
226 224 lineto
228 227 lineto
230 229 lineto
233 232 lineto
235 234 lineto
238 236 lineto
240 239 lineto
242 241 lineto
245 244 lineto
247 246 lineto
250 248 lineto
252 251 lineto
254 253 lineto
257 255 lineto
259 258 lineto
262 260 lineto
264 262 lineto
266 264 lineto
269 267 lineto
271 269 lineto
274 271 lineto
276 274 lineto
278 276 lineto
281 278 lineto
283 280 lineto
286 283 lineto
288 285 lineto
290 287 lineto
293 289 lineto
295 292 lineto
298 294 lineto
300 296 lineto
302 298 lineto
305 301 lineto
307 303 lineto
310 305 lineto
312 307 lineto
314 310 lineto
317 312 lineto
319 314 lineto
322 316 lineto
324 318 lineto
326 321 lineto
329 323 lineto
331 325 lineto
334 327 lineto
336 330 lineto
338 332 lineto
341 334 lineto
343 336 lineto
346 338 lineto
348 341 lineto
350 343 lineto
353 345 lineto
355 347 lineto
358 350 lineto
360 352 lineto
362 354 lineto
365 356 lineto
367 358 lineto
370 361 lineto
372 363 lineto
374 365 lineto
377 367 lineto
379 369 lineto
382 372 lineto
384 374 lineto
386 376 lineto
389 378 lineto
391 381 lineto
394 383 lineto
396 385 lineto
398 387 lineto
401 389 lineto
403 392 lineto
406 394 lineto
408 396 lineto
410 398 lineto
413 400 lineto
415 403 lineto
418 405 lineto
420 407 lineto
422 409 lineto
425 411 lineto
427 414 lineto
430 416 lineto
432 418 lineto
434 420 lineto
437 422 lineto
439 425 lineto
442 427 lineto
444 429 lineto
446 431 lineto
449 433 lineto
451 436 lineto
454 438 lineto
456 440 lineto
458 442 lineto
461 444 lineto
463 447 lineto
466 449 lineto
468 451 lineto
470 453 lineto
473 455 lineto
475 458 lineto
478 460 lineto
480 462 lineto
482 464 lineto
485 466 lineto
487 469 lineto
490 471 lineto
492 473 lineto
494 475 lineto
497 477 lineto
499 480 lineto
502 482 lineto
504 484 lineto
506 486 lineto
509 488 lineto
511 491 lineto
514 493 lineto
516 495 lineto
518 497 lineto
521 499 lineto
523 502 lineto
526 504 lineto
528 506 lineto
530 508 lineto
533 510 lineto
535 513 lineto
538 515 lineto
540 517 lineto
542 519 lineto
545 521 lineto
547 524 lineto
550 526 lineto
552 528 lineto
554 530 lineto
557 532 lineto
559 535 lineto
562 537 lineto
564 539 lineto
stroke
showpage
%%EOF
