(kicad_sch (version 20211123) (generator eeschema)

  (uuid e63e39d7-6ac0-4ffd-8aa3-1841a4541b55)

  (paper "A4")

  (lib_symbols
    (symbol "Connector:Conn_01x03_Male" (pin_names (offset 1.016) hide) (in_bom yes) (on_board yes)
      (property "Reference" "J" (id 0) (at 0 5.08 0)
        (effects (font (size 1.27 1.27)))
      )
      (property "Value" "Conn_01x03_Male" (id 1) (at 0 -5.08 0)
        (effects (font (size 1.27 1.27)))
      )
      (property "Footprint" "" (id 2) (at 0 0 0)
        (effects (font (size 1.27 1.27)) hide)
      )
      (property "Datasheet" "~" (id 3) (at 0 0 0)
        (effects (font (size 1.27 1.27)) hide)
      )
      (property "ki_keywords" "connector" (id 4) (at 0 0 0)
        (effects (font (size 1.27 1.27)) hide)
      )
      (property "ki_description" "Generic connector, single row, 01x03, script generated (kicad-library-utils/schlib/autogen/connector/)" (id 5) (at 0 0 0)
        (effects (font (size 1.27 1.27)) hide)
      )
      (property "ki_fp_filters" "Connector*:*_1x??_*" (id 6) (at 0 0 0)
        (effects (font (size 1.27 1.27)) hide)
      )
      (symbol "Conn_01x03_Male_1_1"
        (polyline
          (pts
            (xy 1.27 -2.54)
            (xy 0.8636 -2.54)
          )
          (stroke (width 0.1524) (type default) (color 0 0 0 0))
          (fill (type none))
        )
        (polyline
          (pts
            (xy 1.27 0)
            (xy 0.8636 0)
          )
          (stroke (width 0.1524) (type default) (color 0 0 0 0))
          (fill (type none))
        )
        (polyline
          (pts
            (xy 1.27 2.54)
            (xy 0.8636 2.54)
          )
          (stroke (width 0.1524) (type default) (color 0 0 0 0))
          (fill (type none))
        )
        (rectangle (start 0.8636 -2.413) (end 0 -2.667)
          (stroke (width 0.1524) (type default) (color 0 0 0 0))
          (fill (type outline))
        )
        (rectangle (start 0.8636 0.127) (end 0 -0.127)
          (stroke (width 0.1524) (type default) (color 0 0 0 0))
          (fill (type outline))
        )
        (rectangle (start 0.8636 2.667) (end 0 2.413)
          (stroke (width 0.1524) (type default) (color 0 0 0 0))
          (fill (type outline))
        )
        (pin passive line (at 5.08 2.54 180) (length 3.81)
          (name "Pin_1" (effects (font (size 1.27 1.27))))
          (number "1" (effects (font (size 1.27 1.27))))
        )
        (pin passive line (at 5.08 0 180) (length 3.81)
          (name "Pin_2" (effects (font (size 1.27 1.27))))
          (number "2" (effects (font (size 1.27 1.27))))
        )
        (pin passive line (at 5.08 -2.54 180) (length 3.81)
          (name "Pin_3" (effects (font (size 1.27 1.27))))
          (number "3" (effects (font (size 1.27 1.27))))
        )
      )
    )
    (symbol "Device:C" (pin_numbers hide) (pin_names (offset 0.254)) (in_bom yes) (on_board yes)
      (property "Reference" "C" (id 0) (at 0.635 2.54 0)
        (effects (font (size 1.27 1.27)) (justify left))
      )
      (property "Value" "C" (id 1) (at 0.635 -2.54 0)
        (effects (font (size 1.27 1.27)) (justify left))
      )
      (property "Footprint" "" (id 2) (at 0.9652 -3.81 0)
        (effects (font (size 1.27 1.27)) hide)
      )
      (property "Datasheet" "~" (id 3) (at 0 0 0)
        (effects (font (size 1.27 1.27)) hide)
      )
      (property "ki_keywords" "cap capacitor" (id 4) (at 0 0 0)
        (effects (font (size 1.27 1.27)) hide)
      )
      (property "ki_description" "Unpolarized capacitor" (id 5) (at 0 0 0)
        (effects (font (size 1.27 1.27)) hide)
      )
      (property "ki_fp_filters" "C_*" (id 6) (at 0 0 0)
        (effects (font (size 1.27 1.27)) hide)
      )
      (symbol "C_0_1"
        (polyline
          (pts
            (xy -2.032 -0.762)
            (xy 2.032 -0.762)
          )
          (stroke (width 0.508) (type default) (color 0 0 0 0))
          (fill (type none))
        )
        (polyline
          (pts
            (xy -2.032 0.762)
            (xy 2.032 0.762)
          )
          (stroke (width 0.508) (type default) (color 0 0 0 0))
          (fill (type none))
        )
      )
      (symbol "C_1_1"
        (pin passive line (at 0 3.81 270) (length 2.794)
          (name "~" (effects (font (size 1.27 1.27))))
          (number "1" (effects (font (size 1.27 1.27))))
        )
        (pin passive line (at 0 -3.81 90) (length 2.794)
          (name "~" (effects (font (size 1.27 1.27))))
          (number "2" (effects (font (size 1.27 1.27))))
        )
      )
    )
    (symbol "Device:R" (pin_numbers hide) (pin_names (offset 0)) (in_bom yes) (on_board yes)
      (property "Reference" "R" (id 0) (at 2.032 0 90)
        (effects (font (size 1.27 1.27)))
      )
      (property "Value" "R" (id 1) (at 0 0 90)
        (effects (font (size 1.27 1.27)))
      )
      (property "Footprint" "" (id 2) (at -1.778 0 90)
        (effects (font (size 1.27 1.27)) hide)
      )
      (property "Datasheet" "~" (id 3) (at 0 0 0)
        (effects (font (size 1.27 1.27)) hide)
      )
      (property "ki_keywords" "R res resistor" (id 4) (at 0 0 0)
        (effects (font (size 1.27 1.27)) hide)
      )
      (property "ki_description" "Resistor" (id 5) (at 0 0 0)
        (effects (font (size 1.27 1.27)) hide)
      )
      (property "ki_fp_filters" "R_*" (id 6) (at 0 0 0)
        (effects (font (size 1.27 1.27)) hide)
      )
      (symbol "R_0_1"
        (rectangle (start -1.016 -2.54) (end 1.016 2.54)
          (stroke (width 0.254) (type default) (color 0 0 0 0))
          (fill (type none))
        )
      )
      (symbol "R_1_1"
        (pin passive line (at 0 3.81 270) (length 1.27)
          (name "~" (effects (font (size 1.27 1.27))))
          (number "1" (effects (font (size 1.27 1.27))))
        )
        (pin passive line (at 0 -3.81 90) (length 1.27)
          (name "~" (effects (font (size 1.27 1.27))))
          (number "2" (effects (font (size 1.27 1.27))))
        )
      )
    )
    (symbol "Switch:SW_Push" (pin_numbers hide) (pin_names (offset 1.016) hide) (in_bom yes) (on_board yes)
      (property "Reference" "SW" (id 0) (at 1.27 2.54 0)
        (effects (font (size 1.27 1.27)) (justify left))
      )
      (property "Value" "SW_Push" (id 1) (at 0 -1.524 0)
        (effects (font (size 1.27 1.27)))
      )
      (property "Footprint" "" (id 2) (at 0 5.08 0)
        (effects (font (size 1.27 1.27)) hide)
      )
      (property "Datasheet" "~" (id 3) (at 0 5.08 0)
        (effects (font (size 1.27 1.27)) hide)
      )
      (property "ki_keywords" "switch normally-open pushbutton push-button" (id 4) (at 0 0 0)
        (effects (font (size 1.27 1.27)) hide)
      )
      (property "ki_description" "Push button switch, generic, two pins" (id 5) (at 0 0 0)
        (effects (font (size 1.27 1.27)) hide)
      )
      (symbol "SW_Push_0_1"
        (circle (center -2.032 0) (radius 0.508)
          (stroke (width 0) (type default) (color 0 0 0 0))
          (fill (type none))
        )
        (polyline
          (pts
            (xy 0 1.27)
            (xy 0 3.048)
          )
          (stroke (width 0) (type default) (color 0 0 0 0))
          (fill (type none))
        )
        (polyline
          (pts
            (xy 2.54 1.27)
            (xy -2.54 1.27)
          )
          (stroke (width 0) (type default) (color 0 0 0 0))
          (fill (type none))
        )
        (circle (center 2.032 0) (radius 0.508)
          (stroke (width 0) (type default) (color 0 0 0 0))
          (fill (type none))
        )
        (pin passive line (at -5.08 0 0) (length 2.54)
          (name "1" (effects (font (size 1.27 1.27))))
          (number "1" (effects (font (size 1.27 1.27))))
        )
        (pin passive line (at 5.08 0 180) (length 2.54)
          (name "2" (effects (font (size 1.27 1.27))))
          (number "2" (effects (font (size 1.27 1.27))))
        )
      )
    )
    (symbol "esp8266:ESP-12F" (pin_names (offset 1.016)) (in_bom yes) (on_board yes)
      (property "Reference" "U" (id 0) (at 0 -2.54 0)
        (effects (font (size 1.27 1.27)))
      )
      (property "Value" "ESP-12F" (id 1) (at 0 2.54 0)
        (effects (font (size 1.27 1.27)))
      )
      (property "Footprint" "" (id 2) (at 0 0 0)
        (effects (font (size 1.27 1.27)) hide)
      )
      (property "Datasheet" "http://l0l.org.uk/2014/12/esp8266-modules-hardware-guide-gotta-catch-em-all/" (id 3) (at 0 0 0)
        (effects (font (size 1.27 1.27)) hide)
      )
      (property "ki_keywords" "MODULE ESP8266 ESP-8266" (id 4) (at 0 0 0)
        (effects (font (size 1.27 1.27)) hide)
      )
      (property "ki_description" "ESP8266 ESP-12E module, 22 pins, 2mm, PCB antenna" (id 5) (at 0 0 0)
        (effects (font (size 1.27 1.27)) hide)
      )
      (property "ki_fp_filters" "ESP-12E ESP-12E_SMD" (id 6) (at 0 0 0)
        (effects (font (size 1.27 1.27)) hide)
      )
      (symbol "ESP-12F_1_0"
        (rectangle (start -15.24 -15.24) (end 15.24 15.24)
          (stroke (width 0) (type default) (color 0 0 0 0))
          (fill (type none))
        )
      )
      (symbol "ESP-12F_1_1"
        (pin input line (at -22.86 7.62 0) (length 7.62)
          (name "REST" (effects (font (size 1.27 1.27))))
          (number "1" (effects (font (size 1.27 1.27))))
        )
        (pin bidirectional line (at 22.86 -7.62 180) (length 7.62)
          (name "GPIO15" (effects (font (size 1.27 1.27))))
          (number "10" (effects (font (size 1.27 1.27))))
        )
        (pin bidirectional line (at 22.86 -5.08 180) (length 7.62)
          (name "GPIO2" (effects (font (size 1.27 1.27))))
          (number "11" (effects (font (size 1.27 1.27))))
        )
        (pin bidirectional line (at 22.86 -2.54 180) (length 7.62)
          (name "GPIO0" (effects (font (size 1.27 1.27))))
          (number "12" (effects (font (size 1.27 1.27))))
        )
        (pin bidirectional line (at 22.86 0 180) (length 7.62)
          (name "GPIO4" (effects (font (size 1.27 1.27))))
          (number "13" (effects (font (size 1.27 1.27))))
        )
        (pin bidirectional line (at 22.86 2.54 180) (length 7.62)
          (name "GPIO5" (effects (font (size 1.27 1.27))))
          (number "14" (effects (font (size 1.27 1.27))))
        )
        (pin input line (at 22.86 5.08 180) (length 7.62)
          (name "RXD" (effects (font (size 1.27 1.27))))
          (number "15" (effects (font (size 1.27 1.27))))
        )
        (pin output line (at 22.86 7.62 180) (length 7.62)
          (name "TXD" (effects (font (size 1.27 1.27))))
          (number "16" (effects (font (size 1.27 1.27))))
        )
        (pin bidirectional line (at -6.35 -22.86 90) (length 7.62)
          (name "CS0" (effects (font (size 1.27 1.27))))
          (number "17" (effects (font (size 1.27 1.27))))
        )
        (pin bidirectional line (at -3.81 -22.86 90) (length 7.62)
          (name "MISO" (effects (font (size 1.27 1.27))))
          (number "18" (effects (font (size 1.27 1.27))))
        )
        (pin bidirectional line (at -1.27 -22.86 90) (length 7.62)
          (name "GPIO9" (effects (font (size 1.27 1.27))))
          (number "19" (effects (font (size 1.27 1.27))))
        )
        (pin passive line (at -22.86 5.08 0) (length 7.62)
          (name "ADC" (effects (font (size 1.27 1.27))))
          (number "2" (effects (font (size 1.27 1.27))))
        )
        (pin bidirectional line (at 1.27 -22.86 90) (length 7.62)
          (name "GPIO10" (effects (font (size 1.27 1.27))))
          (number "20" (effects (font (size 1.27 1.27))))
        )
        (pin bidirectional line (at 3.81 -22.86 90) (length 7.62)
          (name "MOSI" (effects (font (size 1.27 1.27))))
          (number "21" (effects (font (size 1.27 1.27))))
        )
        (pin bidirectional line (at 6.35 -22.86 90) (length 7.62)
          (name "SCLK" (effects (font (size 1.27 1.27))))
          (number "22" (effects (font (size 1.27 1.27))))
        )
        (pin input line (at -22.86 2.54 0) (length 7.62)
          (name "CH_PD" (effects (font (size 1.27 1.27))))
          (number "3" (effects (font (size 1.27 1.27))))
        )
        (pin bidirectional line (at -22.86 0 0) (length 7.62)
          (name "GPIO16" (effects (font (size 1.27 1.27))))
          (number "4" (effects (font (size 1.27 1.27))))
        )
        (pin bidirectional line (at -22.86 -2.54 0) (length 7.62)
          (name "GPIO14" (effects (font (size 1.27 1.27))))
          (number "5" (effects (font (size 1.27 1.27))))
        )
        (pin bidirectional line (at -22.86 -5.08 0) (length 7.62)
          (name "GPIO12" (effects (font (size 1.27 1.27))))
          (number "6" (effects (font (size 1.27 1.27))))
        )
        (pin bidirectional line (at -22.86 -7.62 0) (length 7.62)
          (name "GPIO13" (effects (font (size 1.27 1.27))))
          (number "7" (effects (font (size 1.27 1.27))))
        )
        (pin power_in line (at -22.86 -10.16 0) (length 7.62)
          (name "VCC" (effects (font (size 1.27 1.27))))
          (number "8" (effects (font (size 1.27 1.27))))
        )
        (pin power_in line (at 22.86 -10.16 180) (length 7.62)
          (name "GND" (effects (font (size 1.27 1.27))))
          (number "9" (effects (font (size 1.27 1.27))))
        )
      )
    )
    (symbol "power:+3.3V" (power) (pin_names (offset 0)) (in_bom yes) (on_board yes)
      (property "Reference" "#PWR" (id 0) (at 0 -3.81 0)
        (effects (font (size 1.27 1.27)) hide)
      )
      (property "Value" "+3.3V" (id 1) (at 0 3.556 0)
        (effects (font (size 1.27 1.27)))
      )
      (property "Footprint" "" (id 2) (at 0 0 0)
        (effects (font (size 1.27 1.27)) hide)
      )
      (property "Datasheet" "" (id 3) (at 0 0 0)
        (effects (font (size 1.27 1.27)) hide)
      )
      (property "ki_keywords" "power-flag" (id 4) (at 0 0 0)
        (effects (font (size 1.27 1.27)) hide)
      )
      (property "ki_description" "Power symbol creates a global label with name \"+3.3V\"" (id 5) (at 0 0 0)
        (effects (font (size 1.27 1.27)) hide)
      )
      (symbol "+3.3V_0_1"
        (polyline
          (pts
            (xy -0.762 1.27)
            (xy 0 2.54)
          )
          (stroke (width 0) (type default) (color 0 0 0 0))
          (fill (type none))
        )
        (polyline
          (pts
            (xy 0 0)
            (xy 0 2.54)
          )
          (stroke (width 0) (type default) (color 0 0 0 0))
          (fill (type none))
        )
        (polyline
          (pts
            (xy 0 2.54)
            (xy 0.762 1.27)
          )
          (stroke (width 0) (type default) (color 0 0 0 0))
          (fill (type none))
        )
      )
      (symbol "+3.3V_1_1"
        (pin power_in line (at 0 0 90) (length 0) hide
          (name "+3V3" (effects (font (size 1.27 1.27))))
          (number "1" (effects (font (size 1.27 1.27))))
        )
      )
    )
    (symbol "power:GND" (power) (pin_names (offset 0)) (in_bom yes) (on_board yes)
      (property "Reference" "#PWR" (id 0) (at 0 -6.35 0)
        (effects (font (size 1.27 1.27)) hide)
      )
      (property "Value" "GND" (id 1) (at 0 -3.81 0)
        (effects (font (size 1.27 1.27)))
      )
      (property "Footprint" "" (id 2) (at 0 0 0)
        (effects (font (size 1.27 1.27)) hide)
      )
      (property "Datasheet" "" (id 3) (at 0 0 0)
        (effects (font (size 1.27 1.27)) hide)
      )
      (property "ki_keywords" "power-flag" (id 4) (at 0 0 0)
        (effects (font (size 1.27 1.27)) hide)
      )
      (property "ki_description" "Power symbol creates a global label with name \"GND\" , ground" (id 5) (at 0 0 0)
        (effects (font (size 1.27 1.27)) hide)
      )
      (symbol "GND_0_1"
        (polyline
          (pts
            (xy 0 0)
            (xy 0 -1.27)
            (xy 1.27 -1.27)
            (xy 0 -2.54)
            (xy -1.27 -1.27)
            (xy 0 -1.27)
          )
          (stroke (width 0) (type default) (color 0 0 0 0))
          (fill (type none))
        )
      )
      (symbol "GND_1_1"
        (pin power_in line (at 0 0 270) (length 0) hide
          (name "GND" (effects (font (size 1.27 1.27))))
          (number "1" (effects (font (size 1.27 1.27))))
        )
      )
    )
  )

  (junction (at 39.37 68.58) (diameter 0) (color 0 0 0 0)
    (uuid 2b5884bf-9dd4-4db3-9e61-bf149dd028b2)
  )
  (junction (at 39.37 83.82) (diameter 0) (color 0 0 0 0)
    (uuid 3a903906-4258-4054-abde-38572d79c582)
  )
  (junction (at 71.12 68.58) (diameter 0) (color 0 0 0 0)
    (uuid 4db551a9-b63d-4e0b-bd69-86134ea10c12)
  )
  (junction (at 123.19 111.76) (diameter 0) (color 0 0 0 0)
    (uuid 89e0453e-b8fe-473d-9cfe-75e18d7244ff)
  )
  (junction (at 71.12 83.82) (diameter 0) (color 0 0 0 0)
    (uuid a2a01cc8-7839-4642-975e-45890353640d)
  )
  (junction (at 225.679 125.222) (diameter 0) (color 0 0 0 0)
    (uuid e965f896-82e8-4c13-a670-dd45c4d17b2e)
  )

  (no_connect (at 148.59 115.57) (uuid 9043485a-3c12-4dc5-98ca-a39951510b9e))
  (no_connect (at 146.05 115.57) (uuid 9043485a-3c12-4dc5-98ca-a39951510b9f))
  (no_connect (at 158.75 115.57) (uuid 9043485a-3c12-4dc5-98ca-a39951510ba0))
  (no_connect (at 156.21 115.57) (uuid 9043485a-3c12-4dc5-98ca-a39951510ba1))
  (no_connect (at 77.47 115.57) (uuid ee73eb43-54d7-4bfe-9494-e50b30000d83))

  (wire (pts (xy 129.54 95.25) (xy 127 95.25))
    (stroke (width 0) (type default) (color 0 0 0 0))
    (uuid 03c75c25-5097-43c2-b906-66bbc51b86bc)
  )
  (wire (pts (xy 243.84 76.2) (xy 246.38 76.2))
    (stroke (width 0) (type default) (color 0 0 0 0))
    (uuid 077b69ef-414c-45b5-a502-1dd668ad2a8a)
  )
  (wire (pts (xy 58.42 68.58) (xy 71.12 68.58))
    (stroke (width 0) (type default) (color 0 0 0 0))
    (uuid 079e3ca1-97bc-4be9-88b0-8c03fdc1ebb5)
  )
  (wire (pts (xy 243.84 97.79) (xy 246.38 97.79))
    (stroke (width 0) (type default) (color 0 0 0 0))
    (uuid 07a11ca3-5dbe-47ef-990b-d81ae73ed3ca)
  )
  (wire (pts (xy 243.84 107.95) (xy 246.38 107.95))
    (stroke (width 0) (type default) (color 0 0 0 0))
    (uuid 087c467f-6422-445e-a6d6-3211332048cf)
  )
  (wire (pts (xy 243.84 100.33) (xy 246.38 100.33))
    (stroke (width 0) (type default) (color 0 0 0 0))
    (uuid 0a8e63b9-adac-4267-a06e-86374ac36688)
  )
  (wire (pts (xy 123.19 111.76) (xy 127 111.76))
    (stroke (width 0) (type default) (color 0 0 0 0))
    (uuid 0b3d2749-0bae-4ef0-b92a-0db99a894b13)
  )
  (wire (pts (xy 182.88 100.33) (xy 175.26 100.33))
    (stroke (width 0) (type default) (color 0 0 0 0))
    (uuid 0b7632d7-bc14-450f-bc39-0fa8e895191e)
  )
  (wire (pts (xy 225.679 135.382) (xy 225.679 137.922))
    (stroke (width 0) (type default) (color 0 0 0 0))
    (uuid 0e3e9d08-1190-41f0-9b25-82f707883e2b)
  )
  (wire (pts (xy 243.84 102.87) (xy 246.38 102.87))
    (stroke (width 0) (type default) (color 0 0 0 0))
    (uuid 12c48f0d-2db6-4337-bccd-dedb7ced5d8e)
  )
  (wire (pts (xy 77.47 120.65) (xy 80.01 120.65))
    (stroke (width 0) (type default) (color 0 0 0 0))
    (uuid 14007e30-92ce-4a79-a2ec-0ab04800e0d4)
  )
  (wire (pts (xy 153.67 115.57) (xy 153.67 118.11))
    (stroke (width 0) (type default) (color 0 0 0 0))
    (uuid 1d73c85b-cb13-436e-9a54-ccd4c115ab5a)
  )
  (polyline (pts (xy 62.23 106.68) (xy 62.23 152.4))
    (stroke (width 0) (type default) (color 0 0 0 0))
    (uuid 1f58f975-b78c-4ba6-bb0d-740a8d036836)
  )

  (wire (pts (xy 243.84 86.36) (xy 246.38 86.36))
    (stroke (width 0) (type default) (color 0 0 0 0))
    (uuid 24654512-3124-40d0-a762-02249539b744)
  )
  (wire (pts (xy 127 102.87) (xy 129.54 102.87))
    (stroke (width 0) (type default) (color 0 0 0 0))
    (uuid 2551ba58-5838-47c5-832c-b2300c4f3733)
  )
  (wire (pts (xy 175.26 85.09) (xy 177.8 85.09))
    (stroke (width 0) (type default) (color 0 0 0 0))
    (uuid 25edd6b0-8339-4c8d-a9f7-a6f4c6188645)
  )
  (wire (pts (xy 71.12 83.82) (xy 71.12 86.36))
    (stroke (width 0) (type default) (color 0 0 0 0))
    (uuid 2ce4cb77-0267-4870-8608-770c920c3a45)
  )
  (wire (pts (xy 39.37 66.04) (xy 39.37 68.58))
    (stroke (width 0) (type default) (color 0 0 0 0))
    (uuid 3544e2f5-8987-48d2-8085-ac6b24548fb7)
  )
  (wire (pts (xy 107.95 86.36) (xy 107.95 90.17))
    (stroke (width 0) (type default) (color 0 0 0 0))
    (uuid 35793852-6d4e-4e90-8569-366ca7ada62f)
  )
  (polyline (pts (xy 95.25 152.4) (xy 95.25 106.68))
    (stroke (width 0) (type default) (color 0 0 0 0))
    (uuid 39404ac3-36f8-4562-aa7c-ade1497d3b76)
  )

  (wire (pts (xy 175.26 97.79) (xy 205.74 97.79))
    (stroke (width 0) (type default) (color 0 0 0 0))
    (uuid 39771eb6-eecd-4522-9ae4-bee98b7963c5)
  )
  (wire (pts (xy 182.88 102.87) (xy 182.88 100.33))
    (stroke (width 0) (type default) (color 0 0 0 0))
    (uuid 3b91f23a-81f9-4bf0-aaf1-bb7190fff9ad)
  )
  (wire (pts (xy 177.8 102.87) (xy 175.26 102.87))
    (stroke (width 0) (type default) (color 0 0 0 0))
    (uuid 3bd42fed-b5b5-44a0-b1e0-c13801c89768)
  )
  (wire (pts (xy 175.26 87.63) (xy 177.8 87.63))
    (stroke (width 0) (type default) (color 0 0 0 0))
    (uuid 40ce89e7-ac75-4cfc-b1fa-956df19c7869)
  )
  (wire (pts (xy 77.47 118.11) (xy 80.01 118.11))
    (stroke (width 0) (type default) (color 0 0 0 0))
    (uuid 421c974b-a489-49e0-91d0-e66eea46ad41)
  )
  (wire (pts (xy 129.54 97.79) (xy 127 97.79))
    (stroke (width 0) (type default) (color 0 0 0 0))
    (uuid 490956ac-5b7b-491a-b59d-b5c09892d334)
  )
  (wire (pts (xy 58.42 81.28) (xy 58.42 83.82))
    (stroke (width 0) (type default) (color 0 0 0 0))
    (uuid 49874204-bdef-4b4a-b506-cdb7726b250f)
  )
  (wire (pts (xy 58.42 83.82) (xy 71.12 83.82))
    (stroke (width 0) (type default) (color 0 0 0 0))
    (uuid 4e4d9e6f-7bd6-4d7e-b085-4584810e973a)
  )
  (wire (pts (xy 129.54 87.63) (xy 127 87.63))
    (stroke (width 0) (type default) (color 0 0 0 0))
    (uuid 50542bf1-0520-43b1-b7c9-757e8b39ac52)
  )
  (wire (pts (xy 205.74 93.98) (xy 205.74 97.79))
    (stroke (width 0) (type default) (color 0 0 0 0))
    (uuid 55c4d20b-3ceb-4540-b64a-3bf16177b21b)
  )
  (wire (pts (xy 71.12 68.58) (xy 73.66 68.58))
    (stroke (width 0) (type default) (color 0 0 0 0))
    (uuid 57a41b2b-0592-40a9-80e5-a85a5830afab)
  )
  (wire (pts (xy 175.26 90.17) (xy 177.8 90.17))
    (stroke (width 0) (type default) (color 0 0 0 0))
    (uuid 57a90be3-07fd-416a-a29e-07e92d4e8227)
  )
  (wire (pts (xy 123.19 121.92) (xy 123.19 124.46))
    (stroke (width 0) (type default) (color 0 0 0 0))
    (uuid 57aa309d-04fc-4cf9-acdd-ea94485ae678)
  )
  (wire (pts (xy 107.95 90.17) (xy 129.54 90.17))
    (stroke (width 0) (type default) (color 0 0 0 0))
    (uuid 59c6cfda-62c3-4cbf-a79a-d4b912e2e76d)
  )
  (wire (pts (xy 39.37 83.82) (xy 39.37 86.36))
    (stroke (width 0) (type default) (color 0 0 0 0))
    (uuid 5d495584-2b05-4b5e-9990-50c02b44d661)
  )
  (wire (pts (xy 243.84 105.41) (xy 246.38 105.41))
    (stroke (width 0) (type default) (color 0 0 0 0))
    (uuid 5f969597-0b92-43fe-967f-cf34b281952c)
  )
  (wire (pts (xy 243.84 113.03) (xy 246.38 113.03))
    (stroke (width 0) (type default) (color 0 0 0 0))
    (uuid 65a403c6-0c66-4c33-b5bc-159d0176a114)
  )
  (polyline (pts (xy 62.23 152.4) (xy 95.25 152.4))
    (stroke (width 0) (type default) (color 0 0 0 0))
    (uuid 667d9a30-8d9b-4c11-b52d-7b480714f8bf)
  )

  (wire (pts (xy 26.67 83.82) (xy 39.37 83.82))
    (stroke (width 0) (type default) (color 0 0 0 0))
    (uuid 66926aa4-fb55-4750-a306-4887a2733cef)
  )
  (wire (pts (xy 225.679 125.222) (xy 225.679 127.762))
    (stroke (width 0) (type default) (color 0 0 0 0))
    (uuid 682beb16-a663-42c0-b9a8-be7f074762a6)
  )
  (wire (pts (xy 243.84 78.74) (xy 246.38 78.74))
    (stroke (width 0) (type default) (color 0 0 0 0))
    (uuid 720af3fb-1e35-4538-8e1e-d9574c1fe9ca)
  )
  (wire (pts (xy 123.19 109.22) (xy 123.19 111.76))
    (stroke (width 0) (type default) (color 0 0 0 0))
    (uuid 7953b5be-3b01-4757-ba84-a4f71f712245)
  )
  (wire (pts (xy 225.679 88.9) (xy 225.679 115.062))
    (stroke (width 0) (type default) (color 0 0 0 0))
    (uuid 7bb7fb9a-beb0-44d9-a12c-404934af981e)
  )
  (wire (pts (xy 151.13 115.57) (xy 151.13 118.11))
    (stroke (width 0) (type default) (color 0 0 0 0))
    (uuid 7bd02006-54b8-4db7-9cc3-a669467b6b47)
  )
  (wire (pts (xy 129.54 92.71) (xy 127 92.71))
    (stroke (width 0) (type default) (color 0 0 0 0))
    (uuid 7ef5a55f-3d8a-409b-a290-61cff20a8bcb)
  )
  (wire (pts (xy 127 111.76) (xy 127 102.87))
    (stroke (width 0) (type default) (color 0 0 0 0))
    (uuid 7f77c9ee-a648-47fa-a046-b9f99907ed66)
  )
  (wire (pts (xy 58.42 71.12) (xy 58.42 68.58))
    (stroke (width 0) (type default) (color 0 0 0 0))
    (uuid 8601d29d-f386-4880-9ad5-43fb285d60b1)
  )
  (wire (pts (xy 71.12 78.74) (xy 71.12 83.82))
    (stroke (width 0) (type default) (color 0 0 0 0))
    (uuid 876272cc-1efa-4a6e-9eba-9b385c4beda0)
  )
  (polyline (pts (xy 62.23 106.68) (xy 95.25 106.68))
    (stroke (width 0) (type default) (color 0 0 0 0))
    (uuid 8fabaec3-3ac4-4ff2-a511-37364007c2eb)
  )

  (wire (pts (xy 223.139 125.222) (xy 225.679 125.222))
    (stroke (width 0) (type default) (color 0 0 0 0))
    (uuid 957183f4-308c-48bb-802b-74e21f481424)
  )
  (wire (pts (xy 26.67 71.12) (xy 26.67 68.58))
    (stroke (width 0) (type default) (color 0 0 0 0))
    (uuid a0e696cd-7bbd-44e4-adc8-77ff52c6c68d)
  )
  (wire (pts (xy 175.26 95.25) (xy 177.8 95.25))
    (stroke (width 0) (type default) (color 0 0 0 0))
    (uuid a1f7225e-db91-4e2c-99ba-bbf5ce9836b6)
  )
  (wire (pts (xy 123.19 111.76) (xy 123.19 114.3))
    (stroke (width 0) (type default) (color 0 0 0 0))
    (uuid a2cb5639-652b-48bb-b93d-b23c207af082)
  )
  (wire (pts (xy 225.679 88.9) (xy 246.38 88.9))
    (stroke (width 0) (type default) (color 0 0 0 0))
    (uuid a5a68bf0-6555-432b-b65d-cc3ef5054bc9)
  )
  (wire (pts (xy 107.95 76.2) (xy 107.95 78.74))
    (stroke (width 0) (type default) (color 0 0 0 0))
    (uuid a8330db1-7fa6-467e-9bfc-fc66e3096f1d)
  )
  (wire (pts (xy 177.8 114.3) (xy 177.8 102.87))
    (stroke (width 0) (type default) (color 0 0 0 0))
    (uuid ad10b603-c505-4468-8df3-e8282ca48715)
  )
  (wire (pts (xy 39.37 68.58) (xy 41.91 68.58))
    (stroke (width 0) (type default) (color 0 0 0 0))
    (uuid af28d65c-1eba-4b8e-843f-87669d76ce5b)
  )
  (wire (pts (xy 129.54 100.33) (xy 127 100.33))
    (stroke (width 0) (type default) (color 0 0 0 0))
    (uuid b004644b-54a2-41be-9f4e-22261da6d6d9)
  )
  (wire (pts (xy 39.37 68.58) (xy 39.37 71.12))
    (stroke (width 0) (type default) (color 0 0 0 0))
    (uuid b4d0537f-b21e-48b9-bd28-6e8181ef4450)
  )
  (wire (pts (xy 80.01 120.65) (xy 80.01 123.19))
    (stroke (width 0) (type default) (color 0 0 0 0))
    (uuid b58891ab-bd74-4d35-bcbe-b8f80efb075e)
  )
  (wire (pts (xy 39.37 78.74) (xy 39.37 83.82))
    (stroke (width 0) (type default) (color 0 0 0 0))
    (uuid b968bc08-9a0f-4bd3-a706-088e3188bea7)
  )
  (wire (pts (xy 243.84 83.82) (xy 246.38 83.82))
    (stroke (width 0) (type default) (color 0 0 0 0))
    (uuid bb2581a6-4522-4886-a0bc-730bc14f9e65)
  )
  (wire (pts (xy 225.679 122.682) (xy 225.679 125.222))
    (stroke (width 0) (type default) (color 0 0 0 0))
    (uuid c273d2f8-f30a-40a7-abbc-97e240c283ea)
  )
  (wire (pts (xy 71.12 68.58) (xy 71.12 71.12))
    (stroke (width 0) (type default) (color 0 0 0 0))
    (uuid c6a9f583-889d-44f3-81c6-b2335e6ab54f)
  )
  (wire (pts (xy 243.84 110.49) (xy 246.38 110.49))
    (stroke (width 0) (type default) (color 0 0 0 0))
    (uuid c6f424d9-e87f-4656-9163-c483e362f8e7)
  )
  (wire (pts (xy 80.01 130.81) (xy 80.01 133.35))
    (stroke (width 0) (type default) (color 0 0 0 0))
    (uuid c75ceb11-2f92-4d09-879a-00eb01802053)
  )
  (wire (pts (xy 175.26 92.71) (xy 177.8 92.71))
    (stroke (width 0) (type default) (color 0 0 0 0))
    (uuid cc53edb5-a324-4f56-a191-243d3483ac5e)
  )
  (wire (pts (xy 71.12 55.88) (xy 71.12 58.42))
    (stroke (width 0) (type default) (color 0 0 0 0))
    (uuid d89ae83f-f833-400c-b6c3-1840d50aa911)
  )
  (wire (pts (xy 182.88 110.49) (xy 182.88 113.03))
    (stroke (width 0) (type default) (color 0 0 0 0))
    (uuid dc3fb413-ef0b-4e07-be40-d2a78577729a)
  )
  (wire (pts (xy 243.84 95.25) (xy 246.38 95.25))
    (stroke (width 0) (type default) (color 0 0 0 0))
    (uuid dccdc913-8e6b-4e2c-a8f0-55388b59888b)
  )
  (wire (pts (xy 205.74 83.82) (xy 205.74 86.36))
    (stroke (width 0) (type default) (color 0 0 0 0))
    (uuid de87de30-7a4f-49d0-8899-e7ebda517294)
  )
  (wire (pts (xy 39.37 55.88) (xy 39.37 58.42))
    (stroke (width 0) (type default) (color 0 0 0 0))
    (uuid e0bd9774-f2bb-4e60-819e-7352a6c9d7d5)
  )
  (wire (pts (xy 129.54 85.09) (xy 127 85.09))
    (stroke (width 0) (type default) (color 0 0 0 0))
    (uuid e0eb36d8-553e-420b-a09b-19834345c65b)
  )
  (wire (pts (xy 71.12 66.04) (xy 71.12 68.58))
    (stroke (width 0) (type default) (color 0 0 0 0))
    (uuid ec8f6a6b-a8cf-419c-9aa7-0aaeb629bad8)
  )
  (wire (pts (xy 26.67 81.28) (xy 26.67 83.82))
    (stroke (width 0) (type default) (color 0 0 0 0))
    (uuid ed5b5478-57c2-415c-b257-32b3bd5bd62a)
  )
  (wire (pts (xy 243.84 81.28) (xy 246.38 81.28))
    (stroke (width 0) (type default) (color 0 0 0 0))
    (uuid ee8ccad3-d278-4749-b7de-cf1012240222)
  )
  (wire (pts (xy 26.67 68.58) (xy 39.37 68.58))
    (stroke (width 0) (type default) (color 0 0 0 0))
    (uuid fdd0a510-a030-42e8-9e16-37ae3d291781)
  )

  (text "Bypass" (at 127 123.19 0)
    (effects (font (size 1.27 1.27)) (justify left bottom))
    (uuid 148c789a-6ec7-43fb-a802-c65c6265c22d)
  )
  (text "D3\nD4\nD9\nD10\nD1\nD2\nD11\nD12" (at 255.27 114.3 0)
    (effects (font (size 1.7 1.7)) (justify left bottom))
    (uuid 1a2b4e8c-984d-44f0-9de2-a7b0c536e738)
  )
  (text "Si se requiere el modo\nsleep por sw\npuede hacer uso de este\nmódulo, caso contrario,\nse puede quitar"
    (at 68.58 149.86 0)
    (effects (font (size 1.27 1.27)) (justify left bottom))
    (uuid 4ef9568d-7b88-4640-aee8-759812abc41f)
  )
  (text "D5\nD6\nD7\nD8\nD0\nA0" (at 255.27 90.17 0)
    (effects (font (size 1.7 1.7)) (justify left bottom))
    (uuid 6be92bf8-aa75-4043-ad3a-86a23d59bd7d)
  )
  (text "Reset\nbutton" (at 43.18 81.28 0)
    (effects (font (size 1.27 1.27)) (justify left bottom))
    (uuid 79ec06ad-3ee0-43b2-904b-c4072503c672)
  )
  (text "1 % de\ntolerancia" (at 228.219 127.762 0)
    (effects (font (size 1.27 1.27)) (justify left bottom))
    (uuid cfc7e902-6a2b-4a9e-9507-2ccd35e7ca70)
  )
  (text "User\nbutton" (at 74.93 81.28 0)
    (effects (font (size 1.27 1.27)) (justify left bottom))
    (uuid d1f0f935-b6b0-4489-90ff-0257c46b90a6)
  )

  (label "IO9" (at 151.13 118.11 270)
    (effects (font (size 1.27 1.27)) (justify right bottom))
    (uuid 04d7220e-cd7c-4bfd-a364-707a52282311)
  )
  (label "IO14" (at 243.84 76.2 180)
    (effects (font (size 1.27 1.27)) (justify right bottom))
    (uuid 08b3f89b-d872-47d6-a256-fbb0f3b12018)
  )
  (label "IO1" (at 177.8 85.09 0)
    (effects (font (size 1.27 1.27)) (justify left bottom))
    (uuid 0c71df85-197c-40a9-90c8-e6719ae59374)
  )
  (label "IO10" (at 243.84 113.03 180)
    (effects (font (size 1.27 1.27)) (justify right bottom))
    (uuid 1fbd6f20-e054-41ef-8930-3ae35b267af3)
  )
  (label "RESET" (at 127 85.09 180)
    (effects (font (size 1.27 1.27)) (justify right bottom))
    (uuid 21cca31c-40b5-4312-b1ed-c390fac52130)
  )
  (label "IO13" (at 127 100.33 180)
    (effects (font (size 1.27 1.27)) (justify right bottom))
    (uuid 25fcc1b5-b387-4082-8ef4-25520ea0e38c)
  )
  (label "IO0" (at 243.84 95.25 180)
    (effects (font (size 1.27 1.27)) (justify right bottom))
    (uuid 273ead33-9b15-43f5-9f89-f706491c27c7)
  )
  (label "IO16" (at 127 92.71 180)
    (effects (font (size 1.27 1.27)) (justify right bottom))
    (uuid 3eaaad3d-ce8e-4787-b3a0-1d26a967c010)
  )
  (label "IO0" (at 73.66 68.58 0)
    (effects (font (size 1.27 1.27)) (justify left bottom))
    (uuid 3edfec0c-d163-4340-a466-1cab0349355b)
  )
  (label "RESET" (at 80.01 118.11 0)
    (effects (font (size 1.27 1.27)) (justify left bottom))
    (uuid 48c975b8-e95f-499e-a245-59b650a67f2c)
  )
  (label "IO3" (at 243.84 100.33 180)
    (effects (font (size 1.27 1.27)) (justify right bottom))
    (uuid 4ea3cea0-16da-4368-89bf-131a79572bbf)
  )
  (label "IO0" (at 177.8 95.25 0)
    (effects (font (size 1.27 1.27)) (justify left bottom))
    (uuid 4fa2d9a6-04a9-4d5d-879f-6fd74fad510e)
  )
  (label "ENABLE" (at 127 90.17 180)
    (effects (font (size 1.27 1.27)) (justify right bottom))
    (uuid 5fc55697-5e16-475b-8bad-d699c41c90ba)
  )
  (label "IO13" (at 243.84 81.28 180)
    (effects (font (size 1.27 1.27)) (justify right bottom))
    (uuid 6baff9c7-5637-479d-bfdc-2e29f087cd32)
  )
  (label "IO2" (at 177.8 97.79 0)
    (effects (font (size 1.27 1.27)) (justify left bottom))
    (uuid 6e1a093e-23a6-4218-90c4-b042aa75edd1)
  )
  (label "IO4" (at 243.84 107.95 180)
    (effects (font (size 1.27 1.27)) (justify right bottom))
    (uuid 76395ed8-72eb-4195-aa7a-628917fc55fe)
  )
  (label "IO9" (at 243.84 110.49 180)
    (effects (font (size 1.27 1.27)) (justify right bottom))
    (uuid 79ee8deb-7cf6-43fe-960a-97cc28047b28)
  )
  (label "IO3" (at 177.8 87.63 0)
    (effects (font (size 1.27 1.27)) (justify left bottom))
    (uuid 83b1bdc5-36e1-4c8c-8e10-65da87b9dbcb)
  )
  (label "IO12" (at 243.84 78.74 180)
    (effects (font (size 1.27 1.27)) (justify right bottom))
    (uuid a15cd399-4ebf-4efe-8705-29e2d29a543e)
  )
  (label "IO4" (at 177.8 92.71 0)
    (effects (font (size 1.27 1.27)) (justify left bottom))
    (uuid a5632bca-f0ab-43f9-b09f-1fa6cb99f226)
  )
  (label "IO2" (at 243.84 97.79 180)
    (effects (font (size 1.27 1.27)) (justify right bottom))
    (uuid ae5b7f0e-a56d-4979-b341-b748b470e13b)
  )
  (label "IO10" (at 153.67 118.11 270)
    (effects (font (size 1.27 1.27)) (justify right bottom))
    (uuid b9655c89-781d-4398-a433-9f4c1a2f94a3)
  )
  (label "IO12" (at 127 97.79 180)
    (effects (font (size 1.27 1.27)) (justify right bottom))
    (uuid bedecf34-0350-452d-a4b5-958df051e558)
  )
  (label "IO15" (at 243.84 83.82 180)
    (effects (font (size 1.27 1.27)) (justify right bottom))
    (uuid c2a62af2-797c-48e3-85bf-98e2bc87a562)
  )
  (label "ADC" (at 223.139 125.222 180)
    (effects (font (size 1.27 1.27)) (justify right bottom))
    (uuid c70d95fe-2460-4d03-8674-1143875817be)
  )
  (label "IO5" (at 243.84 105.41 180)
    (effects (font (size 1.27 1.27)) (justify right bottom))
    (uuid cd9678f3-9ebc-413c-9e50-36a1f15dd236)
  )
  (label "RESET" (at 41.91 68.58 0)
    (effects (font (size 1.27 1.27)) (justify left bottom))
    (uuid cdd72621-78f5-45ee-aa42-37d81124d0e8)
  )
  (label "ADC" (at 127 87.63 180)
    (effects (font (size 1.27 1.27)) (justify right bottom))
    (uuid e4fbfcfc-c633-4a6a-86b3-7d1b2b4b3a45)
  )
  (label "IO14" (at 127 95.25 180)
    (effects (font (size 1.27 1.27)) (justify right bottom))
    (uuid e6b87c43-d9d5-4dda-8a8f-dab11d07ada5)
  )
  (label "IO16" (at 80.01 133.35 270)
    (effects (font (size 1.27 1.27)) (justify right bottom))
    (uuid e710b927-d9be-4867-ae81-f3cb1886fae1)
  )
  (label "IO15" (at 177.8 90.17 0)
    (effects (font (size 1.27 1.27)) (justify left bottom))
    (uuid ea48fe10-9bca-4434-8051-11c708b2a38b)
  )
  (label "IO1" (at 243.84 102.87 180)
    (effects (font (size 1.27 1.27)) (justify right bottom))
    (uuid f077d4a4-2033-4083-82a6-7e9890e31c53)
  )
  (label "IO16" (at 243.84 86.36 180)
    (effects (font (size 1.27 1.27)) (justify right bottom))
    (uuid f2ba3e0b-08f5-4c39-8139-7fd0798a3323)
  )

  (hierarchical_label "IO15" (shape bidirectional) (at 246.38 83.82 0)
    (effects (font (size 1.27 1.27)) (justify left))
    (uuid 04c60d8c-67d7-46c8-b7fd-1ef1bffe13df)
  )
  (hierarchical_label "IO13" (shape bidirectional) (at 246.38 81.28 0)
    (effects (font (size 1.27 1.27)) (justify left))
    (uuid 0ca6bae5-2e57-42c0-b0f7-83e0f51dd3ed)
  )
  (hierarchical_label "IO4" (shape bidirectional) (at 246.38 107.95 0)
    (effects (font (size 1.27 1.27)) (justify left))
    (uuid 14894943-3f29-44b6-be94-952538e90b0b)
  )
  (hierarchical_label "IO2" (shape bidirectional) (at 246.38 97.79 0)
    (effects (font (size 1.27 1.27)) (justify left))
    (uuid 1793d490-9253-4b95-82a9-e3eb53771bd7)
  )
  (hierarchical_label "IO3" (shape bidirectional) (at 246.38 100.33 0)
    (effects (font (size 1.27 1.27)) (justify left))
    (uuid 20d4f460-ba26-4a14-a48a-f2129960603b)
  )
  (hierarchical_label "IO5" (shape bidirectional) (at 246.38 105.41 0)
    (effects (font (size 1.27 1.27)) (justify left))
    (uuid 3056f090-51ac-4a46-a73a-9dd9d0981e7d)
  )
  (hierarchical_label "IO10" (shape bidirectional) (at 246.38 113.03 0)
    (effects (font (size 1.27 1.27)) (justify left))
    (uuid 6b73e16e-a124-4590-806a-ef4b8bdda0ac)
  )
  (hierarchical_label "A0" (shape input) (at 246.38 88.9 0)
    (effects (font (size 1.27 1.27)) (justify left))
    (uuid a1a21f57-cb06-4944-bc4c-4dc01f36aca6)
  )
  (hierarchical_label "IO9" (shape bidirectional) (at 246.38 110.49 0)
    (effects (font (size 1.27 1.27)) (justify left))
    (uuid cd861bb2-fef7-46ab-848b-a9bb700fa3e6)
  )
  (hierarchical_label "IO16" (shape bidirectional) (at 246.38 86.36 0)
    (effects (font (size 1.27 1.27)) (justify left))
    (uuid d360a21c-0399-4393-ac57-5587174a6ddf)
  )
  (hierarchical_label "IO12" (shape bidirectional) (at 246.38 78.74 0)
    (effects (font (size 1.27 1.27)) (justify left))
    (uuid eefcad9c-0b49-4b2c-8995-d736d41a9d63)
  )
  (hierarchical_label "IO14" (shape bidirectional) (at 246.38 76.2 0)
    (effects (font (size 1.27 1.27)) (justify left))
    (uuid f71946a2-b823-43b7-9520-6c0d2bdeba84)
  )
  (hierarchical_label "IO0" (shape bidirectional) (at 246.38 95.25 0)
    (effects (font (size 1.27 1.27)) (justify left))
    (uuid f8c489ef-56ae-4ad3-8f01-d7d575ea5ad1)
  )
  (hierarchical_label "IO1" (shape bidirectional) (at 246.38 102.87 0)
    (effects (font (size 1.27 1.27)) (justify left))
    (uuid fea05d15-43f5-44f1-a3b8-93612cab8429)
  )

  (symbol (lib_id "Device:C") (at 123.19 118.11 0) (unit 1)
    (in_bom yes) (on_board yes) (fields_autoplaced)
    (uuid 0035b0ad-a6c3-4461-b953-c3d7ac268cac)
    (property "Reference" "C5" (id 0) (at 127 116.8399 0)
      (effects (font (size 1.27 1.27)) (justify left))
    )
    (property "Value" "100p" (id 1) (at 127 119.3799 0)
      (effects (font (size 1.27 1.27)) (justify left))
    )
    (property "Footprint" "" (id 2) (at 124.1552 121.92 0)
      (effects (font (size 1.27 1.27)) hide)
    )
    (property "Datasheet" "~" (id 3) (at 123.19 118.11 0)
      (effects (font (size 1.27 1.27)) hide)
    )
    (pin "1" (uuid 0e165ec9-8e16-4b59-8eaf-8db7f6b78067))
    (pin "2" (uuid e5f0d8b5-c00b-4dab-821f-8af642f446df))
  )

  (symbol (lib_id "power:+3.3V") (at 205.74 83.82 0) (unit 1)
    (in_bom yes) (on_board yes) (fields_autoplaced)
    (uuid 06609529-37c2-4f15-9d3a-3134c2cf2bf7)
    (property "Reference" "#PWR0108" (id 0) (at 205.74 87.63 0)
      (effects (font (size 1.27 1.27)) hide)
    )
    (property "Value" "+3.3V" (id 1) (at 205.7399 80.01 90)
      (effects (font (size 1.27 1.27)) (justify left))
    )
    (property "Footprint" "" (id 2) (at 205.74 83.82 0)
      (effects (font (size 1.27 1.27)) hide)
    )
    (property "Datasheet" "" (id 3) (at 205.74 83.82 0)
      (effects (font (size 1.27 1.27)) hide)
    )
    (pin "1" (uuid b54ba268-089e-44c3-80a0-5f49c6937dc4))
  )

  (symbol (lib_id "Device:R") (at 225.679 131.572 0) (unit 1)
    (in_bom yes) (on_board yes) (fields_autoplaced)
    (uuid 0775bcc7-bc1c-4039-849d-42b4c26c571b)
    (property "Reference" "R7" (id 0) (at 228.219 130.3019 0)
      (effects (font (size 1.27 1.27)) (justify left))
    )
    (property "Value" "100K" (id 1) (at 228.219 132.8419 0)
      (effects (font (size 1.27 1.27)) (justify left))
    )
    (property "Footprint" "" (id 2) (at 223.901 131.572 90)
      (effects (font (size 1.27 1.27)) hide)
    )
    (property "Datasheet" "~" (id 3) (at 225.679 131.572 0)
      (effects (font (size 1.27 1.27)) hide)
    )
    (pin "1" (uuid a756b1e5-306e-4b3c-a33d-77a4cff910aa))
    (pin "2" (uuid 42bf7825-2ddb-41c7-887f-0c67b1036119))
  )

  (symbol (lib_id "power:GND") (at 177.8 114.3 0) (unit 1)
    (in_bom yes) (on_board yes) (fields_autoplaced)
    (uuid 18ad62b4-c58f-482f-89de-8d28ef69a0d6)
    (property "Reference" "#PWR0111" (id 0) (at 177.8 120.65 0)
      (effects (font (size 1.27 1.27)) hide)
    )
    (property "Value" "GND" (id 1) (at 177.8 119.38 0))
    (property "Footprint" "" (id 2) (at 177.8 114.3 0)
      (effects (font (size 1.27 1.27)) hide)
    )
    (property "Datasheet" "" (id 3) (at 177.8 114.3 0)
      (effects (font (size 1.27 1.27)) hide)
    )
    (pin "1" (uuid 20e3129a-3a6e-4e9b-94bb-4c072e641336))
  )

  (symbol (lib_id "power:GND") (at 123.19 124.46 0) (unit 1)
    (in_bom yes) (on_board yes) (fields_autoplaced)
    (uuid 282408af-fa4a-4347-9fb0-af7ff2142021)
    (property "Reference" "#PWR0112" (id 0) (at 123.19 130.81 0)
      (effects (font (size 1.27 1.27)) hide)
    )
    (property "Value" "GND" (id 1) (at 123.19 129.54 0))
    (property "Footprint" "" (id 2) (at 123.19 124.46 0)
      (effects (font (size 1.27 1.27)) hide)
    )
    (property "Datasheet" "" (id 3) (at 123.19 124.46 0)
      (effects (font (size 1.27 1.27)) hide)
    )
    (pin "1" (uuid efd3588a-40fe-4c15-b664-a6a250ad0999))
  )

  (symbol (lib_id "Device:R") (at 71.12 62.23 180) (unit 1)
    (in_bom yes) (on_board yes) (fields_autoplaced)
    (uuid 42fff475-5c2a-4f1b-aa6f-d56c3190f3d2)
    (property "Reference" "R2" (id 0) (at 73.66 60.9599 0)
      (effects (font (size 1.27 1.27)) (justify right))
    )
    (property "Value" "10k" (id 1) (at 73.66 63.4999 0)
      (effects (font (size 1.27 1.27)) (justify right))
    )
    (property "Footprint" "" (id 2) (at 72.898 62.23 90)
      (effects (font (size 1.27 1.27)) hide)
    )
    (property "Datasheet" "~" (id 3) (at 71.12 62.23 0)
      (effects (font (size 1.27 1.27)) hide)
    )
    (pin "1" (uuid 7d84d635-062f-4481-8e4d-890ab18aaa6e))
    (pin "2" (uuid 12883762-0bad-457c-a2e4-9df0854d4c17))
  )

  (symbol (lib_id "Device:C") (at 39.37 74.93 0) (unit 1)
    (in_bom yes) (on_board yes) (fields_autoplaced)
    (uuid 4c4b86e3-3cd2-42ef-9573-d1fdd77bbc3c)
    (property "Reference" "C3" (id 0) (at 43.18 73.6599 0)
      (effects (font (size 1.27 1.27)) (justify left))
    )
    (property "Value" "100p" (id 1) (at 43.18 76.1999 0)
      (effects (font (size 1.27 1.27)) (justify left))
    )
    (property "Footprint" "" (id 2) (at 40.3352 78.74 0)
      (effects (font (size 1.27 1.27)) hide)
    )
    (property "Datasheet" "~" (id 3) (at 39.37 74.93 0)
      (effects (font (size 1.27 1.27)) hide)
    )
    (pin "1" (uuid 4658dff9-81c4-4fa9-8e11-2101ac52e9b7))
    (pin "2" (uuid e981117e-ae3e-4644-9f3a-beedc82664ca))
  )

  (symbol (lib_id "Switch:SW_Push") (at 58.42 76.2 90) (unit 1)
    (in_bom yes) (on_board yes) (fields_autoplaced)
    (uuid 4f82e30e-5d20-45c7-8de2-1a2a28b3f780)
    (property "Reference" "SW3" (id 0) (at 59.69 74.9299 90)
      (effects (font (size 1.27 1.27)) (justify right))
    )
    (property "Value" "SW_Push" (id 1) (at 59.69 77.4699 90)
      (effects (font (size 1.27 1.27)) (justify right))
    )
    (property "Footprint" "" (id 2) (at 53.34 76.2 0)
      (effects (font (size 1.27 1.27)) hide)
    )
    (property "Datasheet" "~" (id 3) (at 53.34 76.2 0)
      (effects (font (size 1.27 1.27)) hide)
    )
    (pin "1" (uuid a3aa38e7-8063-49ce-9399-7e62d22e627e))
    (pin "2" (uuid 066c92b8-9d0f-4de4-8a9d-12fba57a04a2))
  )

  (symbol (lib_id "power:GND") (at 225.679 137.922 0) (unit 1)
    (in_bom yes) (on_board yes) (fields_autoplaced)
    (uuid 5028d5b0-9991-4fbb-8e8a-0b653ff4c46d)
    (property "Reference" "#PWR0109" (id 0) (at 225.679 144.272 0)
      (effects (font (size 1.27 1.27)) hide)
    )
    (property "Value" "GND" (id 1) (at 225.679 143.002 0))
    (property "Footprint" "" (id 2) (at 225.679 137.922 0)
      (effects (font (size 1.27 1.27)) hide)
    )
    (property "Datasheet" "" (id 3) (at 225.679 137.922 0)
      (effects (font (size 1.27 1.27)) hide)
    )
    (pin "1" (uuid 945a2f27-83ca-402e-8332-5cc5fee0131f))
  )

  (symbol (lib_id "power:+3.3V") (at 107.95 76.2 0) (unit 1)
    (in_bom yes) (on_board yes) (fields_autoplaced)
    (uuid 592198f0-5441-4a94-94dd-8db6be34778f)
    (property "Reference" "#PWR0117" (id 0) (at 107.95 80.01 0)
      (effects (font (size 1.27 1.27)) hide)
    )
    (property "Value" "+3.3V" (id 1) (at 107.9499 72.39 90)
      (effects (font (size 1.27 1.27)) (justify left))
    )
    (property "Footprint" "" (id 2) (at 107.95 76.2 0)
      (effects (font (size 1.27 1.27)) hide)
    )
    (property "Datasheet" "" (id 3) (at 107.95 76.2 0)
      (effects (font (size 1.27 1.27)) hide)
    )
    (pin "1" (uuid 0be421b0-5a45-426e-bfd7-22bbba7b406b))
  )

  (symbol (lib_id "Device:R") (at 225.679 118.872 0) (unit 1)
    (in_bom yes) (on_board yes) (fields_autoplaced)
    (uuid 733e512e-112d-41de-bb00-16e52cf2aaf3)
    (property "Reference" "R6" (id 0) (at 228.219 117.6019 0)
      (effects (font (size 1.27 1.27)) (justify left))
    )
    (property "Value" "220K" (id 1) (at 228.219 120.1419 0)
      (effects (font (size 1.27 1.27)) (justify left))
    )
    (property "Footprint" "" (id 2) (at 223.901 118.872 90)
      (effects (font (size 1.27 1.27)) hide)
    )
    (property "Datasheet" "~" (id 3) (at 225.679 118.872 0)
      (effects (font (size 1.27 1.27)) hide)
    )
    (pin "1" (uuid 1c1c705c-8d49-4142-a7c3-4ba7bfc3849f))
    (pin "2" (uuid f5511144-56c2-4639-adac-5dced7a3bb4b))
  )

  (symbol (lib_id "Connector:Conn_01x03_Male") (at 72.39 118.11 0) (unit 1)
    (in_bom yes) (on_board yes) (fields_autoplaced)
    (uuid 73593da1-3bcd-4ea7-ac6d-36b9373c8dd1)
    (property "Reference" "J13" (id 0) (at 73.025 110.49 0))
    (property "Value" "sleep" (id 1) (at 73.025 113.03 0))
    (property "Footprint" "" (id 2) (at 72.39 118.11 0)
      (effects (font (size 1.27 1.27)) hide)
    )
    (property "Datasheet" "~" (id 3) (at 72.39 118.11 0)
      (effects (font (size 1.27 1.27)) hide)
    )
    (pin "1" (uuid a01be35a-935f-4a11-aa40-48a835b4f8dc))
    (pin "2" (uuid d84dc00f-3ad2-4354-96b3-92bdfc547479))
    (pin "3" (uuid 98b77894-4dad-4e71-9008-a794e33ffaca))
  )

  (symbol (lib_id "Device:R") (at 107.95 82.55 180) (unit 1)
    (in_bom yes) (on_board yes) (fields_autoplaced)
    (uuid 74633458-8ec4-465a-baaf-18e4b4b6bddd)
    (property "Reference" "R3" (id 0) (at 110.49 81.2799 0)
      (effects (font (size 1.27 1.27)) (justify right))
    )
    (property "Value" "10k" (id 1) (at 110.49 83.8199 0)
      (effects (font (size 1.27 1.27)) (justify right))
    )
    (property "Footprint" "" (id 2) (at 109.728 82.55 90)
      (effects (font (size 1.27 1.27)) hide)
    )
    (property "Datasheet" "~" (id 3) (at 107.95 82.55 0)
      (effects (font (size 1.27 1.27)) hide)
    )
    (pin "1" (uuid 65bcc551-2830-4b6c-880d-4a138c431f7c))
    (pin "2" (uuid faf3fcc2-84c0-4861-b2d1-3599acff7d15))
  )

  (symbol (lib_id "Device:R") (at 80.01 127 0) (unit 1)
    (in_bom yes) (on_board yes) (fields_autoplaced)
    (uuid 7f6d270f-f8c2-4f8a-9fcc-4f03fbafbc99)
    (property "Reference" "R8" (id 0) (at 82.55 125.7299 0)
      (effects (font (size 1.27 1.27)) (justify left))
    )
    (property "Value" "470" (id 1) (at 82.55 128.2699 0)
      (effects (font (size 1.27 1.27)) (justify left))
    )
    (property "Footprint" "" (id 2) (at 78.232 127 90)
      (effects (font (size 1.27 1.27)) hide)
    )
    (property "Datasheet" "~" (id 3) (at 80.01 127 0)
      (effects (font (size 1.27 1.27)) hide)
    )
    (pin "1" (uuid ea94eb0f-972d-4526-ad4a-01aa28cd9454))
    (pin "2" (uuid 08ca50ec-bd81-441a-84cb-30c924ac3fbd))
  )

  (symbol (lib_id "Device:R") (at 39.37 62.23 180) (unit 1)
    (in_bom yes) (on_board yes) (fields_autoplaced)
    (uuid 894096a4-b9f2-4f09-a456-1b977849f880)
    (property "Reference" "R1" (id 0) (at 41.91 60.9599 0)
      (effects (font (size 1.27 1.27)) (justify right))
    )
    (property "Value" "10k" (id 1) (at 41.91 63.4999 0)
      (effects (font (size 1.27 1.27)) (justify right))
    )
    (property "Footprint" "" (id 2) (at 41.148 62.23 90)
      (effects (font (size 1.27 1.27)) hide)
    )
    (property "Datasheet" "~" (id 3) (at 39.37 62.23 0)
      (effects (font (size 1.27 1.27)) hide)
    )
    (pin "1" (uuid 22a54a9d-ca04-4185-a7d1-dd5528408fb6))
    (pin "2" (uuid e0f976dc-da1d-4982-ab84-a15a2d044ec6))
  )

  (symbol (lib_id "power:GND") (at 182.88 113.03 0) (unit 1)
    (in_bom yes) (on_board yes) (fields_autoplaced)
    (uuid 9a4c9a5f-87c8-49ae-b098-13878a8eed63)
    (property "Reference" "#PWR0110" (id 0) (at 182.88 119.38 0)
      (effects (font (size 1.27 1.27)) hide)
    )
    (property "Value" "GND" (id 1) (at 182.88 118.11 0))
    (property "Footprint" "" (id 2) (at 182.88 113.03 0)
      (effects (font (size 1.27 1.27)) hide)
    )
    (property "Datasheet" "" (id 3) (at 182.88 113.03 0)
      (effects (font (size 1.27 1.27)) hide)
    )
    (pin "1" (uuid 2c98ec9a-2b10-4a19-8b26-f3803817d7f4))
  )

  (symbol (lib_id "Device:R") (at 182.88 106.68 0) (unit 1)
    (in_bom yes) (on_board yes) (fields_autoplaced)
    (uuid 9fb18281-7b63-4b3f-bafe-105a4cdaf18f)
    (property "Reference" "R5" (id 0) (at 185.42 105.4099 0)
      (effects (font (size 1.27 1.27)) (justify left))
    )
    (property "Value" "10k" (id 1) (at 185.42 107.9499 0)
      (effects (font (size 1.27 1.27)) (justify left))
    )
    (property "Footprint" "" (id 2) (at 181.102 106.68 90)
      (effects (font (size 1.27 1.27)) hide)
    )
    (property "Datasheet" "~" (id 3) (at 182.88 106.68 0)
      (effects (font (size 1.27 1.27)) hide)
    )
    (pin "1" (uuid d132ed7a-da3b-4d59-9b1e-9b28b8334204))
    (pin "2" (uuid 8f33f061-e220-4fd0-9fe0-21585e7aaa44))
  )

  (symbol (lib_id "Switch:SW_Push") (at 26.67 76.2 90) (unit 1)
    (in_bom yes) (on_board yes) (fields_autoplaced)
    (uuid afbca636-16b9-4d88-a47e-7d60ee0661cd)
    (property "Reference" "SW2" (id 0) (at 27.94 74.9299 90)
      (effects (font (size 1.27 1.27)) (justify right))
    )
    (property "Value" "SW_Push" (id 1) (at 27.94 77.4699 90)
      (effects (font (size 1.27 1.27)) (justify right))
    )
    (property "Footprint" "" (id 2) (at 21.59 76.2 0)
      (effects (font (size 1.27 1.27)) hide)
    )
    (property "Datasheet" "~" (id 3) (at 21.59 76.2 0)
      (effects (font (size 1.27 1.27)) hide)
    )
    (pin "1" (uuid 2a694378-d9fd-4272-b8cc-69b824ee8250))
    (pin "2" (uuid 6780ba96-7b63-47c3-aea4-24d6dd3f855d))
  )

  (symbol (lib_id "power:GND") (at 71.12 86.36 0) (unit 1)
    (in_bom yes) (on_board yes) (fields_autoplaced)
    (uuid ba76563e-431d-4d01-ba99-691ccb3336aa)
    (property "Reference" "#PWR0113" (id 0) (at 71.12 92.71 0)
      (effects (font (size 1.27 1.27)) hide)
    )
    (property "Value" "GND" (id 1) (at 71.12 91.44 0))
    (property "Footprint" "" (id 2) (at 71.12 86.36 0)
      (effects (font (size 1.27 1.27)) hide)
    )
    (property "Datasheet" "" (id 3) (at 71.12 86.36 0)
      (effects (font (size 1.27 1.27)) hide)
    )
    (pin "1" (uuid 498730e3-e4f4-4647-9d2e-de88a61b1ee1))
  )

  (symbol (lib_id "power:+3.3V") (at 123.19 109.22 0) (unit 1)
    (in_bom yes) (on_board yes) (fields_autoplaced)
    (uuid c09549c2-3b0a-4baa-b212-28b870199e62)
    (property "Reference" "#PWR0118" (id 0) (at 123.19 113.03 0)
      (effects (font (size 1.27 1.27)) hide)
    )
    (property "Value" "+3.3V" (id 1) (at 123.19 104.14 0))
    (property "Footprint" "" (id 2) (at 123.19 109.22 0)
      (effects (font (size 1.27 1.27)) hide)
    )
    (property "Datasheet" "" (id 3) (at 123.19 109.22 0)
      (effects (font (size 1.27 1.27)) hide)
    )
    (pin "1" (uuid e37b5114-9cc6-44b5-bdd1-21937e7ab0e1))
  )

  (symbol (lib_id "Device:R") (at 205.74 90.17 180) (unit 1)
    (in_bom yes) (on_board yes) (fields_autoplaced)
    (uuid c192cfb0-3cbf-4419-af6e-0ccbfabcd8eb)
    (property "Reference" "R4" (id 0) (at 208.28 88.8999 0)
      (effects (font (size 1.27 1.27)) (justify right))
    )
    (property "Value" "10k" (id 1) (at 208.28 91.4399 0)
      (effects (font (size 1.27 1.27)) (justify right))
    )
    (property "Footprint" "" (id 2) (at 207.518 90.17 90)
      (effects (font (size 1.27 1.27)) hide)
    )
    (property "Datasheet" "~" (id 3) (at 205.74 90.17 0)
      (effects (font (size 1.27 1.27)) hide)
    )
    (pin "1" (uuid 9b2d9f2a-6965-40da-8728-87fe9cc8308c))
    (pin "2" (uuid cdbd0d5a-4959-4bbd-90fb-099383ca6279))
  )

  (symbol (lib_id "Device:C") (at 71.12 74.93 0) (unit 1)
    (in_bom yes) (on_board yes) (fields_autoplaced)
    (uuid c5a2fd6f-125a-4458-b9a4-a165d8866278)
    (property "Reference" "C4" (id 0) (at 74.93 73.6599 0)
      (effects (font (size 1.27 1.27)) (justify left))
    )
    (property "Value" "100p" (id 1) (at 74.93 76.1999 0)
      (effects (font (size 1.27 1.27)) (justify left))
    )
    (property "Footprint" "" (id 2) (at 72.0852 78.74 0)
      (effects (font (size 1.27 1.27)) hide)
    )
    (property "Datasheet" "~" (id 3) (at 71.12 74.93 0)
      (effects (font (size 1.27 1.27)) hide)
    )
    (pin "1" (uuid 75f434f9-323c-418b-af98-89223dec33f9))
    (pin "2" (uuid b37b8d42-d3e0-4142-a889-1678c8dc4855))
  )

  (symbol (lib_id "esp8266:ESP-12F") (at 152.4 92.71 0) (unit 1)
    (in_bom yes) (on_board yes) (fields_autoplaced)
    (uuid cc21562f-128b-463a-9ed7-f94bb6c16791)
    (property "Reference" "U2" (id 0) (at 152.4 72.39 0))
    (property "Value" "" (id 1) (at 152.4 74.93 0))
    (property "Footprint" "" (id 2) (at 152.4 92.71 0)
      (effects (font (size 1.27 1.27)) hide)
    )
    (property "Datasheet" "http://l0l.org.uk/2014/12/esp8266-modules-hardware-guide-gotta-catch-em-all/" (id 3) (at 152.4 92.71 0)
      (effects (font (size 1.27 1.27)) hide)
    )
    (pin "1" (uuid 09eea37d-805b-4dfe-90c0-ac3e2bb0fa8e))
    (pin "10" (uuid 71cf69fa-9714-452f-8c5c-140d59cab106))
    (pin "11" (uuid 07a7be8f-c242-4f25-a50b-1628b903225f))
    (pin "12" (uuid 6d236900-f149-4697-a3bc-e0d24dfb9ddd))
    (pin "13" (uuid 92c3adb9-ea07-4c48-a4a2-fcd524d1bc9c))
    (pin "14" (uuid 6fc905ec-8cbc-4a79-90a9-f8ce298f54ae))
    (pin "15" (uuid a1e07aa9-4116-4b5d-a5cb-d0d24d26aeaf))
    (pin "16" (uuid 16aec983-634d-4621-913b-e75a86f57963))
    (pin "17" (uuid 3991d2f0-45c9-48e8-9f89-a3b423b57fb9))
    (pin "18" (uuid b5e4c46b-bf64-4483-ad4a-cf6bed503d14))
    (pin "19" (uuid d034d8ab-a2a0-4538-adef-c99bf66fd23e))
    (pin "2" (uuid 99fe77c1-df14-47a9-bf0e-3f50e4c01abd))
    (pin "20" (uuid 42dba237-673b-4825-8b10-b7a9c56f554b))
    (pin "21" (uuid a4978f38-957b-4c02-9887-fb297e98885f))
    (pin "22" (uuid da27c5b2-c9b6-4142-bf88-782de5faa363))
    (pin "3" (uuid 7ea41235-acab-449f-933a-b1583aab3749))
    (pin "4" (uuid a37a604d-da1c-45e7-addd-f1cc8ace814b))
    (pin "5" (uuid c7522d27-4120-4a48-8b6c-93618862e434))
    (pin "6" (uuid 19966a52-f8da-443e-a298-fe290ef0fd6a))
    (pin "7" (uuid 8faf6d93-9678-49c0-8bb9-e1c0a1d19141))
    (pin "8" (uuid 5856ea5d-6736-494b-9c54-f9435d5be89f))
    (pin "9" (uuid 287c9578-9099-4a64-9140-a32ef25fcc94))
  )

  (symbol (lib_id "power:GND") (at 39.37 86.36 0) (unit 1)
    (in_bom yes) (on_board yes) (fields_autoplaced)
    (uuid eb33e5bc-9e75-4e55-b1a4-8ec876ac1666)
    (property "Reference" "#PWR0114" (id 0) (at 39.37 92.71 0)
      (effects (font (size 1.27 1.27)) hide)
    )
    (property "Value" "GND" (id 1) (at 39.37 91.44 0))
    (property "Footprint" "" (id 2) (at 39.37 86.36 0)
      (effects (font (size 1.27 1.27)) hide)
    )
    (property "Datasheet" "" (id 3) (at 39.37 86.36 0)
      (effects (font (size 1.27 1.27)) hide)
    )
    (pin "1" (uuid 91499e10-b947-42ad-9b4f-62801eb07d71))
  )

  (symbol (lib_id "power:+3.3V") (at 39.37 55.88 0) (unit 1)
    (in_bom yes) (on_board yes) (fields_autoplaced)
    (uuid f8443d51-96f5-4986-b59d-d6efd5f9da44)
    (property "Reference" "#PWR0115" (id 0) (at 39.37 59.69 0)
      (effects (font (size 1.27 1.27)) hide)
    )
    (property "Value" "+3.3V" (id 1) (at 39.3699 52.07 90)
      (effects (font (size 1.27 1.27)) (justify left))
    )
    (property "Footprint" "" (id 2) (at 39.37 55.88 0)
      (effects (font (size 1.27 1.27)) hide)
    )
    (property "Datasheet" "" (id 3) (at 39.37 55.88 0)
      (effects (font (size 1.27 1.27)) hide)
    )
    (pin "1" (uuid 98c6119c-834a-4f24-9241-bb561e0ca0d7))
  )

  (symbol (lib_id "power:+3.3V") (at 71.12 55.88 0) (unit 1)
    (in_bom yes) (on_board yes) (fields_autoplaced)
    (uuid febba6e6-7dd0-4c6d-8d72-846949d16977)
    (property "Reference" "#PWR0116" (id 0) (at 71.12 59.69 0)
      (effects (font (size 1.27 1.27)) hide)
    )
    (property "Value" "+3.3V" (id 1) (at 71.1199 52.07 90)
      (effects (font (size 1.27 1.27)) (justify left))
    )
    (property "Footprint" "" (id 2) (at 71.12 55.88 0)
      (effects (font (size 1.27 1.27)) hide)
    )
    (property "Datasheet" "" (id 3) (at 71.12 55.88 0)
      (effects (font (size 1.27 1.27)) hide)
    )
    (pin "1" (uuid 5f2c4c7a-de4c-4cc2-9266-4e73d1ce639c))
  )

  (sheet_instances
    (path "/" (page "1"))
  )

  (symbol_instances
    (path "/06609529-37c2-4f15-9d3a-3134c2cf2bf7"
      (reference "#PWR?") (unit 1) (value "+3.3V") (footprint "")
    )
    (path "/18ad62b4-c58f-482f-89de-8d28ef69a0d6"
      (reference "#PWR?") (unit 1) (value "GND") (footprint "")
    )
    (path "/282408af-fa4a-4347-9fb0-af7ff2142021"
      (reference "#PWR?") (unit 1) (value "GND") (footprint "")
    )
    (path "/5028d5b0-9991-4fbb-8e8a-0b653ff4c46d"
      (reference "#PWR?") (unit 1) (value "GND") (footprint "")
    )
    (path "/592198f0-5441-4a94-94dd-8db6be34778f"
      (reference "#PWR?") (unit 1) (value "+3.3V") (footprint "")
    )
    (path "/9a4c9a5f-87c8-49ae-b098-13878a8eed63"
      (reference "#PWR?") (unit 1) (value "GND") (footprint "")
    )
    (path "/ba76563e-431d-4d01-ba99-691ccb3336aa"
      (reference "#PWR?") (unit 1) (value "GND") (footprint "")
    )
    (path "/c09549c2-3b0a-4baa-b212-28b870199e62"
      (reference "#PWR?") (unit 1) (value "+3.3V") (footprint "")
    )
    (path "/eb33e5bc-9e75-4e55-b1a4-8ec876ac1666"
      (reference "#PWR?") (unit 1) (value "GND") (footprint "")
    )
    (path "/f8443d51-96f5-4986-b59d-d6efd5f9da44"
      (reference "#PWR?") (unit 1) (value "+3.3V") (footprint "")
    )
    (path "/febba6e6-7dd0-4c6d-8d72-846949d16977"
      (reference "#PWR?") (unit 1) (value "+3.3V") (footprint "")
    )
    (path "/0035b0ad-a6c3-4461-b953-c3d7ac268cac"
      (reference "C?") (unit 1) (value "100p") (footprint "")
    )
    (path "/4c4b86e3-3cd2-42ef-9573-d1fdd77bbc3c"
      (reference "C?") (unit 1) (value "100p") (footprint "")
    )
    (path "/c5a2fd6f-125a-4458-b9a4-a165d8866278"
      (reference "C?") (unit 1) (value "100p") (footprint "")
    )
    (path "/73593da1-3bcd-4ea7-ac6d-36b9373c8dd1"
      (reference "J?") (unit 1) (value "Conn_01x03_Male") (footprint "")
    )
    (path "/0775bcc7-bc1c-4039-849d-42b4c26c571b"
      (reference "R?") (unit 1) (value "100K") (footprint "")
    )
    (path "/42fff475-5c2a-4f1b-aa6f-d56c3190f3d2"
      (reference "R?") (unit 1) (value "10k") (footprint "")
    )
    (path "/733e512e-112d-41de-bb00-16e52cf2aaf3"
      (reference "R?") (unit 1) (value "220K") (footprint "")
    )
    (path "/74633458-8ec4-465a-baaf-18e4b4b6bddd"
      (reference "R?") (unit 1) (value "10k") (footprint "")
    )
    (path "/7f6d270f-f8c2-4f8a-9fcc-4f03fbafbc99"
      (reference "R?") (unit 1) (value "470") (footprint "")
    )
    (path "/894096a4-b9f2-4f09-a456-1b977849f880"
      (reference "R?") (unit 1) (value "10k") (footprint "")
    )
    (path "/9fb18281-7b63-4b3f-bafe-105a4cdaf18f"
      (reference "R?") (unit 1) (value "10k") (footprint "")
    )
    (path "/c192cfb0-3cbf-4419-af6e-0ccbfabcd8eb"
      (reference "R?") (unit 1) (value "10k") (footprint "")
    )
    (path "/4f82e30e-5d20-45c7-8de2-1a2a28b3f780"
      (reference "SW?") (unit 1) (value "SW_Push") (footprint "")
    )
    (path "/afbca636-16b9-4d88-a47e-7d60ee0661cd"
      (reference "SW?") (unit 1) (value "SW_Push") (footprint "")
    )
    (path "/cc21562f-128b-463a-9ed7-f94bb6c16791"
      (reference "U?") (unit 1) (value "ESP-12F") (footprint "")
    )
  )
)
