PCBNEW-LibModule-V1  2023-06-18 16:15:42
# encoding utf-8
Units mm
$INDEX
TBL00925404GY2GY
$EndINDEX
$MODULE TBL00925404GY2GY
Po 0 0 0 15 648f1f9e 00000000 ~~
Li TBL00925404GY2GY
Cd TBL009-254-04GY-2GY-2
Kw Connector
Sc 0
At STD
AR 
Op 0 0 0
T0 2.080 1.495 1.27 1.27 0 0.254 N V 21 N "J**"
T1 2.080 1.495 1.27 1.27 0 0.254 N I 21 N "TBL00925404GY2GY"
DS -3.2 9.52 8.46 9.52 0.2 24
DS 8.46 9.52 8.46 -6.53 0.2 24
DS 8.46 -6.53 -3.2 -6.53 0.2 24
DS -3.2 -6.53 -3.2 9.52 0.2 24
DS -3.2 -6.53 8.46 -6.53 0.1 21
DS 8.46 -6.53 8.46 -6.53 0.1 21
DS 8.46 -6.53 -3.2 -6.53 0.1 21
DS -3.2 -6.53 -3.2 -6.53 0.1 21
DS 8.46 -6.53 8.46 -6.53 0.1 21
DS 8.46 -6.53 8.46 -6.33 0.1 21
DS 8.46 -6.33 8.46 -6.33 0.1 21
DS 8.46 -6.33 8.46 -6.53 0.1 21
DS -3.2 -6.53 -3.2 -6.53 0.1 21
DS -3.2 -6.53 -3.2 9.52 0.1 21
DS -3.2 9.52 -3.2 9.52 0.1 21
DS -3.2 9.52 -3.2 -6.53 0.1 21
DS -3.2 9.52 8.46 9.52 0.1 21
DS 8.46 9.52 8.46 9.52 0.1 21
DS 8.46 9.52 -3.2 9.52 0.1 21
DS -3.2 9.52 -3.2 9.52 0.1 21
DS 8.46 9.52 8.46 9.52 0.1 21
DS 8.46 9.52 8.46 1.17 0.1 21
DS 8.46 1.17 8.46 1.17 0.1 21
DS 8.46 1.17 8.46 9.52 0.1 21
DS 8.46 -1.08 8.46 -1.08 0.1 21
DS 8.46 -1.08 8.46 -4.08 0.1 21
DS 8.46 -4.08 8.46 -4.08 0.1 21
DS 8.46 -4.08 8.46 -1.08 0.1 21
DS -5.3 -7.53 9.46 -7.53 0.1 24
DS 9.46 -7.53 9.46 10.52 0.1 24
DS 9.46 10.52 -5.3 10.52 0.1 24
DS -5.3 10.52 -5.3 -7.53 0.1 24
DS -4.3 -0 -4.3 -0 0.2 21
DS -4.2 -0 -4.2 -0 0.2 21
DS -4.3 -0 -4.3 -0 0.2 21
DA -4.25 -0 -4.300 -0 -1800 0.2 21
DA -4.25 -0 -4.200 -0 -1800 0.2 21
DA -4.25 -0 -4.300 -0 -1800 0.2 21
$PAD
Po 0.000 -0
Sh "1" C 1.500 1.500 0 0 900
Dr 1 0 0
At STD N 00E0FFFF
Ne 0 ""
$EndPAD
$PAD
Po 0.000 -5.08
Sh "2" C 1.500 1.500 0 0 900
Dr 1 0 0
At STD N 00E0FFFF
Ne 0 ""
$EndPAD
$PAD
Po 2.540 -0
Sh "3" C 1.500 1.500 0 0 900
Dr 1 0 0
At STD N 00E0FFFF
Ne 0 ""
$EndPAD
$PAD
Po 2.540 -5.08
Sh "4" C 1.500 1.500 0 0 900
Dr 1 0 0
At STD N 00E0FFFF
Ne 0 ""
$EndPAD
$PAD
Po 5.080 -0
Sh "5" C 1.500 1.500 0 0 900
Dr 1 0 0
At STD N 00E0FFFF
Ne 0 ""
$EndPAD
$PAD
Po 5.080 -5.08
Sh "6" C 1.500 1.500 0 0 900
Dr 1 0 0
At STD N 00E0FFFF
Ne 0 ""
$EndPAD
$PAD
Po 7.620 -0
Sh "7" C 1.500 1.500 0 0 900
Dr 1 0 0
At STD N 00E0FFFF
Ne 0 ""
$EndPAD
$PAD
Po 7.620 -5.08
Sh "8" C 1.500 1.500 0 0 900
Dr 1 0 0
At STD N 00E0FFFF
Ne 0 ""
$EndPAD
$EndMODULE TBL00925404GY2GY
$EndLIBRARY
