v 20130925 2
C 40000 40000 0 0 0 title-B.sym
C 44000 47600 1 180 1 ngspice-mosfet-with-diode-1.sym
{
T 44900 47100 5 10 0 0 180 6 1
device=subcir_mosfet
T 44900 47100 5 10 1 1 180 6 1
refdes=X1
T 44895 47405 5 10 1 1 180 6 1
model-name=FDT434P
}
C 42000 48600 1 0 0 spice-model-1.sym
{
T 42100 49300 5 10 0 1 0 0 1
device=model
T 42100 49200 5 10 1 1 0 0 1
refdes=A1
T 43300 48900 5 10 1 1 0 0 1
model-name=FDT434P
T 42500 48700 5 10 1 1 0 0 1
file=FDT434P.mod
}
C 44400 47800 1 0 0 vcc-1.sym
N 44600 47800 44600 47600 4
C 44900 45300 1 90 0 ng-resistor-1.sym
{
T 44500 45600 5 10 0 0 90 0 1
device=RESISTOR
T 44500 45500 5 10 1 1 90 0 1
refdes=Rload1
T 44900 45795 5 10 1 1 90 0 1
value=3.7
}
C 44500 43400 1 0 0 gnd-1.sym
C 42800 46800 1 0 0 ng-resistor-1.sym
{
T 43100 47200 5 10 0 0 0 0 1
device=RESISTOR
T 43000 47200 5 10 1 1 0 0 1
refdes=R2
T 43295 46800 5 10 1 1 0 0 1
value=1k
}
N 43700 47100 44000 47100 4
C 41600 45200 1 0 0 vdc-ng.sym
{
T 42300 45850 5 10 1 1 0 0 1
refdes=Vg1
T 42300 46050 5 10 0 0 0 0 1
device=VOLTAGE_SOURCE
T 42300 46250 5 10 0 0 0 0 1
footprint=none
T 42300 45650 5 10 1 1 0 0 1
value=0V
}
C 41800 44700 1 0 0 gnd-1.sym
N 41900 45000 41900 45200 4
N 41900 46400 41900 47100 4
N 41900 47100 42800 47100 4
C 44800 46300 1 0 0 output-ng.sym
{
T 44900 46600 5 10 0 0 0 0 1
device=OUTPUT
T 44995 46600 5 10 1 1 0 0 1
net=out:1
}
C 44300 43900 1 0 0 ammeter-ng.sym
{
T 45000 44550 5 10 1 1 0 0 1
refdes=VAmp1
T 45000 44750 5 10 0 0 0 0 1
device=VOLTAGE_SOURCE
T 45000 44950 5 10 0 0 0 0 1
footprint=none
T 45000 44350 5 10 0 2 0 0 1
value=DC 0V
}
N 44600 43900 44600 43700 4
N 44600 45300 44600 45100 4
N 44600 46600 44600 46200 4
N 44800 46400 44600 46400 4
C 46700 46500 1 0 0 vdc-ng.sym
{
T 47400 47150 5 10 1 1 0 0 1
refdes=Vs1
T 47400 47350 5 10 0 0 0 0 1
device=VOLTAGE_SOURCE
T 47400 47550 5 10 0 0 0 0 1
footprint=none
T 47400 46950 5 10 1 1 0 0 1
value=DC 3.3V
}
C 46900 46000 1 0 0 gnd-1.sym
N 47000 46300 47000 46500 4
C 46800 47900 1 0 0 vcc-1.sym
N 47000 47900 47000 47700 4
C 48800 46400 1 0 0 vdc-ng.sym
{
T 49500 47050 5 10 1 1 0 0 1
refdes=Vtemp
T 49500 47250 5 10 0 0 0 0 1
device=VOLTAGE_SOURCE
T 49500 47450 5 10 0 0 0 0 1
footprint=none
T 49500 46850 5 10 1 1 0 0 1
value=DC 25V
}
C 49000 45900 1 0 0 gnd-1.sym
N 49100 46200 49100 46400 4
C 49400 47700 1 0 0 ng-resistor-1.sym
{
T 49700 48100 5 10 0 0 0 0 1
device=RESISTOR
T 49600 48100 5 10 1 1 0 0 1
refdes=Rtemp
T 49895 47700 5 10 1 1 0 0 1
value=100k
}
C 50400 47500 1 0 0 gnd-1.sym
N 49100 47600 49100 48500 4
N 49100 48000 49400 48000 4
N 50300 48000 50500 48000 4
N 50500 48000 50500 47800 4
C 49300 48400 1 0 0 output-ng.sym
{
T 49400 48700 5 10 0 0 0 0 1
device=OUTPUT
T 49495 48700 5 10 1 1 0 0 1
net=temp:1
}
N 49300 48500 49100 48500 4
T 50200 46600 9 7 1 0 0 0 5
La fuente Temp
es agregada para la simulación del mosfet
canal P el cual requiere ese parámetro
para su simulacion.
25V es equivalente a 25ºC
T 45000 45200 9 7 1 0 0 0 6
Rload1 es equivalente al LDO
MCP1826 donde vin=Vdrop+vout@1A
Vdrop=4mV
Vout=3.3V
Vin=3.7V@1A
Rload1 = 3.7/1A = 3.7Ohms
