v 20130925 2
C 40000 40000 0 0 0 title-B.sym
C 46800 43400 1 180 0 npn-ng.sym
{
T 46200 42900 5 10 0 0 180 0 1
device=NPN_TRANSISTOR
T 46200 42900 5 10 1 1 180 0 1
refdes=Q?
T 46205 43105 5 10 1 1 180 0 1
model-name=SS8050
}
C 43200 49100 1 0 0 spice-model-1.sym
{
T 43300 49800 5 10 0 1 0 0 1
device=model
T 43300 49700 5 10 1 1 0 0 1
refdes=A1
T 44500 49400 5 10 1 1 0 0 1
model-name=SS8050
T 43700 49200 5 10 1 1 0 0 1
file=local-lib/SS8050.lib
}
C 47000 42600 1 0 0 ng-resistor-1.sym
{
T 47300 43000 5 10 0 0 0 0 1
device=RESISTOR
T 47200 43000 5 10 1 1 0 0 1
refdes=R1
T 47495 42600 5 10 1 1 0 0 1
value=12k
}
N 47000 42900 46800 42900 4
C 46800 44000 1 0 1 npn-ng.sym
{
T 46200 44500 5 10 0 0 0 6 1
device=NPN_TRANSISTOR
T 46200 44500 5 10 1 1 0 6 1
refdes=Q?
T 46205 44295 5 10 1 1 0 6 1
model-name=SS8050
}
C 47000 44200 1 0 0 ng-resistor-1.sym
{
T 47300 44600 5 10 0 0 0 0 1
device=RESISTOR
T 47200 44600 5 10 1 1 0 0 1
refdes=R2
T 47495 44200 5 10 1 1 0 0 1
value=12k
}
N 47000 44500 46800 44500 4
N 46300 43400 46300 43600 4
N 46300 43600 48100 43600 4
N 47900 44500 48100 44500 4
N 48100 43600 48100 44500 4
N 46300 44000 46300 43800 4
N 46300 43800 48300 43800 4
N 48300 43800 48300 42900 4
N 48300 42900 47900 42900 4
C 44000 46200 1 90 0 ng-resistor-1.sym
{
T 43600 46500 5 10 0 0 90 0 1
device=RESISTOR
T 43600 46400 5 10 1 1 90 0 1
refdes=R?
T 44000 46695 5 10 1 1 90 0 1
value=12k
}
C 43500 47500 1 0 0 3.3V-plus-1.sym
C 45000 46100 1 90 0 ng-resistor-1.sym
{
T 44600 46400 5 10 0 0 90 0 1
device=RESISTOR
T 44600 46300 5 10 1 1 90 0 1
refdes=R?
T 45000 46595 5 10 1 1 90 0 1
value=12k
}
