/home/johnny/projects/luna/PCBs/luna/PCBs/luna-esp8266/luna-esp8266-v1/datasheets
date,command,observations
Sat 21 Dec 2019 11:31:39 AM -05,diseno chino tp4056,https://github.com/corecode/kicad-libs/blob/master/tp4056.lib
