(kicad_sch (version 20230121) (generator eeschema)

  (uuid 69878c9a-ea45-467c-8bfb-4a474053608c)

  (paper "A4")

  (lib_symbols
    (symbol "Device:C" (pin_numbers hide) (pin_names (offset 0.254)) (in_bom yes) (on_board yes)
      (property "Reference" "C" (at 0.635 2.54 0)
        (effects (font (size 1.27 1.27)) (justify left))
      )
      (property "Value" "C" (at 0.635 -2.54 0)
        (effects (font (size 1.27 1.27)) (justify left))
      )
      (property "Footprint" "" (at 0.9652 -3.81 0)
        (effects (font (size 1.27 1.27)) hide)
      )
      (property "Datasheet" "~" (at 0 0 0)
        (effects (font (size 1.27 1.27)) hide)
      )
      (property "ki_keywords" "cap capacitor" (at 0 0 0)
        (effects (font (size 1.27 1.27)) hide)
      )
      (property "ki_description" "Unpolarized capacitor" (at 0 0 0)
        (effects (font (size 1.27 1.27)) hide)
      )
      (property "ki_fp_filters" "C_*" (at 0 0 0)
        (effects (font (size 1.27 1.27)) hide)
      )
      (symbol "C_0_1"
        (polyline
          (pts
            (xy -2.032 -0.762)
            (xy 2.032 -0.762)
          )
          (stroke (width 0.508) (type default))
          (fill (type none))
        )
        (polyline
          (pts
            (xy -2.032 0.762)
            (xy 2.032 0.762)
          )
          (stroke (width 0.508) (type default))
          (fill (type none))
        )
      )
      (symbol "C_1_1"
        (pin passive line (at 0 3.81 270) (length 2.794)
          (name "~" (effects (font (size 1.27 1.27))))
          (number "1" (effects (font (size 1.27 1.27))))
        )
        (pin passive line (at 0 -3.81 90) (length 2.794)
          (name "~" (effects (font (size 1.27 1.27))))
          (number "2" (effects (font (size 1.27 1.27))))
        )
      )
    )
    (symbol "Device:R" (pin_numbers hide) (pin_names (offset 0)) (in_bom yes) (on_board yes)
      (property "Reference" "R" (at 2.032 0 90)
        (effects (font (size 1.27 1.27)))
      )
      (property "Value" "R" (at 0 0 90)
        (effects (font (size 1.27 1.27)))
      )
      (property "Footprint" "" (at -1.778 0 90)
        (effects (font (size 1.27 1.27)) hide)
      )
      (property "Datasheet" "~" (at 0 0 0)
        (effects (font (size 1.27 1.27)) hide)
      )
      (property "ki_keywords" "R res resistor" (at 0 0 0)
        (effects (font (size 1.27 1.27)) hide)
      )
      (property "ki_description" "Resistor" (at 0 0 0)
        (effects (font (size 1.27 1.27)) hide)
      )
      (property "ki_fp_filters" "R_*" (at 0 0 0)
        (effects (font (size 1.27 1.27)) hide)
      )
      (symbol "R_0_1"
        (rectangle (start -1.016 -2.54) (end 1.016 2.54)
          (stroke (width 0.254) (type default))
          (fill (type none))
        )
      )
      (symbol "R_1_1"
        (pin passive line (at 0 3.81 270) (length 1.27)
          (name "~" (effects (font (size 1.27 1.27))))
          (number "1" (effects (font (size 1.27 1.27))))
        )
        (pin passive line (at 0 -3.81 90) (length 1.27)
          (name "~" (effects (font (size 1.27 1.27))))
          (number "2" (effects (font (size 1.27 1.27))))
        )
      )
    )
    (symbol "Device:Speaker" (pin_names (offset 0) hide) (in_bom yes) (on_board yes)
      (property "Reference" "LS" (at 1.27 5.715 0)
        (effects (font (size 1.27 1.27)) (justify right))
      )
      (property "Value" "Speaker" (at 1.27 3.81 0)
        (effects (font (size 1.27 1.27)) (justify right))
      )
      (property "Footprint" "" (at 0 -5.08 0)
        (effects (font (size 1.27 1.27)) hide)
      )
      (property "Datasheet" "~" (at -0.254 -1.27 0)
        (effects (font (size 1.27 1.27)) hide)
      )
      (property "ki_keywords" "speaker sound" (at 0 0 0)
        (effects (font (size 1.27 1.27)) hide)
      )
      (property "ki_description" "Speaker" (at 0 0 0)
        (effects (font (size 1.27 1.27)) hide)
      )
      (symbol "Speaker_0_0"
        (rectangle (start -2.54 1.27) (end 1.016 -3.81)
          (stroke (width 0.254) (type default))
          (fill (type none))
        )
        (polyline
          (pts
            (xy 1.016 1.27)
            (xy 3.556 3.81)
            (xy 3.556 -6.35)
            (xy 1.016 -3.81)
          )
          (stroke (width 0.254) (type default))
          (fill (type none))
        )
      )
      (symbol "Speaker_1_1"
        (pin input line (at -5.08 0 0) (length 2.54)
          (name "1" (effects (font (size 1.27 1.27))))
          (number "1" (effects (font (size 1.27 1.27))))
        )
        (pin input line (at -5.08 -2.54 0) (length 2.54)
          (name "2" (effects (font (size 1.27 1.27))))
          (number "2" (effects (font (size 1.27 1.27))))
        )
      )
    )
    (symbol "hxj8002:hxj8002" (pin_names (offset 1.016)) (in_bom yes) (on_board yes)
      (property "Reference" "U" (at 0 10.16 0)
        (effects (font (size 1.27 1.27)))
      )
      (property "Value" "hxj8002" (at 0 7.62 0)
        (effects (font (size 1.27 1.27)))
      )
      (property "Footprint" "" (at 2.54 2.54 0)
        (effects (font (size 1.27 1.27)) hide)
      )
      (property "Datasheet" "" (at 2.54 2.54 0)
        (effects (font (size 1.27 1.27)) hide)
      )
      (symbol "hxj8002_0_1"
        (rectangle (start -8.89 6.35) (end 8.89 -6.35)
          (stroke (width 0) (type solid))
          (fill (type none))
        )
      )
      (symbol "hxj8002_1_1"
        (pin passive line (at -11.43 -3.81 0) (length 2.54)
          (name "SHUTDOWN" (effects (font (size 1.27 1.27))))
          (number "1" (effects (font (size 1.27 1.27))))
        )
        (pin passive line (at -11.43 1.27 0) (length 2.54)
          (name "BYPASS" (effects (font (size 1.27 1.27))))
          (number "2" (effects (font (size 1.27 1.27))))
        )
        (pin passive line (at -11.43 -1.27 0) (length 2.54)
          (name "+IN" (effects (font (size 1.27 1.27))))
          (number "3" (effects (font (size 1.27 1.27))))
        )
        (pin passive line (at -11.43 3.81 0) (length 2.54)
          (name "-IN" (effects (font (size 1.27 1.27))))
          (number "4" (effects (font (size 1.27 1.27))))
        )
        (pin passive line (at 11.43 -1.27 180) (length 2.54)
          (name "VO1" (effects (font (size 1.27 1.27))))
          (number "5" (effects (font (size 1.27 1.27))))
        )
        (pin passive line (at 11.43 3.81 180) (length 2.54)
          (name "VDD" (effects (font (size 1.27 1.27))))
          (number "6" (effects (font (size 1.27 1.27))))
        )
        (pin passive line (at 11.43 -3.81 180) (length 2.54)
          (name "GND" (effects (font (size 1.27 1.27))))
          (number "7" (effects (font (size 1.27 1.27))))
        )
        (pin passive line (at 11.43 1.27 180) (length 2.54)
          (name "VO2" (effects (font (size 1.27 1.27))))
          (number "8" (effects (font (size 1.27 1.27))))
        )
      )
    )
  )

  (junction (at 123.19 91.44) (diameter 0) (color 0 0 0 0)
    (uuid 0f2a9f65-633b-4edc-8a4c-690e3977c3c4)
  )
  (junction (at 119.38 96.52) (diameter 0) (color 0 0 0 0)
    (uuid 11317f82-827e-4322-8ce2-7e551249920b)
  )
  (junction (at 157.48 96.52) (diameter 0) (color 0 0 0 0)
    (uuid 2ae67348-18cc-4fe8-b435-d24093099607)
  )
  (junction (at 119.38 109.22) (diameter 0) (color 0 0 0 0)
    (uuid 3b24fbc1-71b1-4b63-8200-cc6cfbd64329)
  )
  (junction (at 154.94 109.22) (diameter 0) (color 0 0 0 0)
    (uuid 97b0c89f-acb9-4e37-b52d-3e2b63cb109f)
  )
  (junction (at 154.94 73.66) (diameter 0) (color 0 0 0 0)
    (uuid f13e44ba-3983-43d8-a642-25821dce2445)
  )
  (junction (at 127 109.22) (diameter 0) (color 0 0 0 0)
    (uuid f32f6e89-5fc5-4415-b211-a3be75d2a1fe)
  )

  (wire (pts (xy 106.68 91.44) (xy 109.22 91.44))
    (stroke (width 0) (type default))
    (uuid 00c41fdd-ed15-4fe1-bc14-51572f99d0df)
  )
  (wire (pts (xy 127 99.06) (xy 129.54 99.06))
    (stroke (width 0) (type default))
    (uuid 029a70ef-677a-437c-a91f-0b4d684ce3d4)
  )
  (wire (pts (xy 144.78 81.28) (xy 157.48 81.28))
    (stroke (width 0) (type default))
    (uuid 1572c57b-23bd-47f6-b88c-69f5a980a680)
  )
  (wire (pts (xy 157.48 81.28) (xy 157.48 96.52))
    (stroke (width 0) (type default))
    (uuid 1e1548d3-712d-48cc-9a5e-43b24189947d)
  )
  (wire (pts (xy 154.94 91.44) (xy 152.4 91.44))
    (stroke (width 0) (type default))
    (uuid 22f4dd6c-5ff6-4d65-9799-bd1397c522f9)
  )
  (wire (pts (xy 123.19 91.44) (xy 129.54 91.44))
    (stroke (width 0) (type default))
    (uuid 28f54d99-e290-4586-8097-bab912dcc879)
  )
  (wire (pts (xy 119.38 93.98) (xy 129.54 93.98))
    (stroke (width 0) (type default))
    (uuid 2a958331-a0a2-49b1-b15c-90ea5c7a171a)
  )
  (wire (pts (xy 119.38 106.68) (xy 119.38 109.22))
    (stroke (width 0) (type default))
    (uuid 2dd623d5-e0cf-430e-8c2c-701c7acb1d46)
  )
  (wire (pts (xy 185.42 73.66) (xy 185.42 87.63))
    (stroke (width 0) (type default))
    (uuid 302d7537-9bd0-4bbb-818e-572a2d2bc7b0)
  )
  (wire (pts (xy 119.38 96.52) (xy 119.38 93.98))
    (stroke (width 0) (type default))
    (uuid 575faea9-68b3-47d2-b53c-fcf16c791296)
  )
  (wire (pts (xy 119.38 109.22) (xy 127 109.22))
    (stroke (width 0) (type default))
    (uuid 58b068e6-6e7b-4e4f-a22b-b3fe5ccf223f)
  )
  (wire (pts (xy 116.84 91.44) (xy 123.19 91.44))
    (stroke (width 0) (type default))
    (uuid 64c520f2-9ef2-430d-8fd4-909f24233dc2)
  )
  (wire (pts (xy 127 109.22) (xy 127 99.06))
    (stroke (width 0) (type default))
    (uuid 70c140c6-c80a-4e7c-a8b7-5ff3ae2a0fa1)
  )
  (wire (pts (xy 152.4 96.52) (xy 157.48 96.52))
    (stroke (width 0) (type default))
    (uuid 87685820-efb6-4495-9008-84419502e250)
  )
  (wire (pts (xy 154.94 73.66) (xy 154.94 91.44))
    (stroke (width 0) (type default))
    (uuid 87bea348-d205-4460-b029-51e835f43be3)
  )
  (wire (pts (xy 154.94 99.06) (xy 152.4 99.06))
    (stroke (width 0) (type default))
    (uuid b03798ae-f1cd-47af-875c-3b366a94c86b)
  )
  (wire (pts (xy 96.52 73.66) (xy 154.94 73.66))
    (stroke (width 0) (type default))
    (uuid b3e136e2-fe24-4145-937f-4b67849e698b)
  )
  (wire (pts (xy 119.38 99.06) (xy 119.38 96.52))
    (stroke (width 0) (type default))
    (uuid b73076ac-457b-4044-a22e-194406a1874a)
  )
  (wire (pts (xy 185.42 109.22) (xy 154.94 109.22))
    (stroke (width 0) (type default))
    (uuid bc2d3fca-abb8-4b44-9d4b-b6ff361c5caf)
  )
  (wire (pts (xy 154.94 109.22) (xy 154.94 99.06))
    (stroke (width 0) (type default))
    (uuid bc6bb58d-bf50-495f-a9be-a4a49ba17e67)
  )
  (wire (pts (xy 123.19 81.28) (xy 123.19 91.44))
    (stroke (width 0) (type default))
    (uuid bca9aee7-a622-4156-9829-851fbf1343e6)
  )
  (wire (pts (xy 162.56 93.98) (xy 152.4 93.98))
    (stroke (width 0) (type default))
    (uuid cd1f9b03-0ff1-490c-9b9b-2aa90931016b)
  )
  (wire (pts (xy 96.52 109.22) (xy 119.38 109.22))
    (stroke (width 0) (type default))
    (uuid d29296d5-8a0c-46b0-a4cd-55ee23a02f52)
  )
  (wire (pts (xy 137.16 81.28) (xy 123.19 81.28))
    (stroke (width 0) (type default))
    (uuid d67f33b4-8c05-4405-b347-bb523d2bc9fc)
  )
  (wire (pts (xy 185.42 95.25) (xy 185.42 109.22))
    (stroke (width 0) (type default))
    (uuid d81be6d1-f069-43c9-879f-004ac50171e2)
  )
  (wire (pts (xy 154.94 73.66) (xy 185.42 73.66))
    (stroke (width 0) (type default))
    (uuid da1d93c7-3b77-4241-980d-4915c369e397)
  )
  (wire (pts (xy 127 109.22) (xy 154.94 109.22))
    (stroke (width 0) (type default))
    (uuid eb5fa02a-d778-44a7-92a0-eea5dff1ca25)
  )
  (wire (pts (xy 119.38 96.52) (xy 129.54 96.52))
    (stroke (width 0) (type default))
    (uuid f2fbf8da-2487-4513-adda-f4e2673f25ad)
  )
  (wire (pts (xy 99.06 91.44) (xy 96.52 91.44))
    (stroke (width 0) (type default))
    (uuid fa4df7a6-363c-4c0f-9fa1-9ce1ead7ce4f)
  )
  (wire (pts (xy 157.48 96.52) (xy 162.56 96.52))
    (stroke (width 0) (type default))
    (uuid ffe6dd2c-1fb7-4bb5-9e69-cd11377ebd8c)
  )

  (text "Debe quedar\njunto al circuito\nintegrado" (at 180.34 86.36 0)
    (effects (font (size 1.27 1.27)) (justify left bottom))
    (uuid 67482b2f-ea88-4bfc-b11c-bf5c9e704384)
  )
  (text "Debe quedar\njunto al circuito\nintegrado" (at 100.33 105.41 0)
    (effects (font (size 1.27 1.27)) (justify left bottom))
    (uuid aab7ebc4-5786-4ebf-b58e-0645d88d414a)
  )

  (hierarchical_label "GND" (shape input) (at 96.52 109.22 180)
    (effects (font (size 1.27 1.27)) (justify right))
    (uuid 70fb306e-8f61-4c43-a43b-9c2a0e119361)
  )
  (hierarchical_label "IN" (shape input) (at 96.52 91.44 180)
    (effects (font (size 1.27 1.27)) (justify right))
    (uuid aa96355d-6fbf-41a6-921f-213cfdd72c0f)
  )
  (hierarchical_label "VCC" (shape input) (at 96.52 73.66 180)
    (effects (font (size 1.27 1.27)) (justify right))
    (uuid ea92ea3c-62a3-4c43-ab24-a8b7cd8147e0)
  )

  (symbol (lib_id "hxj8002:hxj8002") (at 140.97 95.25 0) (unit 1)
    (in_bom yes) (on_board yes) (dnp no)
    (uuid 00000000-0000-0000-0000-00005eb22cce)
    (property "Reference" "U1" (at 140.97 84.709 0)
      (effects (font (size 1.27 1.27)))
    )
    (property "Value" "hxj8002" (at 140.97 87.0204 0)
      (effects (font (size 1.27 1.27)))
    )
    (property "Footprint" "" (at 143.51 92.71 0)
      (effects (font (size 1.27 1.27)) hide)
    )
    (property "Datasheet" "" (at 143.51 92.71 0)
      (effects (font (size 1.27 1.27)) hide)
    )
    (pin "1" (uuid f28b8076-e67b-4fec-a925-453f81994a37))
    (pin "2" (uuid b37026f3-1eb0-434c-8601-d560f21381dc))
    (pin "3" (uuid cd48182b-2d0a-4e3e-a86d-6975fb551ac5))
    (pin "4" (uuid 181744a1-3d95-4deb-9e6f-d5b5654f1da6))
    (pin "5" (uuid ebbaf0e0-0071-470b-a6e3-e6cfa8a7e403))
    (pin "6" (uuid 59cba6bb-97ff-49e9-adbc-5e795609c477))
    (pin "7" (uuid b3874c84-854b-42cd-b088-008397ffd009))
    (pin "8" (uuid 73bf514f-2fb9-4b17-9b4b-42a650ad5d58))
    (instances
      (project "speaker mono"
        (path "/69878c9a-ea45-467c-8bfb-4a474053608c"
          (reference "U1") (unit 1)
        )
      )
    )
  )

  (symbol (lib_id "Device:C") (at 119.38 102.87 0) (unit 1)
    (in_bom yes) (on_board yes) (dnp no)
    (uuid 00000000-0000-0000-0000-00005eb23205)
    (property "Reference" "C1" (at 122.301 101.7016 0)
      (effects (font (size 1.27 1.27)) (justify left))
    )
    (property "Value" "1u" (at 122.301 104.013 0)
      (effects (font (size 1.27 1.27)) (justify left))
    )
    (property "Footprint" "" (at 120.3452 106.68 0)
      (effects (font (size 1.27 1.27)) hide)
    )
    (property "Datasheet" "~" (at 119.38 102.87 0)
      (effects (font (size 1.27 1.27)) hide)
    )
    (pin "1" (uuid 826417da-7082-4aa1-9f31-d5b9b0e1e8e5))
    (pin "2" (uuid f2dabe6d-0dd0-4fec-bac9-641eed6a5844))
    (instances
      (project "speaker mono"
        (path "/69878c9a-ea45-467c-8bfb-4a474053608c"
          (reference "C1") (unit 1)
        )
      )
    )
  )

  (symbol (lib_id "Device:C") (at 113.03 91.44 270) (unit 1)
    (in_bom yes) (on_board yes) (dnp no)
    (uuid 00000000-0000-0000-0000-00005eb255b3)
    (property "Reference" "C3" (at 113.03 85.0392 90)
      (effects (font (size 1.27 1.27)))
    )
    (property "Value" "0.1u" (at 113.03 87.3506 90)
      (effects (font (size 1.27 1.27)))
    )
    (property "Footprint" "" (at 109.22 92.4052 0)
      (effects (font (size 1.27 1.27)) hide)
    )
    (property "Datasheet" "~" (at 113.03 91.44 0)
      (effects (font (size 1.27 1.27)) hide)
    )
    (pin "1" (uuid 6044913e-57a0-4789-9c68-cceb290dafc7))
    (pin "2" (uuid facf3575-9680-4505-aa51-77773c187281))
    (instances
      (project "speaker mono"
        (path "/69878c9a-ea45-467c-8bfb-4a474053608c"
          (reference "C3") (unit 1)
        )
      )
    )
  )

  (symbol (lib_id "Device:R") (at 140.97 81.28 270) (unit 1)
    (in_bom yes) (on_board yes) (dnp no)
    (uuid 00000000-0000-0000-0000-00005eb2645e)
    (property "Reference" "R5" (at 140.97 76.0222 90)
      (effects (font (size 1.27 1.27)))
    )
    (property "Value" "22k" (at 140.97 78.3336 90)
      (effects (font (size 1.27 1.27)))
    )
    (property "Footprint" "" (at 140.97 79.502 90)
      (effects (font (size 1.27 1.27)) hide)
    )
    (property "Datasheet" "~" (at 140.97 81.28 0)
      (effects (font (size 1.27 1.27)) hide)
    )
    (pin "1" (uuid b50285a9-45cc-488b-a144-4b476cf6533d))
    (pin "2" (uuid 2ab880b8-5b7c-445a-ac34-2da2b3de0171))
    (instances
      (project "speaker mono"
        (path "/69878c9a-ea45-467c-8bfb-4a474053608c"
          (reference "R5") (unit 1)
        )
      )
    )
  )

  (symbol (lib_id "Device:Speaker") (at 167.64 93.98 0) (unit 1)
    (in_bom yes) (on_board yes) (dnp no)
    (uuid 00000000-0000-0000-0000-00005eb27763)
    (property "Reference" "LS1" (at 171.958 94.0816 0)
      (effects (font (size 1.27 1.27)) (justify left))
    )
    (property "Value" "Speaker" (at 171.958 96.393 0)
      (effects (font (size 1.27 1.27)) (justify left))
    )
    (property "Footprint" "" (at 167.64 99.06 0)
      (effects (font (size 1.27 1.27)) hide)
    )
    (property "Datasheet" "~" (at 167.386 95.25 0)
      (effects (font (size 1.27 1.27)) hide)
    )
    (pin "1" (uuid b280846e-9054-46ac-927c-8e1db2673bfe))
    (pin "2" (uuid 27e07bcb-bd35-46cf-b2f8-e95343ae5101))
    (instances
      (project "speaker mono"
        (path "/69878c9a-ea45-467c-8bfb-4a474053608c"
          (reference "LS1") (unit 1)
        )
      )
    )
  )

  (symbol (lib_id "Device:C") (at 185.42 91.44 0) (unit 1)
    (in_bom yes) (on_board yes) (dnp no)
    (uuid 00000000-0000-0000-0000-00005eb29a4e)
    (property "Reference" "C2" (at 188.341 90.2716 0)
      (effects (font (size 1.27 1.27)) (justify left))
    )
    (property "Value" "0.1u" (at 188.341 92.583 0)
      (effects (font (size 1.27 1.27)) (justify left))
    )
    (property "Footprint" "" (at 186.3852 95.25 0)
      (effects (font (size 1.27 1.27)) hide)
    )
    (property "Datasheet" "~" (at 185.42 91.44 0)
      (effects (font (size 1.27 1.27)) hide)
    )
    (pin "1" (uuid 2ccdf386-6395-4cf1-97fd-c38a7fe5a287))
    (pin "2" (uuid 05f16eff-0b1b-44cb-96c5-ce9622337201))
    (instances
      (project "speaker mono"
        (path "/69878c9a-ea45-467c-8bfb-4a474053608c"
          (reference "C2") (unit 1)
        )
      )
    )
  )

  (symbol (lib_id "Device:R") (at 102.87 91.44 270) (unit 1)
    (in_bom yes) (on_board yes) (dnp no)
    (uuid 00000000-0000-0000-0000-00005eb31016)
    (property "Reference" "R2" (at 102.87 86.1822 90)
      (effects (font (size 1.27 1.27)))
    )
    (property "Value" "10k" (at 102.87 88.4936 90)
      (effects (font (size 1.27 1.27)))
    )
    (property "Footprint" "" (at 102.87 89.662 90)
      (effects (font (size 1.27 1.27)) hide)
    )
    (property "Datasheet" "~" (at 102.87 91.44 0)
      (effects (font (size 1.27 1.27)) hide)
    )
    (pin "1" (uuid 23db28e1-f88e-4060-9f1e-f0079a0a294b))
    (pin "2" (uuid 0541822f-529a-454d-ae94-c1761fb1ee1a))
    (instances
      (project "speaker mono"
        (path "/69878c9a-ea45-467c-8bfb-4a474053608c"
          (reference "R2") (unit 1)
        )
      )
    )
  )

  (sheet_instances
    (path "/" (page "1"))
  )
)
