(kicad_sch (version 20230121) (generator eeschema)

  (uuid d68cd6cf-6ee3-4483-a307-0498258d66c2)

  (paper "A4")

  (lib_symbols
    (symbol "Connector:Conn_01x01_Male" (pin_names (offset 1.016) hide) (in_bom yes) (on_board yes)
      (property "Reference" "J" (at 0 2.54 0)
        (effects (font (size 1.27 1.27)))
      )
      (property "Value" "Conn_01x01_Male" (at 0 -2.54 0)
        (effects (font (size 1.27 1.27)))
      )
      (property "Footprint" "" (at 0 0 0)
        (effects (font (size 1.27 1.27)) hide)
      )
      (property "Datasheet" "~" (at 0 0 0)
        (effects (font (size 1.27 1.27)) hide)
      )
      (property "ki_keywords" "connector" (at 0 0 0)
        (effects (font (size 1.27 1.27)) hide)
      )
      (property "ki_description" "Generic connector, single row, 01x01, script generated (kicad-library-utils/schlib/autogen/connector/)" (at 0 0 0)
        (effects (font (size 1.27 1.27)) hide)
      )
      (property "ki_fp_filters" "Connector*:*" (at 0 0 0)
        (effects (font (size 1.27 1.27)) hide)
      )
      (symbol "Conn_01x01_Male_1_1"
        (polyline
          (pts
            (xy 1.27 0)
            (xy 0.8636 0)
          )
          (stroke (width 0.1524) (type default))
          (fill (type none))
        )
        (rectangle (start 0.8636 0.127) (end 0 -0.127)
          (stroke (width 0.1524) (type default))
          (fill (type outline))
        )
        (pin passive line (at 5.08 0 180) (length 3.81)
          (name "Pin_1" (effects (font (size 1.27 1.27))))
          (number "1" (effects (font (size 1.27 1.27))))
        )
      )
    )
    (symbol "Connector:Conn_01x12_Male" (pin_names (offset 1.016) hide) (in_bom yes) (on_board yes)
      (property "Reference" "J" (at 0 15.24 0)
        (effects (font (size 1.27 1.27)))
      )
      (property "Value" "Conn_01x12_Male" (at 0 -17.78 0)
        (effects (font (size 1.27 1.27)))
      )
      (property "Footprint" "" (at 0 0 0)
        (effects (font (size 1.27 1.27)) hide)
      )
      (property "Datasheet" "~" (at 0 0 0)
        (effects (font (size 1.27 1.27)) hide)
      )
      (property "ki_keywords" "connector" (at 0 0 0)
        (effects (font (size 1.27 1.27)) hide)
      )
      (property "ki_description" "Generic connector, single row, 01x12, script generated (kicad-library-utils/schlib/autogen/connector/)" (at 0 0 0)
        (effects (font (size 1.27 1.27)) hide)
      )
      (property "ki_fp_filters" "Connector*:*_1x??_*" (at 0 0 0)
        (effects (font (size 1.27 1.27)) hide)
      )
      (symbol "Conn_01x12_Male_1_1"
        (polyline
          (pts
            (xy 1.27 -15.24)
            (xy 0.8636 -15.24)
          )
          (stroke (width 0.1524) (type default))
          (fill (type none))
        )
        (polyline
          (pts
            (xy 1.27 -12.7)
            (xy 0.8636 -12.7)
          )
          (stroke (width 0.1524) (type default))
          (fill (type none))
        )
        (polyline
          (pts
            (xy 1.27 -10.16)
            (xy 0.8636 -10.16)
          )
          (stroke (width 0.1524) (type default))
          (fill (type none))
        )
        (polyline
          (pts
            (xy 1.27 -7.62)
            (xy 0.8636 -7.62)
          )
          (stroke (width 0.1524) (type default))
          (fill (type none))
        )
        (polyline
          (pts
            (xy 1.27 -5.08)
            (xy 0.8636 -5.08)
          )
          (stroke (width 0.1524) (type default))
          (fill (type none))
        )
        (polyline
          (pts
            (xy 1.27 -2.54)
            (xy 0.8636 -2.54)
          )
          (stroke (width 0.1524) (type default))
          (fill (type none))
        )
        (polyline
          (pts
            (xy 1.27 0)
            (xy 0.8636 0)
          )
          (stroke (width 0.1524) (type default))
          (fill (type none))
        )
        (polyline
          (pts
            (xy 1.27 2.54)
            (xy 0.8636 2.54)
          )
          (stroke (width 0.1524) (type default))
          (fill (type none))
        )
        (polyline
          (pts
            (xy 1.27 5.08)
            (xy 0.8636 5.08)
          )
          (stroke (width 0.1524) (type default))
          (fill (type none))
        )
        (polyline
          (pts
            (xy 1.27 7.62)
            (xy 0.8636 7.62)
          )
          (stroke (width 0.1524) (type default))
          (fill (type none))
        )
        (polyline
          (pts
            (xy 1.27 10.16)
            (xy 0.8636 10.16)
          )
          (stroke (width 0.1524) (type default))
          (fill (type none))
        )
        (polyline
          (pts
            (xy 1.27 12.7)
            (xy 0.8636 12.7)
          )
          (stroke (width 0.1524) (type default))
          (fill (type none))
        )
        (rectangle (start 0.8636 -15.113) (end 0 -15.367)
          (stroke (width 0.1524) (type default))
          (fill (type outline))
        )
        (rectangle (start 0.8636 -12.573) (end 0 -12.827)
          (stroke (width 0.1524) (type default))
          (fill (type outline))
        )
        (rectangle (start 0.8636 -10.033) (end 0 -10.287)
          (stroke (width 0.1524) (type default))
          (fill (type outline))
        )
        (rectangle (start 0.8636 -7.493) (end 0 -7.747)
          (stroke (width 0.1524) (type default))
          (fill (type outline))
        )
        (rectangle (start 0.8636 -4.953) (end 0 -5.207)
          (stroke (width 0.1524) (type default))
          (fill (type outline))
        )
        (rectangle (start 0.8636 -2.413) (end 0 -2.667)
          (stroke (width 0.1524) (type default))
          (fill (type outline))
        )
        (rectangle (start 0.8636 0.127) (end 0 -0.127)
          (stroke (width 0.1524) (type default))
          (fill (type outline))
        )
        (rectangle (start 0.8636 2.667) (end 0 2.413)
          (stroke (width 0.1524) (type default))
          (fill (type outline))
        )
        (rectangle (start 0.8636 5.207) (end 0 4.953)
          (stroke (width 0.1524) (type default))
          (fill (type outline))
        )
        (rectangle (start 0.8636 7.747) (end 0 7.493)
          (stroke (width 0.1524) (type default))
          (fill (type outline))
        )
        (rectangle (start 0.8636 10.287) (end 0 10.033)
          (stroke (width 0.1524) (type default))
          (fill (type outline))
        )
        (rectangle (start 0.8636 12.827) (end 0 12.573)
          (stroke (width 0.1524) (type default))
          (fill (type outline))
        )
        (pin passive line (at 5.08 12.7 180) (length 3.81)
          (name "Pin_1" (effects (font (size 1.27 1.27))))
          (number "1" (effects (font (size 1.27 1.27))))
        )
        (pin passive line (at 5.08 -10.16 180) (length 3.81)
          (name "Pin_10" (effects (font (size 1.27 1.27))))
          (number "10" (effects (font (size 1.27 1.27))))
        )
        (pin passive line (at 5.08 -12.7 180) (length 3.81)
          (name "Pin_11" (effects (font (size 1.27 1.27))))
          (number "11" (effects (font (size 1.27 1.27))))
        )
        (pin passive line (at 5.08 -15.24 180) (length 3.81)
          (name "Pin_12" (effects (font (size 1.27 1.27))))
          (number "12" (effects (font (size 1.27 1.27))))
        )
        (pin passive line (at 5.08 10.16 180) (length 3.81)
          (name "Pin_2" (effects (font (size 1.27 1.27))))
          (number "2" (effects (font (size 1.27 1.27))))
        )
        (pin passive line (at 5.08 7.62 180) (length 3.81)
          (name "Pin_3" (effects (font (size 1.27 1.27))))
          (number "3" (effects (font (size 1.27 1.27))))
        )
        (pin passive line (at 5.08 5.08 180) (length 3.81)
          (name "Pin_4" (effects (font (size 1.27 1.27))))
          (number "4" (effects (font (size 1.27 1.27))))
        )
        (pin passive line (at 5.08 2.54 180) (length 3.81)
          (name "Pin_5" (effects (font (size 1.27 1.27))))
          (number "5" (effects (font (size 1.27 1.27))))
        )
        (pin passive line (at 5.08 0 180) (length 3.81)
          (name "Pin_6" (effects (font (size 1.27 1.27))))
          (number "6" (effects (font (size 1.27 1.27))))
        )
        (pin passive line (at 5.08 -2.54 180) (length 3.81)
          (name "Pin_7" (effects (font (size 1.27 1.27))))
          (number "7" (effects (font (size 1.27 1.27))))
        )
        (pin passive line (at 5.08 -5.08 180) (length 3.81)
          (name "Pin_8" (effects (font (size 1.27 1.27))))
          (number "8" (effects (font (size 1.27 1.27))))
        )
        (pin passive line (at 5.08 -7.62 180) (length 3.81)
          (name "Pin_9" (effects (font (size 1.27 1.27))))
          (number "9" (effects (font (size 1.27 1.27))))
        )
      )
    )
    (symbol "power:+5V" (power) (pin_names (offset 0)) (in_bom yes) (on_board yes)
      (property "Reference" "#PWR" (at 0 -3.81 0)
        (effects (font (size 1.27 1.27)) hide)
      )
      (property "Value" "+5V" (at 0 3.556 0)
        (effects (font (size 1.27 1.27)))
      )
      (property "Footprint" "" (at 0 0 0)
        (effects (font (size 1.27 1.27)) hide)
      )
      (property "Datasheet" "" (at 0 0 0)
        (effects (font (size 1.27 1.27)) hide)
      )
      (property "ki_keywords" "global power" (at 0 0 0)
        (effects (font (size 1.27 1.27)) hide)
      )
      (property "ki_description" "Power symbol creates a global label with name \"+5V\"" (at 0 0 0)
        (effects (font (size 1.27 1.27)) hide)
      )
      (symbol "+5V_0_1"
        (polyline
          (pts
            (xy -0.762 1.27)
            (xy 0 2.54)
          )
          (stroke (width 0) (type default))
          (fill (type none))
        )
        (polyline
          (pts
            (xy 0 0)
            (xy 0 2.54)
          )
          (stroke (width 0) (type default))
          (fill (type none))
        )
        (polyline
          (pts
            (xy 0 2.54)
            (xy 0.762 1.27)
          )
          (stroke (width 0) (type default))
          (fill (type none))
        )
      )
      (symbol "+5V_1_1"
        (pin power_in line (at 0 0 90) (length 0) hide
          (name "+5V" (effects (font (size 1.27 1.27))))
          (number "1" (effects (font (size 1.27 1.27))))
        )
      )
    )
    (symbol "power:GND" (power) (pin_names (offset 0)) (in_bom yes) (on_board yes)
      (property "Reference" "#PWR" (at 0 -6.35 0)
        (effects (font (size 1.27 1.27)) hide)
      )
      (property "Value" "GND" (at 0 -3.81 0)
        (effects (font (size 1.27 1.27)))
      )
      (property "Footprint" "" (at 0 0 0)
        (effects (font (size 1.27 1.27)) hide)
      )
      (property "Datasheet" "" (at 0 0 0)
        (effects (font (size 1.27 1.27)) hide)
      )
      (property "ki_keywords" "global power" (at 0 0 0)
        (effects (font (size 1.27 1.27)) hide)
      )
      (property "ki_description" "Power symbol creates a global label with name \"GND\" , ground" (at 0 0 0)
        (effects (font (size 1.27 1.27)) hide)
      )
      (symbol "GND_0_1"
        (polyline
          (pts
            (xy 0 0)
            (xy 0 -1.27)
            (xy 1.27 -1.27)
            (xy 0 -2.54)
            (xy -1.27 -1.27)
            (xy 0 -1.27)
          )
          (stroke (width 0) (type default))
          (fill (type none))
        )
      )
      (symbol "GND_1_1"
        (pin power_in line (at 0 0 270) (length 0) hide
          (name "GND" (effects (font (size 1.27 1.27))))
          (number "1" (effects (font (size 1.27 1.27))))
        )
      )
    )
  )

  (junction (at 161.29 147.32) (diameter 0) (color 0 0 0 0)
    (uuid 0b159b9f-dcaf-4a7e-bf4f-182588760054)
  )
  (junction (at 142.24 161.29) (diameter 0) (color 0 0 0 0)
    (uuid 24484180-afe5-4343-a1c7-a5ee94755482)
  )
  (junction (at 142.24 153.67) (diameter 0) (color 0 0 0 0)
    (uuid 29e857b1-0797-4866-a36c-c32c273b128a)
  )
  (junction (at 161.29 162.56) (diameter 0) (color 0 0 0 0)
    (uuid 33380615-f346-4f9b-a777-8e88c11ed20e)
  )
  (junction (at 142.24 140.97) (diameter 0) (color 0 0 0 0)
    (uuid 3e0290a0-8b19-412c-a49c-eeddc7752954)
  )
  (junction (at 161.29 157.48) (diameter 0) (color 0 0 0 0)
    (uuid 50b176a3-fdc7-4c15-835f-1f8ace86a32d)
  )
  (junction (at 161.29 152.4) (diameter 0) (color 0 0 0 0)
    (uuid 5da26423-1978-46ff-9402-5299d65f834a)
  )
  (junction (at 142.24 156.21) (diameter 0) (color 0 0 0 0)
    (uuid 5db3b375-4335-4a1f-8144-2330f9d31db1)
  )
  (junction (at 161.29 144.78) (diameter 0) (color 0 0 0 0)
    (uuid 788e9598-991e-46a9-86f4-f1337e6fe357)
  )
  (junction (at 161.29 142.24) (diameter 0) (color 0 0 0 0)
    (uuid 7cc65fa6-207e-409b-9127-292742f41372)
  )
  (junction (at 142.24 166.37) (diameter 0) (color 0 0 0 0)
    (uuid 94412130-a75a-468a-a627-29f0a323fd00)
  )
  (junction (at 161.29 160.02) (diameter 0) (color 0 0 0 0)
    (uuid a819daa3-5332-48a7-850f-9a6495ba221e)
  )
  (junction (at 142.24 151.13) (diameter 0) (color 0 0 0 0)
    (uuid ba14066e-4de5-41ac-b379-8ff57dc76db7)
  )
  (junction (at 142.24 143.51) (diameter 0) (color 0 0 0 0)
    (uuid c327bc7f-c678-48f5-b18c-d2c35b210a82)
  )
  (junction (at 161.29 165.1) (diameter 0) (color 0 0 0 0)
    (uuid cbd56055-c6ac-4c83-8e77-facf4d6b0bc7)
  )
  (junction (at 142.24 163.83) (diameter 0) (color 0 0 0 0)
    (uuid d07939b1-638e-489b-bb1f-49a40f7ac144)
  )
  (junction (at 161.29 167.64) (diameter 0) (color 0 0 0 0)
    (uuid d685d30b-c4f2-49ed-a8e2-051152a0d531)
  )
  (junction (at 142.24 148.59) (diameter 0) (color 0 0 0 0)
    (uuid da43e572-e89c-45c9-9145-74e6c0fbef91)
  )
  (junction (at 142.24 158.75) (diameter 0) (color 0 0 0 0)
    (uuid dcafc32c-06d1-4cea-9f59-102d900ae879)
  )
  (junction (at 142.24 146.05) (diameter 0) (color 0 0 0 0)
    (uuid dfef5264-7b6a-4197-b200-2071102c6dbb)
  )
  (junction (at 161.29 149.86) (diameter 0) (color 0 0 0 0)
    (uuid e318c6cc-7ae8-48be-af98-9a075e62b27a)
  )
  (junction (at 161.29 154.94) (diameter 0) (color 0 0 0 0)
    (uuid f254dd63-c5af-4890-a681-91aed1cbd187)
  )

  (wire (pts (xy 129.54 78.74) (xy 129.54 82.55))
    (stroke (width 0) (type default))
    (uuid 003ace8b-5acc-4827-9a59-4c6013de67f6)
  )
  (wire (pts (xy 142.24 143.51) (xy 144.78 143.51))
    (stroke (width 0) (type default))
    (uuid 00cfebc5-062b-4d2e-9e6f-d5dabdfb5aa8)
  )
  (wire (pts (xy 142.24 148.59) (xy 144.78 148.59))
    (stroke (width 0) (type default))
    (uuid 02c3028e-5da8-4061-8760-683f81a6b8d6)
  )
  (wire (pts (xy 142.24 168.91) (xy 144.78 168.91))
    (stroke (width 0) (type default))
    (uuid 05217fc0-5ff2-4086-be78-e9afea3ba504)
  )
  (wire (pts (xy 142.24 156.21) (xy 144.78 156.21))
    (stroke (width 0) (type default))
    (uuid 086223fb-9703-4706-9673-19ce64f08ef6)
  )
  (wire (pts (xy 161.29 139.7) (xy 161.29 142.24))
    (stroke (width 0) (type default))
    (uuid 0f9d414e-d3bd-4523-8c0d-52f79b256d4b)
  )
  (wire (pts (xy 142.24 153.67) (xy 142.24 156.21))
    (stroke (width 0) (type default))
    (uuid 29ca0ddc-607a-4a9d-a513-9e9600a43241)
  )
  (wire (pts (xy 113.03 85.09) (xy 129.54 85.09))
    (stroke (width 0) (type default))
    (uuid 2b65e458-4abd-4d3d-90bf-48f42a817d9a)
  )
  (wire (pts (xy 142.24 158.75) (xy 144.78 158.75))
    (stroke (width 0) (type default))
    (uuid 35a2d909-c276-4ece-ba48-318bbd729fc5)
  )
  (wire (pts (xy 142.24 148.59) (xy 142.24 151.13))
    (stroke (width 0) (type default))
    (uuid 3a63f40a-6ebb-4293-a12c-5413413fe595)
  )
  (wire (pts (xy 142.24 161.29) (xy 144.78 161.29))
    (stroke (width 0) (type default))
    (uuid 46cd9f44-dfc6-4b12-95b0-beb4a986daab)
  )
  (wire (pts (xy 161.29 162.56) (xy 161.29 165.1))
    (stroke (width 0) (type default))
    (uuid 47f34576-a32b-47fe-a968-b2e95557ac68)
  )
  (wire (pts (xy 113.03 92.71) (xy 129.54 92.71))
    (stroke (width 0) (type default))
    (uuid 50eaf38c-3dde-450b-8610-36db1fc58ebb)
  )
  (wire (pts (xy 142.24 166.37) (xy 144.78 166.37))
    (stroke (width 0) (type default))
    (uuid 53c1279e-08f6-408b-b317-9f421c279d37)
  )
  (wire (pts (xy 142.24 166.37) (xy 142.24 168.91))
    (stroke (width 0) (type default))
    (uuid 540e375e-05ea-4e0b-8bb4-34497cf7e265)
  )
  (wire (pts (xy 113.03 90.17) (xy 129.54 90.17))
    (stroke (width 0) (type default))
    (uuid 59e397ea-74c3-4331-91c6-3bc2892faa6d)
  )
  (wire (pts (xy 113.03 105.41) (xy 129.54 105.41))
    (stroke (width 0) (type default))
    (uuid 5d0165f6-6aea-4c4b-b8b1-518808a87049)
  )
  (wire (pts (xy 161.29 167.64) (xy 161.29 171.45))
    (stroke (width 0) (type default))
    (uuid 5e193745-9c37-464a-8b6c-776cc6f61a2a)
  )
  (wire (pts (xy 142.24 156.21) (xy 142.24 158.75))
    (stroke (width 0) (type default))
    (uuid 5ed71423-864e-4322-b462-d14c61496e9a)
  )
  (wire (pts (xy 142.24 140.97) (xy 144.78 140.97))
    (stroke (width 0) (type default))
    (uuid 5f89a39f-d558-4a07-917e-eabe18288228)
  )
  (wire (pts (xy 142.24 151.13) (xy 142.24 153.67))
    (stroke (width 0) (type default))
    (uuid 67c4330a-caa2-4edc-a461-1e8af1e8262f)
  )
  (wire (pts (xy 142.24 140.97) (xy 142.24 143.51))
    (stroke (width 0) (type default))
    (uuid 73e5c10b-b70c-473e-8519-41a0c2c71364)
  )
  (wire (pts (xy 198.12 63.5) (xy 203.2 63.5))
    (stroke (width 0) (type default))
    (uuid 75220c20-9ddb-453d-8444-194608dc7ab4)
  )
  (wire (pts (xy 113.03 110.49) (xy 129.54 110.49))
    (stroke (width 0) (type default))
    (uuid 82a46f92-6965-46c2-8630-2e83674b6e29)
  )
  (wire (pts (xy 199.39 88.9) (xy 201.93 88.9))
    (stroke (width 0) (type default))
    (uuid 83f633d8-304b-4a13-8fe1-1ae490476e5a)
  )
  (wire (pts (xy 199.39 83.82) (xy 201.93 83.82))
    (stroke (width 0) (type default))
    (uuid 8b5600b4-5a6e-404a-8253-c580a66259c7)
  )
  (wire (pts (xy 142.24 163.83) (xy 142.24 166.37))
    (stroke (width 0) (type default))
    (uuid 8f5d429a-cb88-4d3c-ae64-bdebd49b71a6)
  )
  (wire (pts (xy 161.29 165.1) (xy 161.29 167.64))
    (stroke (width 0) (type default))
    (uuid 8ff1f158-ce4c-463d-8c8a-82b06bd15f2d)
  )
  (wire (pts (xy 113.03 82.55) (xy 129.54 82.55))
    (stroke (width 0) (type default))
    (uuid 92169467-87ec-41c4-95ff-ac60a9b72760)
  )
  (wire (pts (xy 161.29 147.32) (xy 161.29 149.86))
    (stroke (width 0) (type default))
    (uuid 9d596aeb-f90e-4705-bc3b-84adc6131165)
  )
  (wire (pts (xy 142.24 158.75) (xy 142.24 161.29))
    (stroke (width 0) (type default))
    (uuid a1dbb9f0-530d-433d-8fb7-349027b79887)
  )
  (wire (pts (xy 142.24 153.67) (xy 144.78 153.67))
    (stroke (width 0) (type default))
    (uuid a71bc239-962f-4fda-bfe5-9bcdbb4f6be3)
  )
  (wire (pts (xy 142.24 163.83) (xy 144.78 163.83))
    (stroke (width 0) (type default))
    (uuid a7a205c5-da1a-4621-ad3e-844c80f63b3a)
  )
  (wire (pts (xy 142.24 146.05) (xy 144.78 146.05))
    (stroke (width 0) (type default))
    (uuid a9c7426b-1d0f-44e9-88a0-6f30a18be01f)
  )
  (wire (pts (xy 142.24 161.29) (xy 142.24 163.83))
    (stroke (width 0) (type default))
    (uuid aacc934a-c9b5-44f8-b509-9a9bf520811d)
  )
  (wire (pts (xy 161.29 142.24) (xy 161.29 144.78))
    (stroke (width 0) (type default))
    (uuid af14bc1c-e2cb-4abb-a61b-a8f8abd538b6)
  )
  (wire (pts (xy 113.03 107.95) (xy 129.54 107.95))
    (stroke (width 0) (type default))
    (uuid af7c42f1-9283-409c-ad9b-90b33b0de41e)
  )
  (wire (pts (xy 161.29 152.4) (xy 161.29 154.94))
    (stroke (width 0) (type default))
    (uuid afe24c9a-cb7e-45e8-9534-e7a2b4112d02)
  )
  (wire (pts (xy 113.03 113.03) (xy 129.54 113.03))
    (stroke (width 0) (type default))
    (uuid b7ed4213-405e-4be2-8dbd-457cfa4dc075)
  )
  (wire (pts (xy 142.24 146.05) (xy 142.24 148.59))
    (stroke (width 0) (type default))
    (uuid bf8d6168-cfcb-4143-8a50-9f720a429841)
  )
  (wire (pts (xy 161.29 144.78) (xy 161.29 147.32))
    (stroke (width 0) (type default))
    (uuid c1ddb614-d748-40cb-8c27-9476fd81309a)
  )
  (wire (pts (xy 142.24 143.51) (xy 142.24 146.05))
    (stroke (width 0) (type default))
    (uuid c89d8215-5661-415a-bd62-20942802c355)
  )
  (wire (pts (xy 198.12 55.88) (xy 203.2 55.88))
    (stroke (width 0) (type default))
    (uuid c9bcdb81-851b-4b37-8380-908fef14b419)
  )
  (wire (pts (xy 113.03 87.63) (xy 129.54 87.63))
    (stroke (width 0) (type default))
    (uuid cc7b6dde-ae4a-4a8c-baa6-e034f2e6ffbf)
  )
  (wire (pts (xy 161.29 157.48) (xy 161.29 160.02))
    (stroke (width 0) (type default))
    (uuid d02bd8f1-db94-4ce7-a19b-de58410a5916)
  )
  (wire (pts (xy 113.03 97.79) (xy 129.54 97.79))
    (stroke (width 0) (type default))
    (uuid d336f69f-ee8b-49ab-bf35-c75829072202)
  )
  (wire (pts (xy 113.03 95.25) (xy 129.54 95.25))
    (stroke (width 0) (type default))
    (uuid d5d5bd48-9ed1-4d2e-9411-c90dfa0c0349)
  )
  (wire (pts (xy 161.29 154.94) (xy 161.29 157.48))
    (stroke (width 0) (type default))
    (uuid d75e24b1-6624-41b8-856a-f0222ddaad34)
  )
  (wire (pts (xy 198.12 58.42) (xy 203.2 58.42))
    (stroke (width 0) (type default))
    (uuid db82b467-4b18-4f10-bf87-d7a149ffaf23)
  )
  (wire (pts (xy 161.29 160.02) (xy 161.29 162.56))
    (stroke (width 0) (type default))
    (uuid def6252a-3069-4a66-bac7-98ff5eafb3f6)
  )
  (wire (pts (xy 113.03 102.87) (xy 129.54 102.87))
    (stroke (width 0) (type default))
    (uuid e456707f-c968-4efe-8bfa-929d8ec74f6b)
  )
  (wire (pts (xy 199.39 92.71) (xy 201.93 92.71))
    (stroke (width 0) (type default))
    (uuid e5e293a4-789c-4855-b966-984e7820e8ee)
  )
  (wire (pts (xy 199.39 80.01) (xy 201.93 80.01))
    (stroke (width 0) (type default))
    (uuid e65f6759-fb06-4101-b79f-05e5758e1146)
  )
  (wire (pts (xy 142.24 138.43) (xy 142.24 140.97))
    (stroke (width 0) (type default))
    (uuid ecc65afd-b707-4dbd-b284-57f3da69236b)
  )
  (wire (pts (xy 198.12 66.04) (xy 203.2 66.04))
    (stroke (width 0) (type default))
    (uuid ecceb577-5ecd-4ba6-9bb0-932f71fa17db)
  )
  (wire (pts (xy 161.29 149.86) (xy 161.29 152.4))
    (stroke (width 0) (type default))
    (uuid eff56188-88ba-47ef-8acd-1a81632e5ff6)
  )
  (wire (pts (xy 144.78 151.13) (xy 142.24 151.13))
    (stroke (width 0) (type default))
    (uuid fa24bbdf-7ab4-4355-b35e-86849c27e1b0)
  )
  (wire (pts (xy 113.03 100.33) (xy 129.54 100.33))
    (stroke (width 0) (type default))
    (uuid faeaf64e-2c93-430f-9f8d-0e5d5404e4f7)
  )
  (wire (pts (xy 199.39 119.38) (xy 203.2 119.38))
    (stroke (width 0) (type default))
    (uuid fc8a7747-f6fe-4b77-a262-633cc337c42d)
  )

  (label "D8" (at 199.39 119.38 180) (fields_autoplaced)
    (effects (font (size 1.27 1.27)) (justify right bottom))
    (uuid 105e206c-1aba-4491-8071-80ce0fbb84fe)
  )
  (label "A0" (at 120.396 113.03 0) (fields_autoplaced)
    (effects (font (size 1.27 1.27)) (justify left bottom))
    (uuid 1f60e6b0-9234-45f4-b953-8c108547b2bf)
  )
  (label "RX" (at 199.39 80.01 180) (fields_autoplaced)
    (effects (font (size 1.27 1.27)) (justify right bottom))
    (uuid 216b6eaf-0d3c-435b-951b-6ade7f9b3745)
  )
  (label "D6" (at 120.142 100.33 0) (fields_autoplaced)
    (effects (font (size 1.27 1.27)) (justify left bottom))
    (uuid 2b783a62-2904-41bb-9c2e-13bda043527a)
  )
  (label "D6" (at 198.12 63.5 180) (fields_autoplaced)
    (effects (font (size 1.27 1.27)) (justify right bottom))
    (uuid 396c6953-df9b-4a51-b51f-c52b856d89cd)
  )
  (label "TX" (at 199.39 83.82 180) (fields_autoplaced)
    (effects (font (size 1.27 1.27)) (justify right bottom))
    (uuid 4df2d613-e72c-4b27-91d1-aec14dff2367)
  )
  (label "RESET" (at 120.142 82.55 0) (fields_autoplaced)
    (effects (font (size 1.27 1.27)) (justify left bottom))
    (uuid 4fd3ce13-4808-416b-bf02-a9703c91f5b5)
  )
  (label "TX" (at 120.142 110.49 0) (fields_autoplaced)
    (effects (font (size 1.27 1.27)) (justify left bottom))
    (uuid 543a9b58-ac2e-4867-8e67-fc0854641e7c)
  )
  (label "D4" (at 120.142 95.25 0) (fields_autoplaced)
    (effects (font (size 1.27 1.27)) (justify left bottom))
    (uuid 5a8b8b53-9e99-493a-901a-1450090875de)
  )
  (label "TX" (at 198.12 58.42 180) (fields_autoplaced)
    (effects (font (size 1.27 1.27)) (justify right bottom))
    (uuid 64d096ac-dae8-4bb8-9c31-b4cb8dabe1a4)
  )
  (label "D5" (at 120.142 97.79 0) (fields_autoplaced)
    (effects (font (size 1.27 1.27)) (justify left bottom))
    (uuid 6ef66987-1c6c-4612-a0ca-e60604856728)
  )
  (label "D3" (at 120.142 92.71 0) (fields_autoplaced)
    (effects (font (size 1.27 1.27)) (justify left bottom))
    (uuid 7cfce395-707c-45b9-a2f2-300bfc8c803b)
  )
  (label "D7" (at 120.142 102.87 0) (fields_autoplaced)
    (effects (font (size 1.27 1.27)) (justify left bottom))
    (uuid 978b1dd7-c4fb-4b17-9e1f-c11c3bddb158)
  )
  (label "D0" (at 120.142 85.09 0) (fields_autoplaced)
    (effects (font (size 1.27 1.27)) (justify left bottom))
    (uuid 9a031d4f-ae26-4d29-8136-767ebf878607)
  )
  (label "RX" (at 198.12 55.88 180) (fields_autoplaced)
    (effects (font (size 1.27 1.27)) (justify right bottom))
    (uuid a1058896-0301-4e3b-ab28-a72cb80552ce)
  )
  (label "D1" (at 120.142 87.63 0) (fields_autoplaced)
    (effects (font (size 1.27 1.27)) (justify left bottom))
    (uuid a276a7e7-fb1d-475e-a8d3-4883d2d16f2d)
  )
  (label "D5" (at 199.39 92.71 180) (fields_autoplaced)
    (effects (font (size 1.27 1.27)) (justify right bottom))
    (uuid abf7498f-c5a3-416a-9500-a35bb2313ceb)
  )
  (label "D2" (at 120.142 90.17 0) (fields_autoplaced)
    (effects (font (size 1.27 1.27)) (justify left bottom))
    (uuid c3d1a25a-90de-45e5-a907-d6f0658bb23b)
  )
  (label "D7" (at 198.12 66.04 180) (fields_autoplaced)
    (effects (font (size 1.27 1.27)) (justify right bottom))
    (uuid ed623510-2e01-4e92-99f6-e8feb7a2df02)
  )
  (label "RX" (at 120.142 107.95 0) (fields_autoplaced)
    (effects (font (size 1.27 1.27)) (justify left bottom))
    (uuid f3525569-6b96-484e-9124-f8da3296873b)
  )
  (label "D8" (at 120.142 105.41 0) (fields_autoplaced)
    (effects (font (size 1.27 1.27)) (justify left bottom))
    (uuid f9fbb5fc-c31e-4428-b4be-c075a7221838)
  )
  (label "D3" (at 199.39 88.9 180) (fields_autoplaced)
    (effects (font (size 1.27 1.27)) (justify right bottom))
    (uuid fee1ecd9-24b5-46d8-98c3-0f3a8b9c2fe6)
  )

  (symbol (lib_id "Connector:Conn_01x12_Male") (at 166.37 154.94 180) (unit 1)
    (in_bom yes) (on_board yes) (dnp no) (fields_autoplaced)
    (uuid 04616114-4a98-4a6d-a5db-e694889ed6c0)
    (property "Reference" "J4" (at 167.894 152.4 0)
      (effects (font (size 1.27 1.27)) (justify right))
    )
    (property "Value" "gnd" (at 167.894 154.94 0)
      (effects (font (size 1.27 1.27)) (justify right))
    )
    (property "Footprint" "Connector_PinSocket_2.54mm:PinSocket_1x12_P2.54mm_Vertical" (at 166.37 154.94 0)
      (effects (font (size 1.27 1.27)) hide)
    )
    (property "Datasheet" "~" (at 166.37 154.94 0)
      (effects (font (size 1.27 1.27)) hide)
    )
    (pin "1" (uuid 74da366e-db02-46f0-8f2b-d230330c383d))
    (pin "10" (uuid 435be41f-435f-45f3-bcd8-f132dd651e2d))
    (pin "11" (uuid 39b0bc97-81e2-42c9-ac67-2432dd4732bc))
    (pin "12" (uuid a118def1-88e3-4702-ad47-9d34c9dc260a))
    (pin "2" (uuid 2853528c-f4c5-4555-ae76-93221803e823))
    (pin "3" (uuid d594b254-616e-457e-8f2d-3a557689fd41))
    (pin "4" (uuid 6992aec0-42de-4795-9276-5e006c3f4ac6))
    (pin "5" (uuid 6beb825f-3f9e-4166-a94d-02de340b8d43))
    (pin "6" (uuid bceae15f-511a-4729-9de7-ddc2951ef95f))
    (pin "7" (uuid 9776d2b2-bd52-4ba6-9482-0a50f788aac3))
    (pin "8" (uuid b1d93cf9-84df-4944-922b-cdbf223710be))
    (pin "9" (uuid 44dd69e3-9ad8-448b-b5e2-774fe44fcb0c))
    (instances
      (project "luna8266-v5"
        (path "/d68cd6cf-6ee3-4483-a307-0498258d66c2"
          (reference "J4") (unit 1)
        )
      )
    )
  )

  (symbol (lib_id "Connector:Conn_01x12_Male") (at 149.86 156.21 180) (unit 1)
    (in_bom yes) (on_board yes) (dnp no) (fields_autoplaced)
    (uuid 3a86b210-3704-4607-ba8d-e3305f6f8f15)
    (property "Reference" "J3" (at 151.638 153.67 0)
      (effects (font (size 1.27 1.27)) (justify right))
    )
    (property "Value" "vcc" (at 151.638 156.21 0)
      (effects (font (size 1.27 1.27)) (justify right))
    )
    (property "Footprint" "Connector_PinSocket_2.54mm:PinSocket_1x12_P2.54mm_Vertical" (at 149.86 156.21 0)
      (effects (font (size 1.27 1.27)) hide)
    )
    (property "Datasheet" "~" (at 149.86 156.21 0)
      (effects (font (size 1.27 1.27)) hide)
    )
    (pin "1" (uuid 1aa40d64-fa75-47d3-97bf-74d80441403d))
    (pin "10" (uuid b7c79ea3-84fd-4346-a699-87919a569948))
    (pin "11" (uuid 00606ce6-ce38-4b20-b18b-8768e078c59a))
    (pin "12" (uuid 28eac7b3-b692-4183-ab14-bd517586e15e))
    (pin "2" (uuid 40f49227-b293-439b-8164-423ef0dd959d))
    (pin "3" (uuid 78a8ce0f-ed43-45c0-b039-19a067c32df1))
    (pin "4" (uuid 800d2d15-3d8f-4924-8a25-61d7a98a3c39))
    (pin "5" (uuid 8713d33d-64ae-46af-a042-b3cd15c474f2))
    (pin "6" (uuid 44ae935a-37ef-4979-a12d-aa5ceaf97d8a))
    (pin "7" (uuid 1d8e4607-c755-4028-b64d-762835878be5))
    (pin "8" (uuid fedc7acf-aaf3-4b39-9f06-553e7c725dff))
    (pin "9" (uuid f02876e7-806e-4bbe-83cd-82366c2adcde))
    (instances
      (project "luna8266-v5"
        (path "/d68cd6cf-6ee3-4483-a307-0498258d66c2"
          (reference "J3") (unit 1)
        )
      )
    )
  )

  (symbol (lib_id "power:GND") (at 161.29 171.45 0) (unit 1)
    (in_bom yes) (on_board yes) (dnp no) (fields_autoplaced)
    (uuid 452056fb-8e95-461f-9f2d-8d95089a970c)
    (property "Reference" "#PWR02" (at 161.29 177.8 0)
      (effects (font (size 1.27 1.27)) hide)
    )
    (property "Value" "GND" (at 161.29 176.53 0)
      (effects (font (size 1.27 1.27)))
    )
    (property "Footprint" "" (at 161.29 171.45 0)
      (effects (font (size 1.27 1.27)) hide)
    )
    (property "Datasheet" "" (at 161.29 171.45 0)
      (effects (font (size 1.27 1.27)) hide)
    )
    (pin "1" (uuid 69c771bc-7c31-440e-b006-014b8f0bc261))
    (instances
      (project "luna8266-v5"
        (path "/d68cd6cf-6ee3-4483-a307-0498258d66c2"
          (reference "#PWR02") (unit 1)
        )
      )
    )
  )

  (symbol (lib_id "power:+5V") (at 142.24 138.43 0) (unit 1)
    (in_bom yes) (on_board yes) (dnp no) (fields_autoplaced)
    (uuid 865a1432-cdc4-49ab-8f79-d7f2afa9c12e)
    (property "Reference" "#PWR01" (at 142.24 142.24 0)
      (effects (font (size 1.27 1.27)) hide)
    )
    (property "Value" "+5V" (at 142.24 133.604 0)
      (effects (font (size 1.27 1.27)))
    )
    (property "Footprint" "" (at 142.24 138.43 0)
      (effects (font (size 1.27 1.27)) hide)
    )
    (property "Datasheet" "" (at 142.24 138.43 0)
      (effects (font (size 1.27 1.27)) hide)
    )
    (pin "1" (uuid bbec302e-7dc7-4ed4-91c8-7bfe1e0c031a))
    (instances
      (project "luna8266-v5"
        (path "/d68cd6cf-6ee3-4483-a307-0498258d66c2"
          (reference "#PWR01") (unit 1)
        )
      )
    )
  )

  (symbol (lib_id "Connector:Conn_01x01_Male") (at 129.54 73.66 270) (unit 1)
    (in_bom yes) (on_board yes) (dnp no) (fields_autoplaced)
    (uuid c8a4e491-9110-496c-8c8b-a85b5cc4590b)
    (property "Reference" "J1" (at 130.81 73.025 90)
      (effects (font (size 1.27 1.27)) (justify left))
    )
    (property "Value" "Conn_01x01_Male" (at 130.81 75.565 90)
      (effects (font (size 1.27 1.27)) (justify left))
    )
    (property "Footprint" "Connector_PinHeader_2.54mm:PinHeader_1x01_P2.54mm_Vertical" (at 129.54 73.66 0)
      (effects (font (size 1.27 1.27)) hide)
    )
    (property "Datasheet" "~" (at 129.54 73.66 0)
      (effects (font (size 1.27 1.27)) hide)
    )
    (pin "1" (uuid 0eeb4914-f69e-43dd-abf6-14c00fbac83a))
    (instances
      (project "luna8266-v5"
        (path "/d68cd6cf-6ee3-4483-a307-0498258d66c2"
          (reference "J1") (unit 1)
        )
      )
    )
  )

  (symbol (lib_id "Connector:Conn_01x12_Male") (at 134.62 100.33 180) (unit 1)
    (in_bom yes) (on_board yes) (dnp no) (fields_autoplaced)
    (uuid d00a4021-66bc-4b75-a323-e579a67fe4a1)
    (property "Reference" "J2" (at 135.89 97.79 0)
      (effects (font (size 1.27 1.27)) (justify right))
    )
    (property "Value" "gpio" (at 135.89 100.33 0)
      (effects (font (size 1.27 1.27)) (justify right))
    )
    (property "Footprint" "Connector_PinHeader_2.54mm:PinHeader_1x12_P2.54mm_Vertical" (at 134.62 100.33 0)
      (effects (font (size 1.27 1.27)) hide)
    )
    (property "Datasheet" "~" (at 134.62 100.33 0)
      (effects (font (size 1.27 1.27)) hide)
    )
    (pin "1" (uuid d8b61647-3bb1-4f29-8b32-cad5f53be39a))
    (pin "10" (uuid 01543e84-7019-437c-8e23-d121b0e2d7d6))
    (pin "11" (uuid 52734839-96d8-485c-9d10-23019b91259e))
    (pin "12" (uuid 4367a74c-6e2d-4104-bc19-6274a789b2c5))
    (pin "2" (uuid dde4a702-dc2c-429c-8e61-b0eb0a5c4379))
    (pin "3" (uuid a8708781-850a-41eb-a39d-bd583d9eeb1c))
    (pin "4" (uuid 90084580-1ef0-416e-8c27-9a20d314c48c))
    (pin "5" (uuid 0edec7de-34e5-48ec-9c7f-64a8eb7c356c))
    (pin "6" (uuid 22e09004-3541-43f9-8144-10671f13d998))
    (pin "7" (uuid e18d2dc2-f16c-4455-86ee-47043cab72f7))
    (pin "8" (uuid 88609ad3-a855-4ba2-956e-2e9594815e13))
    (pin "9" (uuid a6de92ec-4a95-48c1-928e-c3e6fa65a015))
    (instances
      (project "luna8266-v5"
        (path "/d68cd6cf-6ee3-4483-a307-0498258d66c2"
          (reference "J2") (unit 1)
        )
      )
    )
  )

  (sheet (at 79.248 81.28) (size 33.782 33.02) (fields_autoplaced)
    (stroke (width 0.1524) (type solid))
    (fill (color 0 0 0 0.0000))
    (uuid 057f97a7-e991-4901-9f85-7b35806de396)
    (property "Sheetname" "esp6266-07" (at 79.248 80.5684 0)
      (effects (font (size 1.27 1.27)) (justify left bottom))
    )
    (property "Sheetfile" "esp8266-07-luna.kicad_sch" (at 79.248 114.8846 0)
      (effects (font (size 1.27 1.27)) (justify left top))
    )
    (pin "IO16" bidirectional (at 113.03 85.09 0)
      (effects (font (size 1.27 1.27)) (justify right))
      (uuid e084016f-c3d4-42fa-8acf-610a77ebd91a)
    )
    (pin "A0" input (at 113.03 113.03 0)
      (effects (font (size 1.27 1.27)) (justify right))
      (uuid 0a752e76-af2f-4a9d-92a6-3f192816bd98)
    )
    (pin "IO5" bidirectional (at 113.03 87.63 0)
      (effects (font (size 1.27 1.27)) (justify right))
      (uuid 79f27905-7e91-4a76-9b88-2cf9c37e2f38)
    )
    (pin "IO4" bidirectional (at 113.03 90.17 0)
      (effects (font (size 1.27 1.27)) (justify right))
      (uuid efe5b215-a3d2-423d-8cb7-1c0895617e98)
    )
    (pin "IO3" bidirectional (at 113.03 107.95 0)
      (effects (font (size 1.27 1.27)) (justify right))
      (uuid ea582869-6416-4c4b-beae-13df16daaebc)
    )
    (pin "IO0" bidirectional (at 113.03 92.71 0)
      (effects (font (size 1.27 1.27)) (justify right))
      (uuid be653c0d-1fa3-46b9-a597-381ae4a96d6c)
    )
    (pin "IO2" bidirectional (at 113.03 95.25 0)
      (effects (font (size 1.27 1.27)) (justify right))
      (uuid 56d52a1d-46fc-4ad6-ac81-44bd50aebdfe)
    )
    (pin "IO1" bidirectional (at 113.03 110.49 0)
      (effects (font (size 1.27 1.27)) (justify right))
      (uuid 1c6d9b2a-8f74-4c97-b1dc-eace6097fbb5)
    )
    (pin "IO14" bidirectional (at 113.03 97.79 0)
      (effects (font (size 1.27 1.27)) (justify right))
      (uuid b7f0c552-2755-4629-bbe8-aefbb2e62c9f)
    )
    (pin "IO13" bidirectional (at 113.03 102.87 0)
      (effects (font (size 1.27 1.27)) (justify right))
      (uuid 6f60d5c4-4f51-4912-bd7d-0f540976e7db)
    )
    (pin "IO15" bidirectional (at 113.03 105.41 0)
      (effects (font (size 1.27 1.27)) (justify right))
      (uuid 34b51352-ed97-4714-aa86-ad9a4e546cf5)
    )
    (pin "IO12" bidirectional (at 113.03 100.33 0)
      (effects (font (size 1.27 1.27)) (justify right))
      (uuid 773e346f-6a1a-40db-a386-1ed641b56296)
    )
    (pin "RESET" input (at 113.03 82.55 0)
      (effects (font (size 1.27 1.27)) (justify right))
      (uuid 59d54e35-b3b1-4883-bc9a-4cd9e67d08f7)
    )
    (instances
      (project "luna8266-v5"
        (path "/d68cd6cf-6ee3-4483-a307-0498258d66c2" (page "2"))
      )
    )
  )

  (sheet (at 201.93 77.47) (size 37.465 17.78) (fields_autoplaced)
    (stroke (width 0.1524) (type solid))
    (fill (color 0 0 0 0.0000))
    (uuid 788a4580-cea6-4ad0-bde5-a2826ba17ed8)
    (property "Sheetname" "oled-i2c-uart" (at 201.93 76.7584 0)
      (effects (font (size 1.27 1.27)) (justify left bottom))
    )
    (property "Sheetfile" "conn-i2c-rj11-oled.kicad_sch" (at 201.93 95.8346 0)
      (effects (font (size 1.27 1.27)) (justify left top))
    )
    (pin "SCL" input (at 201.93 92.71 180)
      (effects (font (size 1.27 1.27)) (justify left))
      (uuid 3d213c5a-f03b-4ddc-8903-1067d1f5afca)
    )
    (pin "RX" input (at 201.93 80.01 180)
      (effects (font (size 1.27 1.27)) (justify left))
      (uuid c3fb65a6-56cb-418b-830a-a233ca99039c)
    )
    (pin "TX" output (at 201.93 83.82 180)
      (effects (font (size 1.27 1.27)) (justify left))
      (uuid 041b7f22-516a-4766-9de8-ed423e200a73)
    )
    (pin "SDA" bidirectional (at 201.93 88.9 180)
      (effects (font (size 1.27 1.27)) (justify left))
      (uuid 02fd6412-3a9a-4ac7-bdf6-433c9013eee1)
    )
    (instances
      (project "luna8266-v5"
        (path "/d68cd6cf-6ee3-4483-a307-0498258d66c2" (page "5"))
      )
    )
  )

  (sheet (at 22.86 82.55) (size 32.385 35.56) (fields_autoplaced)
    (stroke (width 0.1524) (type solid))
    (fill (color 0 0 0 0.0000))
    (uuid 83cb64a9-b767-45eb-88a9-3121ba1977bd)
    (property "Sheetname" "power mh cd42 5v y 3v3" (at 22.86 81.8384 0)
      (effects (font (size 1.27 1.27)) (justify left bottom))
    )
    (property "Sheetfile" "power-mh-dc42.kicad_sch" (at 22.86 118.6946 0)
      (effects (font (size 1.27 1.27)) (justify left top))
    )
    (instances
      (project "luna8266-v5"
        (path "/d68cd6cf-6ee3-4483-a307-0498258d66c2" (page "3"))
      )
    )
  )

  (sheet (at 203.2 115.189) (size 38.1 19.05) (fields_autoplaced)
    (stroke (width 0.1524) (type solid))
    (fill (color 0 0 0 0.0000))
    (uuid ba05769e-f156-4326-a481-576e65bfd3ca)
    (property "Sheetname" "passive-buzzer" (at 203.2 114.4774 0)
      (effects (font (size 1.27 1.27)) (justify left bottom))
    )
    (property "Sheetfile" "passive buzzer.kicad_sch" (at 203.2 134.8236 0)
      (effects (font (size 1.27 1.27)) (justify left top))
    )
    (pin "input" input (at 203.2 119.38 180)
      (effects (font (size 1.27 1.27)) (justify left))
      (uuid 50c435d3-ed23-4408-aa89-eb6884d4580c)
    )
    (instances
      (project "luna8266-v5"
        (path "/d68cd6cf-6ee3-4483-a307-0498258d66c2" (page "6"))
      )
    )
  )

  (sheet (at 203.2 52.07) (size 36.83 17.145) (fields_autoplaced)
    (stroke (width 0.1524) (type solid))
    (fill (color 0 0 0 0.0000))
    (uuid c95338e7-2e1b-4c77-a20c-bef69633d9c6)
    (property "Sheetname" "Motor driver" (at 203.2 51.3584 0)
      (effects (font (size 1.27 1.27)) (justify left bottom))
    )
    (property "Sheetfile" "driver-motor-l293d.kicad_sch" (at 203.2 69.7996 0)
      (effects (font (size 1.27 1.27)) (justify left top))
    )
    (pin "B2" input (at 203.2 55.88 180)
      (effects (font (size 1.27 1.27)) (justify left))
      (uuid 0b867711-568b-431e-a65e-0401fdf0c6bc)
    )
    (pin "B1" input (at 203.2 58.42 180)
      (effects (font (size 1.27 1.27)) (justify left))
      (uuid 8c01ed76-7b7b-45db-96db-2706a5676d3a)
    )
    (pin "A1" input (at 203.2 66.04 180)
      (effects (font (size 1.27 1.27)) (justify left))
      (uuid 31c7bc45-8e4d-4da9-a884-be247f8512ac)
    )
    (pin "A2" input (at 203.2 63.5 180)
      (effects (font (size 1.27 1.27)) (justify left))
      (uuid af35ed0f-05fe-4fce-ac09-399d1d2a9f50)
    )
    (instances
      (project "luna8266-v5"
        (path "/d68cd6cf-6ee3-4483-a307-0498258d66c2" (page "4"))
      )
    )
  )

  (sheet_instances
    (path "/" (page "1"))
  )
)
