PCBNEW-LibModule-V1  2020-05-07 00:56:39
# encoding utf-8
Units mm
$INDEX
TBL00925402GY2GY
$EndINDEX
$MODULE TBL00925402GY2GY
Po 0 0 0 15 5eb34eb7 00000000 ~~
Li TBL00925402GY2GY
Cd TBL009-254-02GY-2GY-4
Kw Connector
Sc 0
At STD
AR 
Op 0 0 0
T0 0.090 1.37 1.27 1.27 0 0.254 N V 21 N "J**"
T1 0.090 1.37 1.27 1.27 0 0.254 N I 21 N "TBL00925402GY2GY"
DS -3.2 -6.53 3.38 -6.53 0.2 24
DS 3.38 -6.53 3.38 9.27 0.2 24
DS 3.38 9.27 -3.2 9.27 0.2 24
DS -3.2 9.27 -3.2 -6.53 0.2 24
DS -4.2 -7.53 4.38 -7.53 0.1 24
DS 4.38 -7.53 4.38 10.27 0.1 24
DS 4.38 10.27 -4.2 10.27 0.1 24
DS -4.2 10.27 -4.2 -7.53 0.1 24
DS 3.38 0.92 3.38 9.27 0.1 21
DS 3.38 9.27 -3.2 9.27 0.1 21
DS -3.2 9.27 -3.2 -6.53 0.1 21
DS -3.2 -6.53 3.38 -6.53 0.1 21
DS 3.38 -6.53 3.38 -5.58 0.1 21
DS 3.38 -4.58 3.38 -0.58 0.1 21
$PAD
Po 0.000 -0
Sh "1" C 1.500 1.500 0 0 900
Dr 1 0 0
At STD N 00E0FFFF
Ne 0 ""
$EndPAD
$PAD
Po 0.000 -5.08
Sh "2" C 1.500 1.500 0 0 900
Dr 1 0 0
At STD N 00E0FFFF
Ne 0 ""
$EndPAD
$PAD
Po 2.540 -0
Sh "3" C 1.500 1.500 0 0 900
Dr 1 0 0
At STD N 00E0FFFF
Ne 0 ""
$EndPAD
$PAD
Po 2.540 -5.08
Sh "4" C 1.500 1.500 0 0 900
Dr 1 0 0
At STD N 00E0FFFF
Ne 0 ""
$EndPAD
$EndMODULE TBL00925402GY2GY
$EndLIBRARY
