PCBNEW-LibModule-V1  2020-05-07 00:40:31
# encoding utf-8
Units mm
$INDEX
CD43NP
$EndINDEX
$MODULE CD43NP
Po 0 0 0 15 5eb34aef 00000000 ~~
Li CD43NP
Cd CD43NP
Kw Inductor
Sc 0
At SMD
AR 
Op 0 0 0
T0 -1.437 -0.348 1.27 1.27 0 0.254 N V 21 N "L**"
T1 -1.437 -0.348 1.27 1.27 0 0.254 N I 21 N "CD43NP"
DS 2 -1.25 2 1.25 0.2 24
DS -2 1.25 -2 -1.25 0.2 24
DS -2 -0.47 -2 0.47 0.2 21
DS 2 -0.47 2 0.47 0.2 21
DA 5.0000000002548E-6 0.241805 -2 -1.25 1066 0.2 24
DA -4.9999999998107E-6 -0.247755 2 1.25 1063 0.2 24
$PAD
Po 0 -1.625
Sh "1" R 1.75 4.5 0 0 900
At SMD N 00888000
Ne 0 ""
$EndPAD
$PAD
Po 0 1.625
Sh "2" R 1.75 4.5 0 0 900
At SMD N 00888000
Ne 0 ""
$EndPAD
$EndMODULE CD43NP
$EndLIBRARY
