PCBNEW-LibModule-V1  2020-05-07 04:04:35
# encoding utf-8
Units mm
$INDEX
520186646
$EndINDEX
$MODULE 520186646
Po 0 0 0 15 5eb37ac3 00000000 ~~
Li 520186646
Cd 52018-6646-1
Kw Connector
Sc 0
At STD
AR 
Op 0 0 0
T0 2.550 1.8 1.27 1.27 0 0.254 N V 21 N "J**"
T1 2.550 1.8 1.27 1.27 0 0.254 N I 21 N "520186646"
DS -3.55 -4.7 8.65 -4.7 0.2 24
DS 8.65 -4.7 8.65 8.3 0.2 24
DS 8.65 8.3 -3.55 8.3 0.2 24
DS -3.55 8.3 -3.55 -4.7 0.2 24
DS -5.7 -5.7 10.8 -5.7 0.1 24
DS 10.8 -5.7 10.8 9.3 0.1 24
DS 10.8 9.3 -5.7 9.3 0.1 24
DS -5.7 9.3 -5.7 -5.7 0.1 24
DS -3.55 4.3 -3.55 8.3 0.1 21
DS -3.55 8.3 8.65 8.3 0.1 21
DS 8.65 8.3 8.65 4.3 0.1 21
DS -3.55 0.3 -3.55 -4.7 0.1 21
DS -3.55 -4.7 8.65 -4.7 0.1 21
DS 8.65 -4.7 8.65 0.3 0.1 21
$PAD
Po 0.000 -0
Sh "1" C 1.400 1.400 0 0 900
Dr 0.9 0 0
At STD N 00E0FFFF
Ne 0 ""
$EndPAD
$PAD
Po 1.020 -2.54
Sh "2" C 1.400 1.400 0 0 900
Dr 0.9 0 0
At STD N 00E0FFFF
Ne 0 ""
$EndPAD
$PAD
Po 2.040 -0
Sh "3" C 1.400 1.400 0 0 900
Dr 0.9 0 0
At STD N 00E0FFFF
Ne 0 ""
$EndPAD
$PAD
Po 3.060 -2.54
Sh "4" C 1.400 1.400 0 0 900
Dr 0.9 0 0
At STD N 00E0FFFF
Ne 0 ""
$EndPAD
$PAD
Po 4.080 -0
Sh "5" C 1.400 1.400 0 0 900
Dr 0.9 0 0
At STD N 00E0FFFF
Ne 0 ""
$EndPAD
$PAD
Po 5.100 -2.54
Sh "6" C 1.400 1.400 0 0 900
Dr 0.9 0 0
At STD N 00E0FFFF
Ne 0 ""
$EndPAD
$PAD
Po -3.450 2.3
Sh "MH1" C 1.250 1.250 0 0 900
Dr 2.5 0 0
At STD N 00E0FFFF
Ne 0 ""
$EndPAD
$PAD
Po 8.550 2.3
Sh "MH2" C 1.250 1.250 0 0 900
Dr 2.5 0 0
At STD N 00E0FFFF
Ne 0 ""
$EndPAD
$EndMODULE 520186646
$EndLIBRARY
