PCBNEW-LibModule-V1  2020-05-03 17:15:54
# encoding utf-8
Units mm
$INDEX
SOP65P640X120-8N
$EndINDEX
$MODULE SOP65P640X120-8N
Po 0 0 0 15 5eaeee3a 00000000 ~~
Li SOP65P640X120-8N
Cd FS8205A
Kw MOSFET (N-Channel)
Sc 0
At SMD
AR 
Op 0 0 0
T0 0 0 1.27 1.27 0 0.254 N V 21 N "Q**"
T1 0 0 1.27 1.27 0 0.254 N I 21 N "SOP65P640X120-8N"
DS -3.925 -1.765 3.925 -1.765 0.05 24
DS 3.925 -1.765 3.925 1.765 0.05 24
DS 3.925 1.765 -3.925 1.765 0.05 24
DS -3.925 1.765 -3.925 -1.765 0.05 24
DS -2.2 -1.465 2.2 -1.465 0.1 24
DS 2.2 -1.465 2.2 1.465 0.1 24
DS 2.2 1.465 -2.2 1.465 0.1 24
DS -2.2 1.465 -2.2 -1.465 0.1 24
DS -2.2 -0.815 -1.55 -1.465 0.1 24
DS -1.85 -1.465 1.85 -1.465 0.2 21
DS 1.85 -1.465 1.85 1.465 0.2 21
DS 1.85 1.465 -1.85 1.465 0.2 21
DS -1.85 1.465 -1.85 -1.465 0.2 21
DS -3.675 -1.55 -2.2 -1.55 0.2 21
$PAD
Po -2.938 -0.975
Sh "1" R 0.45 1.475 0 0 900
At SMD N 00888000
Ne 0 ""
$EndPAD
$PAD
Po -2.938 -0.325
Sh "2" R 0.45 1.475 0 0 900
At SMD N 00888000
Ne 0 ""
$EndPAD
$PAD
Po -2.938 0.325
Sh "3" R 0.45 1.475 0 0 900
At SMD N 00888000
Ne 0 ""
$EndPAD
$PAD
Po -2.938 0.975
Sh "4" R 0.45 1.475 0 0 900
At SMD N 00888000
Ne 0 ""
$EndPAD
$PAD
Po 2.938 0.975
Sh "5" R 0.45 1.475 0 0 900
At SMD N 00888000
Ne 0 ""
$EndPAD
$PAD
Po 2.938 0.325
Sh "6" R 0.45 1.475 0 0 900
At SMD N 00888000
Ne 0 ""
$EndPAD
$PAD
Po 2.938 -0.325
Sh "7" R 0.45 1.475 0 0 900
At SMD N 00888000
Ne 0 ""
$EndPAD
$PAD
Po 2.938 -0.975
Sh "8" R 0.45 1.475 0 0 900
At SMD N 00888000
Ne 0 ""
$EndPAD
$EndMODULE SOP65P640X120-8N
$EndLIBRARY
