EESchema Schematic File Version 4
EELAYER 30 0
EELAYER END
$Descr A4 11693 8268
encoding utf-8
Sheet 2 6
Title ""
Date ""
Rev ""
Comp ""
Comment1 ""
Comment2 ""
Comment3 ""
Comment4 ""
$EndDescr
$Comp
L tp5400:tp5400 U1
U 1 1 5EB0AE5A
P 3700 3500
F 0 "U1" H 3700 4400 50  0000 C CNN
F 1 "tp5400" H 3700 4300 50  0000 C CNN
F 2 "Package_SO:SOP-8_3.9x4.9mm_P1.27mm" H 3750 3500 50  0001 C CNN
F 3 "" H 3750 3500 50  0001 C CNN
	1    3700 3500
	1    0    0    -1  
$EndComp
$Comp
L Device:D_Schottky D1
U 1 1 5EB0BE94
P 4250 3300
F 0 "D1" V 4204 3379 50  0000 L CNN
F 1 "SSD32" V 4295 3379 50  0000 L CNN
F 2 "Diode_SMD:D_SMA_Handsoldering" H 4250 3300 50  0001 C CNN
F 3 "~" H 4250 3300 50  0001 C CNN
	1    4250 3300
	0    1    1    0   
$EndComp
$Comp
L Device:L L1
U 1 1 5EB11472
P 4250 3950
F 0 "L1" H 4302 3996 50  0000 L CNN
F 1 "10u" H 4302 3905 50  0000 L CNN
F 2 "Inductor_SMD:L_Wuerth_WE-PD2-Typ-MS" H 4250 3950 50  0001 C CNN
F 3 "~" H 4250 3950 50  0001 C CNN
	1    4250 3950
	1    0    0    -1  
$EndComp
$Comp
L Connector_Generic:Conn_01x02 J2
U 1 1 5EB12D5E
P 5600 4500
F 0 "J2" H 5680 4492 50  0000 L CNN
F 1 "battery" H 5680 4401 50  0000 L CNN
F 2 "Connector_PinHeader_2.54mm:PinHeader_1x02_P2.54mm_Vertical" H 5600 4500 50  0001 C CNN
F 3 "~" H 5600 4500 50  0001 C CNN
	1    5600 4500
	1    0    0    -1  
$EndComp
Wire Wire Line
	4150 4200 4250 4200
Wire Wire Line
	4250 4200 4250 4100
Wire Wire Line
	4250 3800 4250 3700
Wire Wire Line
	4250 3700 4150 3700
Wire Wire Line
	4150 2900 4250 2900
Wire Wire Line
	4250 2900 4250 3150
Wire Wire Line
	4250 3450 4250 3700
Connection ~ 4250 3700
Wire Wire Line
	3000 3000 3000 2900
Wire Wire Line
	3000 2900 3250 2900
Wire Wire Line
	3000 3300 3000 3400
Connection ~ 3000 2900
Wire Wire Line
	2700 2400 2700 2500
Wire Wire Line
	3000 2500 3000 2400
$Comp
L Device:C C2
U 1 1 5EB3E33D
P 4700 3200
F 0 "C2" H 4815 3246 50  0000 L CNN
F 1 "0.1u" H 4815 3155 50  0000 L CNN
F 2 "Capacitor_SMD:C_0603_1608Metric_Pad1.05x0.95mm_HandSolder" H 4738 3050 50  0001 C CNN
F 3 "~" H 4700 3200 50  0001 C CNN
	1    4700 3200
	1    0    0    -1  
$EndComp
$Comp
L Device:C C3
U 1 1 5EB3FE5E
P 5100 3200
F 0 "C3" H 5215 3246 50  0000 L CNN
F 1 "47u" H 5215 3155 50  0000 L CNN
F 2 "Capacitor_SMD:C_1210_3225Metric_Pad1.42x2.65mm_HandSolder" H 5138 3050 50  0001 C CNN
F 3 "~" H 5100 3200 50  0001 C CNN
	1    5100 3200
	1    0    0    -1  
$EndComp
$Comp
L Device:C C4
U 1 1 5EB46194
P 4250 4550
F 0 "C4" H 4365 4596 50  0000 L CNN
F 1 "0.1u" H 4365 4505 50  0000 L CNN
F 2 "Capacitor_SMD:C_0603_1608Metric_Pad1.05x0.95mm_HandSolder" H 4288 4400 50  0001 C CNN
F 3 "~" H 4250 4550 50  0001 C CNN
	1    4250 4550
	1    0    0    -1  
$EndComp
$Comp
L Device:C C5
U 1 1 5EB46639
P 4650 4550
F 0 "C5" H 4765 4596 50  0000 L CNN
F 1 "22u" H 4765 4505 50  0000 L CNN
F 2 "Capacitor_SMD:C_0805_2012Metric_Pad1.15x1.40mm_HandSolder" H 4688 4400 50  0001 C CNN
F 3 "~" H 4650 4550 50  0001 C CNN
	1    4650 4550
	1    0    0    -1  
$EndComp
$Comp
L Device:R R4
U 1 1 5EB4818B
P 3100 4550
F 0 "R4" H 3170 4596 50  0000 L CNN
F 1 "1.1k" H 3170 4505 50  0000 L CNN
F 2 "Resistor_SMD:R_0603_1608Metric_Pad1.05x0.95mm_HandSolder" V 3030 4550 50  0001 C CNN
F 3 "~" H 3100 4550 50  0001 C CNN
	1    3100 4550
	1    0    0    -1  
$EndComp
Wire Wire Line
	3100 4200 3250 4200
Wire Wire Line
	3100 4200 3100 4400
Wire Wire Line
	5300 4200 5300 4500
Wire Wire Line
	5300 4500 5400 4500
Connection ~ 4250 4200
Wire Wire Line
	4250 4200 4650 4200
$Comp
L Device:C C6
U 1 1 5EB4F14A
P 5000 4550
F 0 "C6" H 5115 4596 50  0000 L CNN
F 1 "22u" H 5115 4505 50  0000 L CNN
F 2 "Capacitor_SMD:C_0805_2012Metric_Pad1.15x1.40mm_HandSolder" H 5038 4400 50  0001 C CNN
F 3 "~" H 5000 4550 50  0001 C CNN
	1    5000 4550
	1    0    0    -1  
$EndComp
Wire Wire Line
	4250 4400 4250 4200
Wire Wire Line
	4650 4400 4650 4200
Connection ~ 4650 4200
Wire Wire Line
	5000 4400 5000 4200
Wire Wire Line
	4650 4200 5000 4200
Connection ~ 5000 4200
Wire Wire Line
	5000 4200 5300 4200
Wire Wire Line
	3100 4700 3100 4950
Wire Wire Line
	5300 4950 5300 4600
Wire Wire Line
	5300 4600 5400 4600
Wire Wire Line
	3700 4400 3700 4950
Connection ~ 3700 4950
Wire Wire Line
	3700 4950 4250 4950
Wire Wire Line
	3700 5050 3700 4950
Text HLabel 1750 3200 2    50   Output ~ 0
D-
Wire Wire Line
	1550 3100 1900 3100
Wire Wire Line
	1900 3100 1900 2400
Text Label 2700 2300 1    50   ~ 0
VBUS
Text Label 3700 5050 3    50   ~ 0
GND
Wire Wire Line
	4250 4700 4250 4950
Connection ~ 4250 4950
Wire Wire Line
	4250 4950 4650 4950
Wire Wire Line
	4650 4700 4650 4950
Connection ~ 4650 4950
Wire Wire Line
	4650 4950 5000 4950
Wire Wire Line
	5000 4700 5000 4950
Connection ~ 5000 4950
Wire Wire Line
	5000 4950 5300 4950
Text Label 5100 2800 1    50   ~ 0
5V
Wire Wire Line
	5100 2800 5100 2900
Connection ~ 5100 2900
Wire Wire Line
	5100 2900 5100 3050
Text Label 3000 3400 3    50   ~ 0
GND
Text Label 5100 3550 3    50   ~ 0
GND
Wire Wire Line
	5100 3450 5100 3350
Wire Wire Line
	5100 3550 5100 3450
Connection ~ 5100 3450
Connection ~ 4250 2900
Wire Wire Line
	3250 3800 2200 3800
Connection ~ 2700 2400
Wire Wire Line
	2700 2300 2700 2400
Wire Wire Line
	2700 2400 3000 2400
Wire Wire Line
	3000 2800 3000 2900
Wire Wire Line
	2700 2800 2700 2900
Connection ~ 2700 2900
Wire Wire Line
	2700 2900 3000 2900
Wire Wire Line
	2400 2950 2400 2900
Wire Wire Line
	2400 2900 2700 2900
Wire Wire Line
	2400 3250 2400 3300
Connection ~ 2400 3300
Wire Wire Line
	2200 3350 2200 3300
Wire Wire Line
	2200 3300 2400 3300
Wire Wire Line
	2600 3300 2600 3350
Wire Wire Line
	2400 3300 2600 3300
Wire Wire Line
	2200 3650 2200 3800
Wire Wire Line
	2600 3650 2600 3700
Wire Wire Line
	2600 3700 3250 3700
Wire Wire Line
	1900 2400 2700 2400
Wire Wire Line
	3700 4950 3100 4950
Connection ~ 3100 4950
Wire Wire Line
	4250 2900 4700 2900
Wire Wire Line
	4700 3050 4700 2900
Connection ~ 4700 2900
Wire Wire Line
	4700 2900 5100 2900
Wire Wire Line
	4700 3350 4700 3450
Wire Wire Line
	4700 3450 5100 3450
$Comp
L mcp1826t:MCP1826T-ADJE_DC U2
U 1 1 5EB341D8
P 8800 3700
F 0 "U2" H 8825 4115 50  0000 C CNN
F 1 "MCP1826T-ADJE_DC" H 8825 4024 50  0000 C CNN
F 2 "mcp1826:SOT230P700X180-6N" H 8850 3700 50  0001 L BNN
F 3 "Microchip" H 8850 3700 50  0001 L BNN
F 4 "SOT223-5" H 8850 3700 50  0001 L BNN "Field4"
F 5 "MCP1826T-ADJE/DC" H 8850 3700 50  0001 L BNN "Field5"
F 6 "08N6496" H 8850 3700 50  0001 L BNN "Field6"
F 7 "1578432" H 8850 3700 50  0001 L BNN "Field7"
	1    8800 3700
	1    0    0    -1  
$EndComp
$Comp
L Device:C C7
U 1 1 5EB341E6
P 7600 4100
F 0 "C7" V 7852 4100 50  0000 C CNN
F 1 "10u" V 7761 4100 50  0000 C CNN
F 2 "Capacitor_SMD:C_0805_2012Metric_Pad1.15x1.40mm_HandSolder" H 7638 3950 50  0001 C CNN
F 3 "~" H 7600 4100 50  0001 C CNN
	1    7600 4100
	1    0    0    -1  
$EndComp
$Comp
L Device:R R5
U 1 1 5EB341EC
P 8100 3800
F 0 "R5" V 7893 3800 50  0000 C CNN
F 1 "10k" V 7984 3800 50  0000 C CNN
F 2 "Resistor_SMD:R_0603_1608Metric_Pad1.05x0.95mm_HandSolder" V 8030 3800 50  0001 C CNN
F 3 "~" H 8100 3800 50  0001 C CNN
	1    8100 3800
	0    1    1    0   
$EndComp
$Comp
L Device:C C8
U 1 1 5EB341F2
P 9400 4100
F 0 "C8" H 9515 4146 50  0000 L CNN
F 1 "1u" H 9515 4055 50  0000 L CNN
F 2 "Capacitor_SMD:C_0603_1608Metric_Pad1.05x0.95mm_HandSolder" H 9438 3950 50  0001 C CNN
F 3 "~" H 9400 4100 50  0001 C CNN
	1    9400 4100
	1    0    0    -1  
$EndComp
Wire Wire Line
	9400 4250 9400 4350
Wire Wire Line
	9300 3850 9400 3850
Connection ~ 9400 3850
Wire Wire Line
	9400 3850 9400 3950
Wire Wire Line
	8350 3700 8250 3700
Wire Wire Line
	8350 4100 8250 4100
Wire Wire Line
	8250 4100 8250 4000
Wire Wire Line
	8250 4000 8350 4000
Text Notes 8350 4600 0    50   ~ 0
TODO: completar los datos del LDO\nLDO 3V3 a 1 amp
Connection ~ 8250 4100
Text Label 9400 3000 1    50   ~ 0
+3.3V
Wire Wire Line
	8250 3500 8350 3500
Wire Wire Line
	8250 3700 8250 3500
Text Label 8250 4450 3    50   ~ 0
GND
Wire Wire Line
	7600 4250 7600 4350
Wire Wire Line
	7600 4350 8250 4350
Wire Wire Line
	8250 4100 8250 4350
Connection ~ 8250 4350
Wire Wire Line
	8250 4450 8250 4350
Wire Wire Line
	8250 4350 9400 4350
Text HLabel 10100 4050 2    50   Output ~ 0
GND
Text HLabel 10100 3850 2    50   Output ~ 0
+3.3V
Wire Wire Line
	9400 3200 7850 3200
Wire Wire Line
	9400 3200 9400 3850
Wire Wire Line
	8350 3800 8250 3800
Wire Wire Line
	7950 3800 7850 3800
Wire Wire Line
	7850 3800 7850 3200
Wire Wire Line
	9400 3000 9400 3200
Connection ~ 9400 3200
Wire Wire Line
	10100 4050 10000 4050
Wire Wire Line
	10000 4050 10000 4350
Wire Wire Line
	10000 4350 9400 4350
Connection ~ 9400 4350
Wire Wire Line
	7600 3100 7600 3950
Wire Wire Line
	8250 3500 8250 3100
Connection ~ 8250 3500
Wire Wire Line
	8250 3100 7600 3100
Wire Wire Line
	9400 3850 10100 3850
Text Label 7600 1300 1    50   ~ 0
5V
Text HLabel 10100 3650 2    50   Output ~ 0
+5v
Wire Wire Line
	8250 3100 10000 3100
Wire Wire Line
	10000 3100 10000 3650
Wire Wire Line
	10000 3650 10100 3650
Connection ~ 8250 3100
$Comp
L Device:C C1
U 1 1 5EB0EFA6
P 3000 3150
F 0 "C1" H 2885 3104 50  0000 R CNN
F 1 "10u" H 2885 3195 50  0000 R CNN
F 2 "Capacitor_SMD:C_0805_2012Metric_Pad1.15x1.40mm_HandSolder" H 3038 3000 50  0001 C CNN
F 3 "~" H 3000 3150 50  0001 C CNN
	1    3000 3150
	-1   0    0    1   
$EndComp
$Comp
L Device:LED D3
U 1 1 5EB2CA4D
P 2600 3500
F 0 "D3" V 2639 3382 50  0000 R CNN
F 1 "RED" V 2548 3382 50  0000 R CNN
F 2 "LED_SMD:LED_0603_1608Metric_Pad1.05x0.95mm_HandSolder" H 2600 3500 50  0001 C CNN
F 3 "~" H 2600 3500 50  0001 C CNN
	1    2600 3500
	0    -1   -1   0   
$EndComp
$Comp
L Device:LED D2
U 1 1 5EB2D114
P 2200 3500
F 0 "D2" V 2239 3383 50  0000 R CNN
F 1 "GREN" V 2148 3383 50  0000 R CNN
F 2 "LED_SMD:LED_0603_1608Metric_Pad1.05x0.95mm_HandSolder" H 2200 3500 50  0001 C CNN
F 3 "~" H 2200 3500 50  0001 C CNN
	1    2200 3500
	0    -1   -1   0   
$EndComp
$Comp
L Device:R R3
U 1 1 5EB0C5F6
P 3000 2650
F 0 "R3" H 3070 2696 50  0000 L CNN
F 1 "1" H 3070 2605 50  0000 L CNN
F 2 "Resistor_SMD:R_1206_3216Metric_Pad1.42x1.75mm_HandSolder" V 2930 2650 50  0001 C CNN
F 3 "~" H 3000 2650 50  0001 C CNN
	1    3000 2650
	1    0    0    -1  
$EndComp
$Comp
L Device:R R2
U 1 1 5EB0D37A
P 2700 2650
F 0 "R2" H 2770 2696 50  0000 L CNN
F 1 "1" H 2770 2605 50  0000 L CNN
F 2 "Resistor_SMD:R_1206_3216Metric_Pad1.42x1.75mm_HandSolder" V 2630 2650 50  0001 C CNN
F 3 "~" H 2700 2650 50  0001 C CNN
	1    2700 2650
	1    0    0    -1  
$EndComp
$Comp
L Device:R R1
U 1 1 5EB2D5E0
P 2400 3100
F 0 "R1" H 2470 3146 50  0000 L CNN
F 1 "1k" H 2470 3055 50  0000 L CNN
F 2 "Resistor_SMD:R_0603_1608Metric_Pad1.05x0.95mm_HandSolder" V 2330 3100 50  0001 C CNN
F 3 "~" H 2400 3100 50  0001 C CNN
	1    2400 3100
	1    0    0    -1  
$EndComp
$Comp
L FDT434P:FDT434P Q1
U 1 1 5EB504F8
P 7600 2700
F 0 "Q1" H 7708 2746 50  0000 L CNN
F 1 "FDT434P" H 7708 2655 50  0000 L CNN
F 2 "fdt434p:SOT230P700X180-4N" H 7600 2700 50  0001 L BNN
F 3 "Fairchild Semiconductor" H 7600 2700 50  0001 L BNN
	1    7600 2700
	1    0    0    -1  
$EndComp
Wire Wire Line
	7600 3000 7600 3100
Connection ~ 7600 3100
$Comp
L Device:R Rs2
U 1 1 5EB60642
P 7100 1650
F 0 "Rs2" H 7170 1696 50  0000 L CNN
F 1 "100k" H 7170 1605 50  0000 L CNN
F 2 "Resistor_SMD:R_0603_1608Metric_Pad1.05x0.95mm_HandSolder" V 7030 1650 50  0001 C CNN
F 3 "~" H 7100 1650 50  0001 C CNN
	1    7100 1650
	1    0    0    -1  
$EndComp
$Comp
L Device:R Rs1
U 1 1 5EB60F38
P 7150 3850
F 0 "Rs1" H 7220 3896 50  0000 L CNN
F 1 "100k" H 7220 3805 50  0000 L CNN
F 2 "Resistor_SMD:R_0603_1608Metric_Pad1.05x0.95mm_HandSolder" V 7080 3850 50  0001 C CNN
F 3 "~" H 7150 3850 50  0001 C CNN
	1    7150 3850
	1    0    0    -1  
$EndComp
Wire Wire Line
	7600 4350 7150 4350
Wire Wire Line
	7150 4350 7150 4000
Connection ~ 7600 4350
Wire Wire Line
	7100 1800 7100 1900
Wire Wire Line
	7100 1500 7100 1400
Wire Wire Line
	7100 1400 7600 1400
Wire Wire Line
	7600 1400 7600 2400
Wire Wire Line
	7600 1300 7600 1400
Connection ~ 7600 1400
Wire Wire Line
	7300 2600 7000 2600
Wire Wire Line
	7150 2900 7150 3700
Text Notes 6900 2000 0    50   ~ 0
OFF
Text Notes 7050 2850 0    50   ~ 0
ON
$Comp
L usb-micro-b:10118192-0001LF J1
U 1 1 5EBD8216
P 1250 3400
F 0 "J1" H 1250 3965 50  0000 C CNN
F 1 "usb_b_micro" H 1250 3874 50  0000 C CNN
F 2 "usb-mini-b:AMPHENOL_10118192-0001LF" H 1250 3400 50  0001 L BNN
F 3 "B" H 1250 3400 50  0001 L BNN
F 4 "Amphenol" H 1250 3400 50  0001 L BNN "Field4"
F 5 "Manufacturer Recommendation" H 1250 3400 50  0001 L BNN "Field5"
	1    1250 3400
	-1   0    0    -1  
$EndComp
Text HLabel 1750 3300 2    50   Output ~ 0
D+
Wire Wire Line
	1750 3200 1550 3200
Wire Wire Line
	1550 3300 1750 3300
Wire Wire Line
	1550 3500 1900 3500
Wire Wire Line
	1900 3500 1900 4950
Wire Wire Line
	1900 4950 3100 4950
NoConn ~ 1550 3400
NoConn ~ 1550 3600
NoConn ~ 1550 3650
NoConn ~ 1550 3700
NoConn ~ 950  3600
NoConn ~ 950  3650
NoConn ~ 950  3700
Text Notes 3450 2500 0    50   ~ 0
tp5401 o tp5400
$Comp
L Switch:SW_Push_SPDT SW1
U 1 1 5EB546AD
P 6800 2600
F 0 "SW1" H 6800 2885 50  0000 C CNN
F 1 "SW_SLIDE_ON" H 6800 2794 50  0000 C CNN
F 2 "Button_Switch_THT:SW_CuK_OS102011MA1QN1_SPDT_Angled" H 6800 2600 50  0001 C CNN
F 3 "~" H 6800 2600 50  0001 C CNN
	1    6800 2600
	-1   0    0    -1  
$EndComp
Wire Wire Line
	6600 2700 6500 2700
Wire Wire Line
	6500 2700 6500 2900
Wire Wire Line
	6500 2900 7150 2900
Wire Wire Line
	6600 2500 6500 2500
Wire Wire Line
	6500 2500 6500 1900
Wire Wire Line
	6500 1900 7100 1900
$EndSCHEMATC
