
(footprint SOIC127P600X177-16N (layer F.Cu) (tedit 66DA10B1)
  (descr "")
  (attr smd)
  (fp_text reference REF** (at -0.485 -5.872 0) (layer F.SilkS)
    (effects (font (size 1.0 1.0) (thickness 0.15)))
  )
  (fp_text value SOIC127P600X177-16N (at 8.405 5.872 0) (layer F.Fab)
    (effects (font (size 1.0 1.0) (thickness 0.15)))
  )
  (pad 1 smd roundrect (roundrect_rratio 0.125) (at -2.655 -4.445) (size 1.61 0.59) (layers F.Cu F.Mask F.Paste) (solder_mask_margin 0.102))
  (pad 2 smd roundrect (roundrect_rratio 0.125) (at -2.655 -3.175) (size 1.61 0.59) (layers F.Cu F.Mask F.Paste) (solder_mask_margin 0.102))
  (pad 3 smd roundrect (roundrect_rratio 0.125) (at -2.655 -1.905) (size 1.61 0.59) (layers F.Cu F.Mask F.Paste) (solder_mask_margin 0.102))
  (pad 4 smd roundrect (roundrect_rratio 0.125) (at -2.655 -0.635) (size 1.61 0.59) (layers F.Cu F.Mask F.Paste) (solder_mask_margin 0.102))
  (pad 5 smd roundrect (roundrect_rratio 0.125) (at -2.655 0.635) (size 1.61 0.59) (layers F.Cu F.Mask F.Paste) (solder_mask_margin 0.102))
  (pad 6 smd roundrect (roundrect_rratio 0.125) (at -2.655 1.905) (size 1.61 0.59) (layers F.Cu F.Mask F.Paste) (solder_mask_margin 0.102))
  (pad 7 smd roundrect (roundrect_rratio 0.125) (at -2.655 3.175) (size 1.61 0.59) (layers F.Cu F.Mask F.Paste) (solder_mask_margin 0.102))
  (pad 8 smd roundrect (roundrect_rratio 0.125) (at -2.655 4.445) (size 1.61 0.59) (layers F.Cu F.Mask F.Paste) (solder_mask_margin 0.102))
  (pad 9 smd roundrect (roundrect_rratio 0.125) (at 2.655 4.445) (size 1.61 0.59) (layers F.Cu F.Mask F.Paste) (solder_mask_margin 0.102))
  (pad 10 smd roundrect (roundrect_rratio 0.125) (at 2.655 3.175) (size 1.61 0.59) (layers F.Cu F.Mask F.Paste) (solder_mask_margin 0.102))
  (pad 11 smd roundrect (roundrect_rratio 0.125) (at 2.655 1.905) (size 1.61 0.59) (layers F.Cu F.Mask F.Paste) (solder_mask_margin 0.102))
  (pad 12 smd roundrect (roundrect_rratio 0.125) (at 2.655 0.635) (size 1.61 0.59) (layers F.Cu F.Mask F.Paste) (solder_mask_margin 0.102))
  (pad 13 smd roundrect (roundrect_rratio 0.125) (at 2.655 -0.635) (size 1.61 0.59) (layers F.Cu F.Mask F.Paste) (solder_mask_margin 0.102))
  (pad 14 smd roundrect (roundrect_rratio 0.125) (at 2.655 -1.905) (size 1.61 0.59) (layers F.Cu F.Mask F.Paste) (solder_mask_margin 0.102))
  (pad 15 smd roundrect (roundrect_rratio 0.125) (at 2.655 -3.175) (size 1.61 0.59) (layers F.Cu F.Mask F.Paste) (solder_mask_margin 0.102))
  (pad 16 smd roundrect (roundrect_rratio 0.125) (at 2.655 -4.445) (size 1.61 0.59) (layers F.Cu F.Mask F.Paste) (solder_mask_margin 0.102))
  (fp_circle (center -4.011 -4.527) (end -3.911 -4.527) (layer F.SilkS) (width 0.2))
  (fp_circle (center -4.011 -4.527) (end -3.911 -4.527) (layer F.Fab) (width 0.2))
  (fp_line (start -1.95 -4.95) (end 1.95 -4.95) (layer F.Fab) (width 0.127))
  (fp_line (start -1.95 4.95) (end 1.95 4.95) (layer F.Fab) (width 0.127))
  (fp_line (start -1.5 -4.95) (end 1.5 -4.95) (layer F.SilkS) (width 0.127))
  (fp_line (start -1.5 4.95) (end 1.5 4.95) (layer F.SilkS) (width 0.127))
  (fp_line (start -1.95 -4.95) (end -1.95 4.95) (layer F.Fab) (width 0.127))
  (fp_line (start 1.95 -4.95) (end 1.95 4.95) (layer F.Fab) (width 0.127))
  (fp_line (start -3.71 -5.2) (end 3.71 -5.2) (layer F.CrtYd) (width 0.05))
  (fp_line (start -3.71 5.2) (end 3.71 5.2) (layer F.CrtYd) (width 0.05))
  (fp_line (start -3.71 -5.2) (end -3.71 5.2) (layer F.CrtYd) (width 0.05))
  (fp_line (start 3.71 -5.2) (end 3.71 5.2) (layer F.CrtYd) (width 0.05))
)