EESchema Schematic File Version 4
EELAYER 30 0
EELAYER END
$Descr A4 11693 8268
encoding utf-8
Sheet 1 1
Title ""
Date ""
Rev ""
Comp ""
Comment1 ""
Comment2 ""
Comment3 ""
Comment4 ""
$EndDescr
$Comp
L ESP8266:ESP-12E U1
U 1 1 5D62BFD6
P 8800 5450
F 0 "U1" H 8800 6215 50  0000 C CNN
F 1 "ESP-12E" H 8800 6124 50  0000 C CNN
F 2 "" H 8800 5450 50  0001 C CNN
F 3 "http://l0l.org.uk/2014/12/esp8266-modules-hardware-guide-gotta-catch-em-all/" H 8800 5450 50  0001 C CNN
	1    8800 5450
	1    0    0    -1  
$EndComp
$Comp
L LED:WS2812B D1
U 1 1 5DFA95F9
P 1550 5050
F 0 "D1" H 1800 4950 50  0000 L CNN
F 1 "WS2812B" H 1800 4850 50  0000 L CNN
F 2 "LED_SMD:LED_WS2812B_PLCC4_5.0x5.0mm_P3.2mm" H 1600 4750 50  0001 L TNN
F 3 "https://cdn-shop.adafruit.com/datasheets/WS2812B.pdf" H 1650 4675 50  0001 L TNN
	1    1550 5050
	1    0    0    -1  
$EndComp
$Comp
L Switch:SW_Push SW2
U 1 1 5DFACC2D
P 9050 3300
F 0 "SW2" H 9050 3585 50  0000 C CNN
F 1 "On" H 9050 3494 50  0000 C CNN
F 2 "" H 9050 3500 50  0001 C CNN
F 3 "~" H 9050 3500 50  0001 C CNN
	1    9050 3300
	1    0    0    -1  
$EndComp
$Comp
L Switch:SW_DIP_x01 SW3
U 1 1 5DFAD802
P 8750 4000
F 0 "SW3" H 8750 4267 50  0000 C CNN
F 1 "wake" H 8750 4176 50  0000 C CNN
F 2 "" H 8750 4000 50  0001 C CNN
F 3 "~" H 8750 4000 50  0001 C CNN
	1    8750 4000
	1    0    0    -1  
$EndComp
$Comp
L Switch:SW_Push SW4
U 1 1 5DFAE71C
P 10400 4050
F 0 "SW4" H 10400 4335 50  0000 C CNN
F 1 "Reset" H 10400 4244 50  0000 C CNN
F 2 "" H 10400 4250 50  0001 C CNN
F 3 "~" H 10400 4250 50  0001 C CNN
	1    10400 4050
	0    -1   -1   0   
$EndComp
$Comp
L Connector:Conn_01x03_Male J2
U 1 1 5DFB35DF
P 6100 2850
F 0 "J2" H 6208 3131 50  0000 C CNN
F 1 "power" H 6208 3040 50  0000 C CNN
F 2 "" H 6100 2850 50  0001 C CNN
F 3 "~" H 6100 2850 50  0001 C CNN
	1    6100 2850
	1    0    0    -1  
$EndComp
$Comp
L Connector_Generic:Conn_01x04 J5
U 1 1 5DFB9842
P 6450 6600
F 0 "J5" H 6530 6592 50  0000 L CNN
F 1 "bridgeH" H 6530 6501 50  0000 L CNN
F 2 "" H 6450 6600 50  0001 C CNN
F 3 "~" H 6450 6600 50  0001 C CNN
	1    6450 6600
	1    0    0    -1  
$EndComp
$Comp
L Connector_Generic:Conn_01x02 J3
U 1 1 5DFB76EF
P 8700 950
F 0 "J3" H 8780 942 50  0000 L CNN
F 1 "pout" H 8780 851 50  0000 L CNN
F 2 "" H 8700 950 50  0001 C CNN
F 3 "~" H 8700 950 50  0001 C CNN
	1    8700 950 
	1    0    0    -1  
$EndComp
$Comp
L Connector_Generic:Conn_02x12_Odd_Even J6
U 1 1 5DFC4AA9
P 10300 1250
F 0 "J6" H 10350 1967 50  0000 C CNN
F 1 "gpio" H 10350 1876 50  0000 C CNN
F 2 "" H 10300 1250 50  0001 C CNN
F 3 "~" H 10300 1250 50  0001 C CNN
	1    10300 1250
	1    0    0    -1  
$EndComp
$Comp
L Connector_Generic:Conn_02x04_Odd_Even J4
U 1 1 5DFCB86C
P 4600 4800
F 0 "J4" H 4650 5117 50  0000 C CNN
F 1 "i2c" H 4650 5026 50  0000 C CNN
F 2 "" H 4600 4800 50  0001 C CNN
F 3 "~" H 4600 4800 50  0001 C CNN
	1    4600 4800
	1    0    0    -1  
$EndComp
NoConn ~ 8550 6350
NoConn ~ 8650 6350
NoConn ~ 8750 6350
NoConn ~ 8850 6350
NoConn ~ 8950 6350
NoConn ~ 9050 6350
Text GLabel 9800 5150 2    50   Output ~ 0
4
Wire Wire Line
	9800 5150 9700 5150
Text GLabel 9800 5250 2    50   Input ~ 0
3
Wire Wire Line
	9800 5250 9700 5250
Text GLabel 7800 5150 0    50   Input ~ 0
RESET
Wire Wire Line
	7800 5150 7900 5150
$Comp
L power:+3V3 #PWR0101
U 1 1 5DFD4CB8
P 7800 5850
F 0 "#PWR0101" H 7800 5700 50  0001 C CNN
F 1 "+3V3" V 7815 5978 50  0000 L CNN
F 2 "" H 7800 5850 50  0001 C CNN
F 3 "" H 7800 5850 50  0001 C CNN
	1    7800 5850
	0    -1   -1   0   
$EndComp
Wire Wire Line
	7800 5850 7900 5850
$Comp
L power:GND #PWR0102
U 1 1 5DFD61DB
P 9800 5850
F 0 "#PWR0102" H 9800 5600 50  0001 C CNN
F 1 "GND" V 9805 5722 50  0000 R CNN
F 2 "" H 9800 5850 50  0001 C CNN
F 3 "" H 9800 5850 50  0001 C CNN
	1    9800 5850
	0    -1   -1   0   
$EndComp
Wire Wire Line
	9800 5850 9700 5850
Text GLabel 7800 5350 0    50   Input ~ 0
CH_PD
Wire Wire Line
	7800 5350 7900 5350
Text GLabel 7800 5250 0    50   Input ~ 0
ADC
Wire Wire Line
	7900 5250 7800 5250
Text GLabel 10000 750  0    50   BiDi ~ 0
A0
Wire Wire Line
	10000 750  10100 750 
$Comp
L power:VCC #PWR0103
U 1 1 5DFC1978
P 10000 850
F 0 "#PWR0103" H 10000 700 50  0001 C CNN
F 1 "VCC" V 10018 977 50  0000 L CNN
F 2 "" H 10000 850 50  0001 C CNN
F 3 "" H 10000 850 50  0001 C CNN
	1    10000 850 
	0    -1   -1   0   
$EndComp
Wire Wire Line
	10000 850  10100 850 
Wire Wire Line
	10700 850  10600 850 
$Comp
L power:GND #PWR0105
U 1 1 5DFC3669
P 10000 950
F 0 "#PWR0105" H 10000 700 50  0001 C CNN
F 1 "GND" V 10005 822 50  0000 R CNN
F 2 "" H 10000 950 50  0001 C CNN
F 3 "" H 10000 950 50  0001 C CNN
	1    10000 950 
	0    1    1    0   
$EndComp
Wire Wire Line
	10000 950  10100 950 
$Comp
L power:GND #PWR0106
U 1 1 5DFC468C
P 10700 950
F 0 "#PWR0106" H 10700 700 50  0001 C CNN
F 1 "GND" V 10705 822 50  0000 R CNN
F 2 "" H 10700 950 50  0001 C CNN
F 3 "" H 10700 950 50  0001 C CNN
	1    10700 950 
	0    -1   -1   0   
$EndComp
Wire Wire Line
	10700 950  10600 950 
$Comp
L power:VCC #PWR0107
U 1 1 5DFCB85B
P 10700 1150
F 0 "#PWR0107" H 10700 1000 50  0001 C CNN
F 1 "VCC" V 10717 1278 50  0000 L CNN
F 2 "" H 10700 1150 50  0001 C CNN
F 3 "" H 10700 1150 50  0001 C CNN
	1    10700 1150
	0    1    1    0   
$EndComp
Wire Wire Line
	10700 1150 10600 1150
$Comp
L power:GND #PWR0108
U 1 1 5DFCB866
P 10700 1250
F 0 "#PWR0108" H 10700 1000 50  0001 C CNN
F 1 "GND" V 10705 1122 50  0000 R CNN
F 2 "" H 10700 1250 50  0001 C CNN
F 3 "" H 10700 1250 50  0001 C CNN
	1    10700 1250
	0    -1   -1   0   
$EndComp
Wire Wire Line
	10700 1250 10600 1250
$Comp
L power:VCC #PWR0109
U 1 1 5DFCE33A
P 10700 1450
F 0 "#PWR0109" H 10700 1300 50  0001 C CNN
F 1 "VCC" V 10717 1578 50  0000 L CNN
F 2 "" H 10700 1450 50  0001 C CNN
F 3 "" H 10700 1450 50  0001 C CNN
	1    10700 1450
	0    1    1    0   
$EndComp
Wire Wire Line
	10700 1450 10600 1450
$Comp
L power:GND #PWR0110
U 1 1 5DFCE345
P 10700 1550
F 0 "#PWR0110" H 10700 1300 50  0001 C CNN
F 1 "GND" V 10705 1422 50  0000 R CNN
F 2 "" H 10700 1550 50  0001 C CNN
F 3 "" H 10700 1550 50  0001 C CNN
	1    10700 1550
	0    -1   -1   0   
$EndComp
Wire Wire Line
	10700 1550 10600 1550
$Comp
L power:VCC #PWR0111
U 1 1 5DFCE350
P 10700 1750
F 0 "#PWR0111" H 10700 1600 50  0001 C CNN
F 1 "VCC" V 10717 1878 50  0000 L CNN
F 2 "" H 10700 1750 50  0001 C CNN
F 3 "" H 10700 1750 50  0001 C CNN
	1    10700 1750
	0    1    1    0   
$EndComp
Wire Wire Line
	10700 1750 10600 1750
$Comp
L power:GND #PWR0112
U 1 1 5DFCE35B
P 10700 1850
F 0 "#PWR0112" H 10700 1600 50  0001 C CNN
F 1 "GND" V 10705 1722 50  0000 R CNN
F 2 "" H 10700 1850 50  0001 C CNN
F 3 "" H 10700 1850 50  0001 C CNN
	1    10700 1850
	0    -1   -1   0   
$EndComp
Wire Wire Line
	10700 1850 10600 1850
Text GLabel 10700 750  2    50   BiDi ~ 0
0
Wire Wire Line
	10700 750  10600 750 
Text GLabel 10700 1050 2    50   BiDi ~ 0
6
Text GLabel 10700 1350 2    50   BiDi ~ 0
4
Text GLabel 10700 1650 2    50   BiDi ~ 0
2
Wire Wire Line
	10600 1050 10700 1050
Wire Wire Line
	10600 1350 10700 1350
Wire Wire Line
	10600 1650 10700 1650
Text GLabel 10000 1050 0    50   BiDi ~ 0
5
Wire Wire Line
	10000 1050 10100 1050
$Comp
L power:VCC #PWR0113
U 1 1 5DFD4D76
P 10000 1150
F 0 "#PWR0113" H 10000 1000 50  0001 C CNN
F 1 "VCC" V 10018 1277 50  0000 L CNN
F 2 "" H 10000 1150 50  0001 C CNN
F 3 "" H 10000 1150 50  0001 C CNN
	1    10000 1150
	0    -1   -1   0   
$EndComp
Wire Wire Line
	10000 1150 10100 1150
$Comp
L power:GND #PWR0114
U 1 1 5DFD4D81
P 10000 1250
F 0 "#PWR0114" H 10000 1000 50  0001 C CNN
F 1 "GND" V 10005 1122 50  0000 R CNN
F 2 "" H 10000 1250 50  0001 C CNN
F 3 "" H 10000 1250 50  0001 C CNN
	1    10000 1250
	0    1    1    0   
$EndComp
Wire Wire Line
	10000 1250 10100 1250
Text GLabel 10000 1350 0    50   BiDi ~ 0
3
Wire Wire Line
	10000 1350 10100 1350
$Comp
L power:VCC #PWR0115
U 1 1 5DFDA0E0
P 10000 1450
F 0 "#PWR0115" H 10000 1300 50  0001 C CNN
F 1 "VCC" V 10018 1577 50  0000 L CNN
F 2 "" H 10000 1450 50  0001 C CNN
F 3 "" H 10000 1450 50  0001 C CNN
	1    10000 1450
	0    -1   -1   0   
$EndComp
Wire Wire Line
	10000 1450 10100 1450
$Comp
L power:GND #PWR0116
U 1 1 5DFDA0EB
P 10000 1550
F 0 "#PWR0116" H 10000 1300 50  0001 C CNN
F 1 "GND" V 10005 1422 50  0000 R CNN
F 2 "" H 10000 1550 50  0001 C CNN
F 3 "" H 10000 1550 50  0001 C CNN
	1    10000 1550
	0    1    1    0   
$EndComp
Wire Wire Line
	10000 1550 10100 1550
Text GLabel 10000 1650 0    50   BiDi ~ 0
1
Wire Wire Line
	10000 1650 10100 1650
$Comp
L power:VCC #PWR0117
U 1 1 5DFDA0F8
P 10000 1750
F 0 "#PWR0117" H 10000 1600 50  0001 C CNN
F 1 "VCC" V 10018 1877 50  0000 L CNN
F 2 "" H 10000 1750 50  0001 C CNN
F 3 "" H 10000 1750 50  0001 C CNN
	1    10000 1750
	0    -1   -1   0   
$EndComp
Wire Wire Line
	10000 1750 10100 1750
$Comp
L power:GND #PWR0118
U 1 1 5DFDA103
P 10000 1850
F 0 "#PWR0118" H 10000 1600 50  0001 C CNN
F 1 "GND" V 10005 1722 50  0000 R CNN
F 2 "" H 10000 1850 50  0001 C CNN
F 3 "" H 10000 1850 50  0001 C CNN
	1    10000 1850
	0    1    1    0   
$EndComp
Wire Wire Line
	10000 1850 10100 1850
$Comp
L power:GND #PWR0119
U 1 1 5DFEB21F
P 4300 4700
F 0 "#PWR0119" H 4300 4450 50  0001 C CNN
F 1 "GND" V 4305 4572 50  0000 R CNN
F 2 "" H 4300 4700 50  0001 C CNN
F 3 "" H 4300 4700 50  0001 C CNN
	1    4300 4700
	0    1    1    0   
$EndComp
$Comp
L power:GND #PWR0120
U 1 1 5DFEB4CC
P 5000 4700
F 0 "#PWR0120" H 5000 4450 50  0001 C CNN
F 1 "GND" V 5005 4572 50  0000 R CNN
F 2 "" H 5000 4700 50  0001 C CNN
F 3 "" H 5000 4700 50  0001 C CNN
	1    5000 4700
	0    -1   -1   0   
$EndComp
$Comp
L power:VCC #PWR0121
U 1 1 5DFED27B
P 4300 4800
F 0 "#PWR0121" H 4300 4650 50  0001 C CNN
F 1 "VCC" V 4318 4927 50  0000 L CNN
F 2 "" H 4300 4800 50  0001 C CNN
F 3 "" H 4300 4800 50  0001 C CNN
	1    4300 4800
	0    -1   -1   0   
$EndComp
$Comp
L power:VCC #PWR0122
U 1 1 5DFED729
P 5000 4800
F 0 "#PWR0122" H 5000 4650 50  0001 C CNN
F 1 "VCC" V 5017 4928 50  0000 L CNN
F 2 "" H 5000 4800 50  0001 C CNN
F 3 "" H 5000 4800 50  0001 C CNN
	1    5000 4800
	0    1    1    0   
$EndComp
Wire Wire Line
	4300 4700 4400 4700
Wire Wire Line
	4900 4700 5000 4700
Wire Wire Line
	4900 4800 5000 4800
Wire Wire Line
	4300 4800 4400 4800
Text GLabel 4300 5000 0    50   BiDi ~ 0
SDA
Text GLabel 4300 4900 0    50   Input ~ 0
SCL
Text GLabel 5000 4900 2    50   Input ~ 0
SCL
Wire Wire Line
	5000 5000 4900 5000
Text GLabel 5000 5000 2    50   BiDi ~ 0
SDA
Wire Wire Line
	4900 4900 5000 4900
Wire Wire Line
	4300 4900 4400 4900
Wire Wire Line
	4300 5000 4400 5000
$Comp
L Connector:Conn_01x04_Male J7
U 1 1 5DFFA242
P 3300 4800
F 0 "J7" H 3408 5081 50  0000 C CNN
F 1 "OLED" H 3408 4990 50  0000 C CNN
F 2 "" H 3300 4800 50  0001 C CNN
F 3 "~" H 3300 4800 50  0001 C CNN
	1    3300 4800
	1    0    0    -1  
$EndComp
$Comp
L power:GND #PWR0123
U 1 1 5DFFBFB5
P 3600 4700
F 0 "#PWR0123" H 3600 4450 50  0001 C CNN
F 1 "GND" V 3605 4572 50  0000 R CNN
F 2 "" H 3600 4700 50  0001 C CNN
F 3 "" H 3600 4700 50  0001 C CNN
	1    3600 4700
	0    -1   -1   0   
$EndComp
$Comp
L power:+3V3 #PWR0124
U 1 1 5DFFCD9C
P 3600 4800
F 0 "#PWR0124" H 3600 4650 50  0001 C CNN
F 1 "+3V3" V 3615 4928 50  0000 L CNN
F 2 "" H 3600 4800 50  0001 C CNN
F 3 "" H 3600 4800 50  0001 C CNN
	1    3600 4800
	0    1    1    0   
$EndComp
Text GLabel 3600 5000 2    50   BiDi ~ 0
SDA
Text GLabel 3600 4900 2    50   Input ~ 0
SCL
Wire Wire Line
	3600 4700 3500 4700
Wire Wire Line
	3600 4800 3500 4800
Wire Wire Line
	3600 4900 3500 4900
Wire Wire Line
	3600 5000 3500 5000
$Comp
L Connector_Generic:Conn_01x04 J8
U 1 1 5E0670C0
P 2600 4800
F 0 "J8" H 2600 5100 50  0000 C CNN
F 1 "grove" H 2600 5050 50  0000 C CNN
F 2 "" H 2600 4800 50  0001 C CNN
F 3 "~" H 2600 4800 50  0001 C CNN
	1    2600 4800
	-1   0    0    -1  
$EndComp
$Comp
L power:GND #PWR0126
U 1 1 5E06BB98
P 2900 4700
F 0 "#PWR0126" H 2900 4450 50  0001 C CNN
F 1 "GND" V 2905 4572 50  0000 R CNN
F 2 "" H 2900 4700 50  0001 C CNN
F 3 "" H 2900 4700 50  0001 C CNN
	1    2900 4700
	0    -1   -1   0   
$EndComp
Text GLabel 2900 4900 2    50   BiDi ~ 0
SDA
Text GLabel 2900 5000 2    50   Input ~ 0
SCL
Wire Wire Line
	2900 4700 2800 4700
Wire Wire Line
	2900 4800 2800 4800
Wire Wire Line
	2900 4900 2800 4900
Wire Wire Line
	2900 5000 2800 5000
Text GLabel 6150 6500 0    50   Input ~ 0
M1A
Text GLabel 6150 6600 0    50   Input ~ 0
M1B
Text GLabel 6150 6700 0    50   Input ~ 0
M2A
Text GLabel 6150 6800 0    50   Input ~ 0
M2B
Wire Wire Line
	6150 6500 6250 6500
Wire Wire Line
	6150 6600 6250 6600
Wire Wire Line
	6150 6700 6250 6700
Wire Wire Line
	6150 6800 6250 6800
Text GLabel 2550 6350 0    50   BiDi ~ 0
SDA
Text GLabel 2550 6450 0    50   Input ~ 0
SCL
Wire Wire Line
	2550 6350 2650 6350
Wire Wire Line
	2550 6450 2650 6450
Text GLabel 4250 6350 0    50   BiDi ~ 0
SDA
Text GLabel 4250 6450 0    50   Input ~ 0
SCL
Wire Wire Line
	4250 6350 4350 6350
Wire Wire Line
	4250 6450 4350 6450
Text GLabel 3750 6350 2    50   Input ~ 0
M1A
Text GLabel 3750 6500 2    50   Input ~ 0
M1B
Wire Wire Line
	3750 6350 3650 6350
Wire Wire Line
	3750 6500 3650 6500
Text GLabel 5450 6350 2    50   Input ~ 0
M2A
Text GLabel 5450 6500 2    50   Input ~ 0
M2B
Wire Wire Line
	5450 6350 5350 6350
Wire Wire Line
	5450 6500 5350 6500
$Comp
L power:GND #PWR0129
U 1 1 5E0F1B01
P 4850 7250
F 0 "#PWR0129" H 4850 7000 50  0001 C CNN
F 1 "GND" H 4855 7077 50  0000 C CNN
F 2 "" H 4850 7250 50  0001 C CNN
F 3 "" H 4850 7250 50  0001 C CNN
	1    4850 7250
	1    0    0    -1  
$EndComp
$Comp
L power:GND #PWR0130
U 1 1 5E0F1D26
P 3150 7250
F 0 "#PWR0130" H 3150 7000 50  0001 C CNN
F 1 "GND" H 3155 7077 50  0000 C CNN
F 2 "" H 3150 7250 50  0001 C CNN
F 3 "" H 3150 7250 50  0001 C CNN
	1    3150 7250
	1    0    0    -1  
$EndComp
Wire Wire Line
	3150 7250 3150 7200
Wire Wire Line
	4850 7250 4850 7200
$Comp
L power:VCC #PWR0131
U 1 1 5E0F67C8
P 850 6300
F 0 "#PWR0131" H 850 6150 50  0001 C CNN
F 1 "VCC" H 867 6473 50  0000 C CNN
F 2 "" H 850 6300 50  0001 C CNN
F 3 "" H 850 6300 50  0001 C CNN
	1    850  6300
	0    -1   -1   0   
$EndComp
Wire Wire Line
	4850 6000 4850 6100
$Comp
L Device:R R23
U 1 1 5E0FA311
P 5450 7050
F 0 "R23" H 5520 7096 50  0000 L CNN
F 1 "R" H 5520 7005 50  0000 L CNN
F 2 "" V 5380 7050 50  0001 C CNN
F 3 "~" H 5450 7050 50  0001 C CNN
	1    5450 7050
	1    0    0    -1  
$EndComp
$Comp
L power:GND #PWR0133
U 1 1 5E0FAB41
P 5450 7300
F 0 "#PWR0133" H 5450 7050 50  0001 C CNN
F 1 "GND" H 5455 7127 50  0000 C CNN
F 2 "" H 5450 7300 50  0001 C CNN
F 3 "" H 5450 7300 50  0001 C CNN
	1    5450 7300
	1    0    0    -1  
$EndComp
Wire Wire Line
	5350 6800 5450 6800
Wire Wire Line
	5450 6800 5450 6900
Wire Wire Line
	5450 7200 5450 7250
NoConn ~ 4350 6950
NoConn ~ 2650 6950
Wire Wire Line
	3150 6000 3150 6100
Text Notes 3950 7550 0    50   ~ 0
Por ahora usaré\nla siguiente ferrita\nFERR0805 600
Wire Wire Line
	3750 7200 3750 7250
Wire Wire Line
	3750 6800 3750 6900
Wire Wire Line
	3650 6800 3750 6800
$Comp
L power:GND #PWR0134
U 1 1 5E0FFCD3
P 3750 7300
F 0 "#PWR0134" H 3750 7050 50  0001 C CNN
F 1 "GND" H 3755 7127 50  0000 C CNN
F 2 "" H 3750 7300 50  0001 C CNN
F 3 "" H 3750 7300 50  0001 C CNN
	1    3750 7300
	1    0    0    -1  
$EndComp
$Comp
L Device:R R21
U 1 1 5E0FFCC9
P 3750 7050
F 0 "R21" H 3820 7096 50  0000 L CNN
F 1 "R" H 3820 7005 50  0000 L CNN
F 2 "" V 3680 7050 50  0001 C CNN
F 3 "~" H 3750 7050 50  0001 C CNN
	1    3750 7050
	1    0    0    -1  
$EndComp
$Comp
L motor_driver:drv8830 U?
U 1 1 5DFFCF4C
P 3150 6600
F 0 "U?" H 3400 7300 50  0000 C CNN
F 1 "drv8830" H 3400 7200 50  0000 C CNN
F 2 "Package_SO:MSOP-10-1EP_3x3mm_P0.5mm_EP1.73x1.98mm" H 3100 6850 28  0001 C CNN
F 3 "" H 3100 6850 28  0001 C CNN
	1    3150 6600
	1    0    0    -1  
$EndComp
$Comp
L motor_driver:drv8830 U?
U 1 1 5DFFD950
P 4850 6600
F 0 "U?" H 5100 7300 50  0000 C CNN
F 1 "drv8830" H 5100 7200 50  0000 C CNN
F 2 "Package_SO:MSOP-10-1EP_3x3mm_P0.5mm_EP1.73x1.98mm" H 4800 6850 28  0001 C CNN
F 3 "" H 4800 6850 28  0001 C CNN
	1    4850 6600
	1    0    0    -1  
$EndComp
Wire Wire Line
	3400 7150 3400 7200
Wire Wire Line
	3400 7200 3150 7200
Connection ~ 3150 7200
Wire Wire Line
	3150 7200 3150 7150
Wire Wire Line
	5100 7150 5100 7200
Wire Wire Line
	5100 7200 4850 7200
Connection ~ 4850 7200
Wire Wire Line
	4850 7200 4850 7150
Text GLabel 10700 850  2    50   BiDi ~ 0
7
Text GLabel 7800 5450 0    50   BiDi ~ 0
0
Wire Wire Line
	7800 5450 7900 5450
Text GLabel 7800 5550 0    50   BiDi ~ 0
1
Wire Wire Line
	7800 5550 7900 5550
Text GLabel 7800 5650 0    50   BiDi ~ 0
2
Wire Wire Line
	7900 5650 7800 5650
Text GLabel 7800 5750 0    50   BiDi ~ 0
6
Wire Wire Line
	7800 5750 7900 5750
Text GLabel 9800 5350 2    50   BiDi ~ 0
9
Wire Wire Line
	9800 5350 9700 5350
Text GLabel 9800 5450 2    50   BiDi ~ 0
10
Wire Wire Line
	9800 5450 9700 5450
Text GLabel 9800 5550 2    50   BiDi ~ 0
8
Wire Wire Line
	9700 5550 9800 5550
Text GLabel 9800 5650 2    50   BiDi ~ 0
5
Wire Wire Line
	9700 5650 9800 5650
Text GLabel 9800 5750 2    50   BiDi ~ 0
7
Wire Wire Line
	9700 5750 9800 5750
Text GLabel 10400 5350 0    50   BiDi ~ 0
1
Text GLabel 10400 5450 0    50   BiDi ~ 0
2
Text GLabel 10400 5550 0    50   BiDi ~ 0
3
Text GLabel 10400 5650 0    50   BiDi ~ 0
4
Text GLabel 10400 5750 0    50   BiDi ~ 0
5
Text GLabel 10400 5850 0    50   BiDi ~ 0
6
Text GLabel 10400 5950 0    50   BiDi ~ 0
7
Text GLabel 10400 6050 0    50   BiDi ~ 0
8
Text GLabel 10400 5250 0    50   BiDi ~ 0
0
Text GLabel 10400 6150 0    50   BiDi ~ 0
9
Text GLabel 10400 6250 0    50   BiDi ~ 0
10
Text GLabel 10500 6050 2    50   BiDi ~ 0
flash
$Comp
L Device:R R1
U 1 1 5E020FB2
P 10650 3450
F 0 "R1" H 10720 3496 50  0000 L CNN
F 1 "12k" H 10720 3405 50  0000 L CNN
F 2 "" V 10580 3450 50  0001 C CNN
F 3 "~" H 10650 3450 50  0001 C CNN
	1    10650 3450
	1    0    0    -1  
$EndComp
$Comp
L Device:R R22
U 1 1 5E025A40
P 4000 7050
F 0 "R22" H 4070 7096 50  0000 L CNN
F 1 "R" H 4070 7005 50  0000 L CNN
F 2 "" V 3930 7050 50  0001 C CNN
F 3 "~" H 4000 7050 50  0001 C CNN
	1    4000 7050
	1    0    0    -1  
$EndComp
Wire Wire Line
	4000 7200 4000 7250
Wire Wire Line
	4000 7250 3750 7250
Connection ~ 3750 7250
Wire Wire Line
	3750 7250 3750 7300
Wire Wire Line
	4000 6900 4000 6800
Wire Wire Line
	4000 6800 3750 6800
Connection ~ 3750 6800
$Comp
L Device:R R24
U 1 1 5E03293D
P 5700 7050
F 0 "R24" H 5770 7096 50  0000 L CNN
F 1 "R" H 5770 7005 50  0000 L CNN
F 2 "" V 5630 7050 50  0001 C CNN
F 3 "~" H 5700 7050 50  0001 C CNN
	1    5700 7050
	1    0    0    -1  
$EndComp
Wire Wire Line
	5700 7200 5700 7250
Wire Wire Line
	5700 7250 5450 7250
Connection ~ 5450 7250
Wire Wire Line
	5450 7250 5450 7300
Wire Wire Line
	5700 6900 5700 6800
Wire Wire Line
	5700 6800 5450 6800
Connection ~ 5450 6800
$Comp
L power:+3V3 #PWR?
U 1 1 5E0401F3
P 10650 3200
F 0 "#PWR?" H 10650 3050 50  0001 C CNN
F 1 "+3V3" H 10665 3373 50  0000 C CNN
F 2 "" H 10650 3200 50  0001 C CNN
F 3 "" H 10650 3200 50  0001 C CNN
	1    10650 3200
	1    0    0    -1  
$EndComp
Wire Wire Line
	10650 3200 10650 3300
Wire Wire Line
	10650 3600 10650 3750
Text GLabel 10750 3750 2    50   Output ~ 0
RESET
$Comp
L Device:C C?
U 1 1 5E05ECF9
P 10650 4050
F 0 "C?" H 10765 4096 50  0000 L CNN
F 1 "100nF" H 10765 4005 50  0000 L CNN
F 2 "" H 10688 3900 50  0001 C CNN
F 3 "~" H 10650 4050 50  0001 C CNN
	1    10650 4050
	1    0    0    -1  
$EndComp
$Comp
L power:GND #PWR?
U 1 1 5E05FE46
P 10650 4350
F 0 "#PWR?" H 10650 4100 50  0001 C CNN
F 1 "GND" H 10655 4177 50  0000 C CNN
F 2 "" H 10650 4350 50  0001 C CNN
F 3 "" H 10650 4350 50  0001 C CNN
	1    10650 4350
	1    0    0    -1  
$EndComp
Wire Wire Line
	10750 3750 10650 3750
Connection ~ 10650 3750
Wire Wire Line
	10650 3900 10650 3750
$Comp
L power:GND #PWR?
U 1 1 5E06E72D
P 10400 4350
F 0 "#PWR?" H 10400 4100 50  0001 C CNN
F 1 "GND" H 10405 4177 50  0000 C CNN
F 2 "" H 10400 4350 50  0001 C CNN
F 3 "" H 10400 4350 50  0001 C CNN
	1    10400 4350
	1    0    0    -1  
$EndComp
Wire Wire Line
	10650 4200 10650 4350
Wire Wire Line
	10400 4350 10400 4250
Wire Wire Line
	10400 3850 10400 3750
Wire Wire Line
	10400 3750 10650 3750
Wire Wire Line
	10500 6050 10400 6050
$Comp
L Switch:SW_Push SW1
U 1 1 5E0881C7
P 7450 4050
F 0 "SW1" H 7450 4335 50  0000 C CNN
F 1 "Flash" H 7450 4244 50  0000 C CNN
F 2 "" H 7450 4250 50  0001 C CNN
F 3 "~" H 7450 4250 50  0001 C CNN
	1    7450 4050
	0    -1   -1   0   
$EndComp
$Comp
L Device:R R?
U 1 1 5E0881D1
P 7700 3450
F 0 "R?" H 7770 3496 50  0000 L CNN
F 1 "12k" H 7770 3405 50  0000 L CNN
F 2 "" V 7630 3450 50  0001 C CNN
F 3 "~" H 7700 3450 50  0001 C CNN
	1    7700 3450
	1    0    0    -1  
$EndComp
$Comp
L power:+3V3 #PWR?
U 1 1 5E0881DB
P 7700 3200
F 0 "#PWR?" H 7700 3050 50  0001 C CNN
F 1 "+3V3" H 7715 3373 50  0000 C CNN
F 2 "" H 7700 3200 50  0001 C CNN
F 3 "" H 7700 3200 50  0001 C CNN
	1    7700 3200
	1    0    0    -1  
$EndComp
Wire Wire Line
	7700 3200 7700 3300
Wire Wire Line
	7700 3600 7700 3750
$Comp
L Device:C C?
U 1 1 5E0881E8
P 7700 4050
F 0 "C?" H 7815 4096 50  0000 L CNN
F 1 "100nF" H 7815 4005 50  0000 L CNN
F 2 "" H 7738 3900 50  0001 C CNN
F 3 "~" H 7700 4050 50  0001 C CNN
	1    7700 4050
	1    0    0    -1  
$EndComp
$Comp
L power:GND #PWR?
U 1 1 5E0881F2
P 7700 4350
F 0 "#PWR?" H 7700 4100 50  0001 C CNN
F 1 "GND" H 7705 4177 50  0000 C CNN
F 2 "" H 7700 4350 50  0001 C CNN
F 3 "" H 7700 4350 50  0001 C CNN
	1    7700 4350
	1    0    0    -1  
$EndComp
Wire Wire Line
	7800 3750 7700 3750
Connection ~ 7700 3750
Wire Wire Line
	7700 3900 7700 3750
$Comp
L power:GND #PWR?
U 1 1 5E0881FF
P 7450 4350
F 0 "#PWR?" H 7450 4100 50  0001 C CNN
F 1 "GND" H 7455 4177 50  0000 C CNN
F 2 "" H 7450 4350 50  0001 C CNN
F 3 "" H 7450 4350 50  0001 C CNN
	1    7450 4350
	1    0    0    -1  
$EndComp
Wire Wire Line
	7700 4200 7700 4350
Wire Wire Line
	7450 4350 7450 4250
Wire Wire Line
	7450 3850 7450 3750
Wire Wire Line
	7450 3750 7700 3750
Text GLabel 10500 6150 2    50   BiDi ~ 0
SDA
Text GLabel 10500 6250 2    50   Input ~ 0
SCL
Wire Wire Line
	10500 6150 10400 6150
Wire Wire Line
	10400 6250 10500 6250
Text GLabel 8350 4000 0    50   BiDi ~ 0
0
Wire Wire Line
	8450 4000 8350 4000
$Comp
L Device:R R?
U 1 1 5E0C74AF
P 9300 4000
F 0 "R?" V 9093 4000 50  0000 C CNN
F 1 "470" V 9184 4000 50  0000 C CNN
F 2 "" V 9230 4000 50  0001 C CNN
F 3 "~" H 9300 4000 50  0001 C CNN
	1    9300 4000
	0    1    1    0   
$EndComp
Wire Wire Line
	9050 4000 9150 4000
Text GLabel 9550 4000 2    50   Output ~ 0
RESET
Wire Wire Line
	9450 4000 9550 4000
Text Notes 8600 4250 0    50   ~ 0
dip_switch
Text GLabel 7800 3750 2    50   BiDi ~ 0
flash
$Comp
L Transistor_FET:BSS138 Q1
U 1 1 5DFE98FF
P 8300 1350
F 0 "Q1" H 8504 1396 50  0000 L CNN
F 1 "BSS138" H 8504 1305 50  0000 L CNN
F 2 "Package_TO_SOT_SMD:SOT-23" H 8500 1275 50  0001 L CIN
F 3 "https://www.fairchildsemi.com/datasheets/BS/BSS138.pdf" H 8300 1350 50  0001 L CNN
	1    8300 1350
	1    0    0    -1  
$EndComp
$Comp
L Device:R R?
U 1 1 5DFEA93A
P 7750 1350
F 0 "R?" V 7543 1350 50  0000 C CNN
F 1 "100k" V 7634 1350 50  0000 C CNN
F 2 "" V 7680 1350 50  0001 C CNN
F 3 "~" H 7750 1350 50  0001 C CNN
	1    7750 1350
	0    1    1    0   
$EndComp
$Comp
L power:GND #PWR?
U 1 1 5DFF088F
P 8400 1850
F 0 "#PWR?" H 8400 1600 50  0001 C CNN
F 1 "GND" H 8405 1677 50  0000 C CNN
F 2 "" H 8400 1850 50  0001 C CNN
F 3 "" H 8400 1850 50  0001 C CNN
	1    8400 1850
	1    0    0    -1  
$EndComp
$Comp
L power:VCC #PWR?
U 1 1 5E005262
P 8400 850
F 0 "#PWR?" H 8400 700 50  0001 C CNN
F 1 "VCC" H 8417 1023 50  0000 C CNN
F 2 "" H 8400 850 50  0001 C CNN
F 3 "" H 8400 850 50  0001 C CNN
	1    8400 850 
	1    0    0    -1  
$EndComp
Wire Wire Line
	8400 850  8400 950 
Wire Wire Line
	8400 950  8500 950 
Wire Wire Line
	8500 1050 8400 1050
Wire Wire Line
	8400 1050 8400 1150
Wire Wire Line
	7900 1350 8000 1350
$Comp
L Device:R R?
U 1 1 5E01D082
P 8000 1600
F 0 "R?" H 7930 1554 50  0000 R CNN
F 1 "200k" H 7930 1645 50  0000 R CNN
F 2 "" V 7930 1600 50  0001 C CNN
F 3 "~" H 8000 1600 50  0001 C CNN
	1    8000 1600
	-1   0    0    1   
$EndComp
Wire Wire Line
	8000 1450 8000 1350
Connection ~ 8000 1350
Wire Wire Line
	8000 1350 8100 1350
$Comp
L power:GND #PWR?
U 1 1 5E023334
P 8000 1850
F 0 "#PWR?" H 8000 1600 50  0001 C CNN
F 1 "GND" H 8005 1677 50  0000 C CNN
F 2 "" H 8000 1850 50  0001 C CNN
F 3 "" H 8000 1850 50  0001 C CNN
	1    8000 1850
	1    0    0    -1  
$EndComp
Wire Wire Line
	8000 1750 8000 1850
Wire Wire Line
	8400 1550 8400 1850
Text GLabel 10500 5950 2    50   BiDi ~ 0
pout
Wire Wire Line
	10500 5950 10400 5950
Text GLabel 7500 1350 0    50   BiDi ~ 0
pout
Wire Wire Line
	7500 1350 7600 1350
Text Notes 7250 1050 0    50   ~ 0
V_g = V_p*200/(100+200)\nsi V_p = 3.3v\nV_g = 2.2V
$Comp
L Device:R R?
U 1 1 5E0D5731
P 1000 5050
F 0 "R?" V 793 5050 50  0000 C CNN
F 1 "330" V 884 5050 50  0000 C CNN
F 2 "" V 930 5050 50  0001 C CNN
F 3 "~" H 1000 5050 50  0001 C CNN
	1    1000 5050
	0    1    1    0   
$EndComp
Wire Wire Line
	1150 5050 1250 5050
$Comp
L power:+3.3V #PWR?
U 1 1 5E0DDEA5
P 1550 4650
F 0 "#PWR?" H 1550 4500 50  0001 C CNN
F 1 "+3.3V" H 1565 4823 50  0000 C CNN
F 2 "" H 1550 4650 50  0001 C CNN
F 3 "" H 1550 4650 50  0001 C CNN
	1    1550 4650
	1    0    0    -1  
$EndComp
Wire Wire Line
	1550 4650 1550 4750
$Comp
L power:GND #PWR?
U 1 1 5E0E586C
P 1550 5450
F 0 "#PWR?" H 1550 5200 50  0001 C CNN
F 1 "GND" H 1555 5277 50  0000 C CNN
F 2 "" H 1550 5450 50  0001 C CNN
F 3 "" H 1550 5450 50  0001 C CNN
	1    1550 5450
	1    0    0    -1  
$EndComp
Wire Wire Line
	1550 5350 1550 5450
$Comp
L Connector:Conn_01x01_Male J?
U 1 1 5E0F4941
P 1950 4750
F 0 "J?" V 2012 4794 50  0000 L CNN
F 1 "DOUT" V 2103 4794 50  0000 L CNN
F 2 "" H 1950 4750 50  0001 C CNN
F 3 "~" H 1950 4750 50  0001 C CNN
	1    1950 4750
	0    1    1    0   
$EndComp
Wire Wire Line
	1850 5050 1950 5050
Wire Wire Line
	1950 5050 1950 4950
Text GLabel 10500 5750 2    50   Output ~ 0
ws
Wire Wire Line
	10500 5750 10400 5750
Wire Wire Line
	750  5050 850  5050
Text GLabel 750  5050 0    50   Input ~ 0
ws
Text Notes 700  4750 0    50   ~ 0
verificar valor\nresistencia 330
$Comp
L mcp1826:MCP1826T-ADJE_DC U?
U 1 1 5E1B90F1
P 5300 1050
F 0 "U?" H 5300 1500 50  0000 C CNN
F 1 "MCP1826T-ADJE_DC" H 5300 1400 50  0000 C CNN
F 2 "SOT230P700X180-6N" H 5300 1050 50  0001 L BNN
F 3 "Microchip" H 5300 1050 50  0001 L BNN
F 4 "SOT223-5" H 5300 1050 50  0001 L BNN "Field4"
F 5 "MCP1826T-ADJE/DC" H 5300 1050 50  0001 L BNN "Field5"
F 6 "08N6496" H 5300 1050 50  0001 L BNN "Field6"
F 7 "1578432" H 5300 1050 50  0001 L BNN "Field7"
	1    5300 1050
	1    0    0    -1  
$EndComp
$Comp
L ftd434p:FDT434P Q?
U 1 1 5E24E729
P 3350 1200
F 0 "Q?" H 3458 1246 50  0000 L CNN
F 1 "FDT434P" H 3450 1350 50  0000 L CNN
F 2 "SOT230P700X180-4N" H 3350 1200 50  0001 L BNN
F 3 "Fairchild Semiconductor" H 3350 1200 50  0001 L BNN
	1    3350 1200
	1    0    0    -1  
$EndComp
$Comp
L power:+BATT #PWR?
U 1 1 5E25B351
P 3350 800
F 0 "#PWR?" H 3350 650 50  0001 C CNN
F 1 "+BATT" H 3365 973 50  0000 C CNN
F 2 "" H 3350 800 50  0001 C CNN
F 3 "" H 3350 800 50  0001 C CNN
	1    3350 800 
	1    0    0    -1  
$EndComp
Wire Wire Line
	3350 800  3350 900 
$Comp
L Device:R R?
U 1 1 5E2660BD
P 2600 1100
F 0 "R?" V 2393 1100 50  0000 C CNN
F 1 "100k" V 2484 1100 50  0000 C CNN
F 2 "" V 2530 1100 50  0001 C CNN
F 3 "~" H 2600 1100 50  0001 C CNN
	1    2600 1100
	0    1    1    0   
$EndComp
$Comp
L Diode:1N5819 D?
U 1 1 5E28E123
P 3100 1600
F 0 "D?" H 3100 1384 50  0000 C CNN
F 1 "1N5819" H 3100 1475 50  0000 C CNN
F 2 "Diode_THT:D_DO-41_SOD81_P10.16mm_Horizontal" H 3100 1425 50  0001 C CNN
F 3 "http://www.vishay.com/docs/88525/1n5817.pdf" H 3100 1600 50  0001 C CNN
	1    3100 1600
	-1   0    0    1   
$EndComp
Wire Wire Line
	3350 1600 3350 1500
Wire Wire Line
	2950 1600 2850 1600
Wire Wire Line
	2850 1600 2850 1100
Wire Wire Line
	2850 1100 3050 1100
Wire Wire Line
	2750 1100 2850 1100
Connection ~ 2850 1100
Wire Wire Line
	3250 1600 3350 1600
$Comp
L power:GND #PWR?
U 1 1 5E2DFC36
P 2350 1100
F 0 "#PWR?" H 2350 850 50  0001 C CNN
F 1 "GND" V 2355 972 50  0000 R CNN
F 2 "" H 2350 1100 50  0001 C CNN
F 3 "" H 2350 1100 50  0001 C CNN
	1    2350 1100
	0    1    1    0   
$EndComp
Wire Wire Line
	2350 1100 2450 1100
Text GLabel 9350 3300 2    50   Output ~ 0
Vin
Wire Wire Line
	3450 1600 3350 1600
Connection ~ 3350 1600
$Comp
L power:VBUS #PWR?
U 1 1 5E2F1993
P 2750 1600
F 0 "#PWR?" H 2750 1450 50  0001 C CNN
F 1 "VBUS" V 2765 1728 50  0000 L CNN
F 2 "" H 2750 1600 50  0001 C CNN
F 3 "" H 2750 1600 50  0001 C CNN
	1    2750 1600
	0    -1   -1   0   
$EndComp
Wire Wire Line
	2750 1600 2850 1600
Connection ~ 2850 1600
Text GLabel 6400 2750 2    50   Input ~ 0
Vin
Wire Wire Line
	6400 2750 6300 2750
$Comp
L power:VCC #PWR?
U 1 1 5E3417BE
P 6400 2850
F 0 "#PWR?" H 6400 2700 50  0001 C CNN
F 1 "VCC" V 6417 2978 50  0000 L CNN
F 2 "" H 6400 2850 50  0001 C CNN
F 3 "" H 6400 2850 50  0001 C CNN
	1    6400 2850
	0    1    1    0   
$EndComp
Wire Wire Line
	6400 2850 6300 2850
$Comp
L power:+3V3 #PWR?
U 1 1 5E34B623
P 6400 2950
F 0 "#PWR?" H 6400 2800 50  0001 C CNN
F 1 "+3V3" V 6415 3078 50  0000 L CNN
F 2 "" H 6400 2950 50  0001 C CNN
F 3 "" H 6400 2950 50  0001 C CNN
	1    6400 2950
	0    1    1    0   
$EndComp
Wire Wire Line
	6400 2950 6300 2950
Text GLabel 8750 3300 0    50   Input ~ 0
Vsw
Wire Wire Line
	8750 3300 8850 3300
Text GLabel 3450 1600 2    50   Output ~ 0
Vsw
Wire Wire Line
	9250 3300 9350 3300
$Comp
L tp4056:TP4056 IC?
U 1 1 5E4A59C5
P 3150 2350
F 0 "IC?" H 3150 2900 50  0000 C CNN
F 1 "TP4056" H 3150 2800 50  0000 C CNN
F 2 "SOP-8" H 3150 2350 50  0001 L BNN
F 3 "" H 3150 2350 50  0001 C CNN
	1    3150 2350
	1    0    0    -1  
$EndComp
$Comp
L power:GND #PWR?
U 1 1 5E4B1682
P 3150 2800
F 0 "#PWR?" H 3150 2550 50  0001 C CNN
F 1 "GND" H 3155 2627 50  0000 C CNN
F 2 "" H 3150 2800 50  0001 C CNN
F 3 "" H 3150 2800 50  0001 C CNN
	1    3150 2800
	1    0    0    -1  
$EndComp
Wire Wire Line
	3150 2800 3150 2700
$Comp
L Device:R R?
U 1 1 5E4BA318
P 3700 2700
F 0 "R?" H 3770 2746 50  0000 L CNN
F 1 "1.2k" H 3770 2655 50  0000 L CNN
F 2 "" V 3630 2700 50  0001 C CNN
F 3 "~" H 3700 2700 50  0001 C CNN
	1    3700 2700
	1    0    0    -1  
$EndComp
$Comp
L power:GND #PWR?
U 1 1 5E4BAE55
P 3700 2950
F 0 "#PWR?" H 3700 2700 50  0001 C CNN
F 1 "GND" H 3705 2777 50  0000 C CNN
F 2 "" H 3700 2950 50  0001 C CNN
F 3 "" H 3700 2950 50  0001 C CNN
	1    3700 2950
	1    0    0    -1  
$EndComp
Wire Wire Line
	3700 2950 3700 2850
Wire Wire Line
	3700 2550 3700 2450
Wire Wire Line
	3700 2450 3600 2450
$Comp
L power:GND #PWR?
U 1 1 5E4CC891
P 4250 2950
F 0 "#PWR?" H 4250 2700 50  0001 C CNN
F 1 "GND" H 4255 2777 50  0000 C CNN
F 2 "" H 4250 2950 50  0001 C CNN
F 3 "" H 4250 2950 50  0001 C CNN
	1    4250 2950
	1    0    0    -1  
$EndComp
Wire Wire Line
	3600 2350 4250 2350
Wire Wire Line
	4250 2350 4250 2950
Wire Wire Line
	2650 2050 2550 2050
Wire Wire Line
	2550 2050 2550 2150
Wire Wire Line
	2550 2150 2650 2150
$Comp
L Device:LED D?
U 1 1 5E534DCB
P 2550 3100
F 0 "D?" V 2497 3179 50  0000 L CNN
F 1 "GREEN" V 2588 3179 50  0000 L CNN
F 2 "" H 2550 3100 50  0001 C CNN
F 3 "~" H 2550 3100 50  0001 C CNN
	1    2550 3100
	0    1    1    0   
$EndComp
$Comp
L Device:LED D?
U 1 1 5E535999
P 2150 3100
F 0 "D?" V 2097 3179 50  0000 L CNN
F 1 "RED" V 2188 3179 50  0000 L CNN
F 2 "" H 2150 3100 50  0001 C CNN
F 3 "~" H 2150 3100 50  0001 C CNN
	1    2150 3100
	0    1    1    0   
$EndComp
$Comp
L Device:R R?
U 1 1 5E5452AB
P 2550 2700
F 0 "R?" H 2620 2746 50  0000 L CNN
F 1 "1k" H 2620 2655 50  0000 L CNN
F 2 "" V 2480 2700 50  0001 C CNN
F 3 "~" H 2550 2700 50  0001 C CNN
	1    2550 2700
	1    0    0    -1  
$EndComp
Wire Wire Line
	2550 2550 2550 2450
Wire Wire Line
	2550 2450 2650 2450
Wire Wire Line
	2550 2950 2550 2850
$Comp
L Device:R R?
U 1 1 5E55CED9
P 2150 2700
F 0 "R?" H 2220 2746 50  0000 L CNN
F 1 "1k" H 2220 2655 50  0000 L CNN
F 2 "" V 2080 2700 50  0001 C CNN
F 3 "~" H 2150 2700 50  0001 C CNN
	1    2150 2700
	1    0    0    -1  
$EndComp
Wire Wire Line
	2150 2550 2150 2350
Wire Wire Line
	2150 2350 2650 2350
Wire Wire Line
	2150 2950 2150 2850
$Comp
L power:+BATT #PWR?
U 1 1 5E577996
P 3700 2050
F 0 "#PWR?" H 3700 1900 50  0001 C CNN
F 1 "+BATT" V 3715 2178 50  0000 L CNN
F 2 "" H 3700 2050 50  0001 C CNN
F 3 "" H 3700 2050 50  0001 C CNN
	1    3700 2050
	0    1    1    0   
$EndComp
Wire Wire Line
	3700 2050 3600 2050
$Comp
L power:VBUS #PWR?
U 1 1 5E624D10
P 2050 3350
F 0 "#PWR?" H 2050 3200 50  0001 C CNN
F 1 "VBUS" V 2065 3478 50  0000 L CNN
F 2 "" H 2050 3350 50  0001 C CNN
F 3 "" H 2050 3350 50  0001 C CNN
	1    2050 3350
	0    -1   -1   0   
$EndComp
Wire Wire Line
	2050 3350 2150 3350
Wire Wire Line
	2550 3350 2550 3250
Wire Wire Line
	2150 3250 2150 3350
Connection ~ 2150 3350
Wire Wire Line
	2150 3350 2550 3350
$Comp
L power:VBUS #PWR?
U 1 1 5E63DE43
P 2450 2050
F 0 "#PWR?" H 2450 1900 50  0001 C CNN
F 1 "VBUS" V 2465 2178 50  0000 L CNN
F 2 "" H 2450 2050 50  0001 C CNN
F 3 "" H 2450 2050 50  0001 C CNN
	1    2450 2050
	0    -1   -1   0   
$EndComp
Wire Wire Line
	2450 2050 2550 2050
Connection ~ 2550 2050
$Comp
L power:+3V3 #PWR?
U 1 1 5E65E412
P 5900 1100
F 0 "#PWR?" H 5900 950 50  0001 C CNN
F 1 "+3V3" H 5915 1273 50  0000 C CNN
F 2 "" H 5900 1100 50  0001 C CNN
F 3 "" H 5900 1100 50  0001 C CNN
	1    5900 1100
	1    0    0    -1  
$EndComp
$Comp
L Device:C C?
U 1 1 5E65EE14
P 5900 1450
F 0 "C?" H 6015 1496 50  0000 L CNN
F 1 "1uF" H 6015 1405 50  0000 L CNN
F 2 "" H 5938 1300 50  0001 C CNN
F 3 "~" H 5900 1450 50  0001 C CNN
	1    5900 1450
	1    0    0    -1  
$EndComp
Wire Wire Line
	5800 1200 5900 1200
Wire Wire Line
	5900 1200 5900 1100
Wire Wire Line
	5900 1300 5900 1200
Connection ~ 5900 1200
$Comp
L power:GND #PWR?
U 1 1 5E676536
P 5900 1700
F 0 "#PWR?" H 5900 1450 50  0001 C CNN
F 1 "GND" H 5905 1527 50  0000 C CNN
F 2 "" H 5900 1700 50  0001 C CNN
F 3 "" H 5900 1700 50  0001 C CNN
	1    5900 1700
	1    0    0    -1  
$EndComp
Wire Wire Line
	5900 1600 5900 1700
Text GLabel 4750 750  1    50   Input ~ 0
Vin
Wire Wire Line
	4750 1050 4850 1050
Wire Wire Line
	4750 1050 4750 850 
Wire Wire Line
	4750 850  4850 850 
$Comp
L power:GND #PWR?
U 1 1 5E6C449A
P 4650 1350
F 0 "#PWR?" H 4650 1100 50  0001 C CNN
F 1 "GND" V 4655 1222 50  0000 R CNN
F 2 "" H 4650 1350 50  0001 C CNN
F 3 "" H 4650 1350 50  0001 C CNN
	1    4650 1350
	0    1    1    0   
$EndComp
Wire Wire Line
	4650 1350 4750 1350
Wire Wire Line
	4850 1450 4750 1450
Wire Wire Line
	4750 1450 4750 1350
Connection ~ 4750 1350
Wire Wire Line
	4750 1350 4850 1350
$Comp
L Device:R R?
U 1 1 5E6EDD18
P 4600 1150
F 0 "R?" V 4400 1150 50  0000 C CNN
F 1 "10k" V 4500 1150 50  0000 C CNN
F 2 "" V 4530 1150 50  0001 C CNN
F 3 "~" H 4600 1150 50  0001 C CNN
	1    4600 1150
	0    1    1    0   
$EndComp
Wire Wire Line
	4850 1150 4750 1150
$Comp
L power:+3V3 #PWR?
U 1 1 5E6FB59A
P 4350 1150
F 0 "#PWR?" H 4350 1000 50  0001 C CNN
F 1 "+3V3" V 4365 1278 50  0000 L CNN
F 2 "" H 4350 1150 50  0001 C CNN
F 3 "" H 4350 1150 50  0001 C CNN
	1    4350 1150
	0    -1   -1   0   
$EndComp
Wire Wire Line
	4350 1150 4450 1150
Wire Wire Line
	4750 750  4750 850 
Connection ~ 4750 850 
$Comp
L Device:C C?
U 1 1 5E719104
P 4500 850
F 0 "C?" V 4248 850 50  0000 C CNN
F 1 "10uF" V 4339 850 50  0000 C CNN
F 2 "" H 4538 700 50  0001 C CNN
F 3 "~" H 4500 850 50  0001 C CNN
	1    4500 850 
	0    1    1    0   
$EndComp
$Comp
L power:GND #PWR?
U 1 1 5E719A07
P 4250 850
F 0 "#PWR?" H 4250 600 50  0001 C CNN
F 1 "GND" V 4255 722 50  0000 R CNN
F 2 "" H 4250 850 50  0001 C CNN
F 3 "" H 4250 850 50  0001 C CNN
	1    4250 850 
	0    1    1    0   
$EndComp
Wire Wire Line
	4250 850  4350 850 
Wire Wire Line
	4650 850  4750 850 
$Comp
L Device:C C?
U 1 1 5E7738E7
P 950 2500
F 0 "C?" H 1065 2546 50  0000 L CNN
F 1 "10uF" H 1065 2455 50  0000 L CNN
F 2 "" H 988 2350 50  0001 C CNN
F 3 "~" H 950 2500 50  0001 C CNN
	1    950  2500
	1    0    0    -1  
$EndComp
$Comp
L Device:R R?
U 1 1 5E77836A
P 1300 2300
F 0 "R?" H 1230 2254 50  0000 R CNN
F 1 "1k" H 1230 2345 50  0000 R CNN
F 2 "" V 1230 2300 50  0001 C CNN
F 3 "~" H 1300 2300 50  0001 C CNN
	1    1300 2300
	-1   0    0    1   
$EndComp
$Comp
L Device:LED D?
U 1 1 5E779004
P 1300 2700
F 0 "D?" V 1339 2582 50  0000 R CNN
F 1 "RED" V 1248 2582 50  0000 R CNN
F 2 "" H 1300 2700 50  0001 C CNN
F 3 "~" H 1300 2700 50  0001 C CNN
	1    1300 2700
	0    -1   -1   0   
$EndComp
$Comp
L power:GND #PWR?
U 1 1 5E78C9D1
P 850 2950
F 0 "#PWR?" H 850 2700 50  0001 C CNN
F 1 "GND" H 855 2777 50  0000 C CNN
F 2 "" H 850 2950 50  0001 C CNN
F 3 "" H 850 2950 50  0001 C CNN
	1    850  2950
	0    1    1    0   
$EndComp
$Comp
L power:VBUS #PWR?
U 1 1 5E78D3AA
P 850 2050
F 0 "#PWR?" H 850 1900 50  0001 C CNN
F 1 "VBUS" V 865 2178 50  0000 L CNN
F 2 "" H 850 2050 50  0001 C CNN
F 3 "" H 850 2050 50  0001 C CNN
	1    850  2050
	0    -1   -1   0   
$EndComp
Wire Wire Line
	850  2050 950  2050
Wire Wire Line
	950  2050 950  2350
Wire Wire Line
	950  2650 950  2950
Wire Wire Line
	850  2950 950  2950
Wire Wire Line
	1300 2850 1300 2950
Wire Wire Line
	1300 2950 950  2950
Connection ~ 950  2950
Wire Wire Line
	1300 2550 1300 2450
Wire Wire Line
	1300 2150 1300 2050
Wire Wire Line
	1300 2050 950  2050
Connection ~ 950  2050
Wire Wire Line
	5000 2650 5000 2750
Wire Wire Line
	5000 2250 4900 2250
Wire Wire Line
	5000 2350 5000 2250
$Comp
L power:GND #PWR?
U 1 1 5E5CF7C7
P 5000 2750
F 0 "#PWR?" H 5000 2500 50  0001 C CNN
F 1 "GND" H 5005 2577 50  0000 C CNN
F 2 "" H 5000 2750 50  0001 C CNN
F 3 "" H 5000 2750 50  0001 C CNN
	1    5000 2750
	1    0    0    -1  
$EndComp
$Comp
L Device:C C?
U 1 1 5E5CECA5
P 5000 2500
F 0 "C?" H 5115 2546 50  0000 L CNN
F 1 "1uF" H 5115 2455 50  0000 L CNN
F 2 "" H 5038 2350 50  0001 C CNN
F 3 "~" H 5000 2500 50  0001 C CNN
	1    5000 2500
	1    0    0    -1  
$EndComp
$Comp
L power:+BATT #PWR?
U 1 1 5E5CDC89
P 4900 2250
F 0 "#PWR?" H 4900 2100 50  0001 C CNN
F 1 "+BATT" V 4915 2377 50  0000 L CNN
F 2 "" H 4900 2250 50  0001 C CNN
F 3 "" H 4900 2250 50  0001 C CNN
	1    4900 2250
	0    -1   -1   0   
$EndComp
Wire Wire Line
	5600 2250 5700 2250
$Comp
L power:+BATT #PWR?
U 1 1 5E5B047F
P 5600 2250
F 0 "#PWR?" H 5600 2100 50  0001 C CNN
F 1 "+BATT" V 5615 2377 50  0000 L CNN
F 2 "" H 5600 2250 50  0001 C CNN
F 3 "" H 5600 2250 50  0001 C CNN
	1    5600 2250
	0    -1   -1   0   
$EndComp
Wire Wire Line
	5600 2350 5700 2350
Wire Wire Line
	5600 2450 5600 2350
$Comp
L power:GND #PWR?
U 1 1 5E4F3F39
P 5600 2450
F 0 "#PWR?" H 5600 2200 50  0001 C CNN
F 1 "GND" H 5605 2277 50  0000 C CNN
F 2 "" H 5600 2450 50  0001 C CNN
F 3 "" H 5600 2450 50  0001 C CNN
	1    5600 2450
	1    0    0    -1  
$EndComp
$Comp
L Connector_Generic:Conn_01x02 J?
U 1 1 5E4F1BF1
P 5900 2250
F 0 "J?" H 5980 2242 50  0000 L CNN
F 1 "Battery" H 5980 2151 50  0000 L CNN
F 2 "" H 5900 2250 50  0001 C CNN
F 3 "~" H 5900 2250 50  0001 C CNN
	1    5900 2250
	1    0    0    -1  
$EndComp
Text Notes 6200 1600 0    50   ~ 0
Revisar\nvalor del\ncondensador
Text Notes 5150 2900 0    50   ~ 0
Revisar\nvalor del\ncondensador
Text Notes 3400 2850 0    50   ~ 0
No me convence el\nvalor de la\nresistencia de\nprogramacion
Text GLabel 1550 6300 2    50   Output ~ 0
VM
Text GLabel 4850 6000 1    50   Input ~ 0
VM
Text GLabel 3150 6000 1    50   Input ~ 0
VM
$Comp
L Device:L_Core_Ferrite L?
U 1 1 5EA9871E
P 1200 6300
F 0 "L?" V 1019 6300 50  0000 C CNN
F 1 "MI0805K400R" V 1110 6300 50  0000 C CNN
F 2 "" H 1200 6300 50  0001 C CNN
F 3 "~" H 1200 6300 50  0001 C CNN
	1    1200 6300
	0    1    1    0   
$EndComp
Wire Wire Line
	1350 6300 1450 6300
Wire Wire Line
	850  6300 950  6300
$Comp
L Device:C C?
U 1 1 5EACD14C
P 950 6550
F 0 "C?" H 1065 6596 50  0000 L CNN
F 1 "10uF" H 1065 6505 50  0000 L CNN
F 2 "" H 988 6400 50  0001 C CNN
F 3 "~" H 950 6550 50  0001 C CNN
	1    950  6550
	1    0    0    -1  
$EndComp
$Comp
L Device:C C?
U 1 1 5EACD432
P 1450 6550
F 0 "C?" H 1565 6596 50  0000 L CNN
F 1 "10uF" H 1565 6505 50  0000 L CNN
F 2 "" H 1488 6400 50  0001 C CNN
F 3 "~" H 1450 6550 50  0001 C CNN
	1    1450 6550
	1    0    0    -1  
$EndComp
$Comp
L power:GND #PWR?
U 1 1 5EACDF54
P 950 6800
F 0 "#PWR?" H 950 6550 50  0001 C CNN
F 1 "GND" H 955 6627 50  0000 C CNN
F 2 "" H 950 6800 50  0001 C CNN
F 3 "" H 950 6800 50  0001 C CNN
	1    950  6800
	1    0    0    -1  
$EndComp
$Comp
L power:GND #PWR?
U 1 1 5EACE453
P 1450 6800
F 0 "#PWR?" H 1450 6550 50  0001 C CNN
F 1 "GND" H 1455 6627 50  0000 C CNN
F 2 "" H 1450 6800 50  0001 C CNN
F 3 "" H 1450 6800 50  0001 C CNN
	1    1450 6800
	1    0    0    -1  
$EndComp
Wire Wire Line
	1450 6700 1450 6800
Wire Wire Line
	950  6700 950  6800
Wire Wire Line
	950  6400 950  6300
Connection ~ 950  6300
Wire Wire Line
	950  6300 1050 6300
Wire Wire Line
	1450 6400 1450 6300
Connection ~ 1450 6300
Wire Wire Line
	1450 6300 1550 6300
Text GLabel 1650 7350 0    50   BiDi ~ 0
SDA
Text GLabel 1650 7450 0    50   Input ~ 0
SCL
$Comp
L power:+3V3 #PWR?
U 1 1 5EB247C3
P 2250 7350
F 0 "#PWR?" H 2250 7200 50  0001 C CNN
F 1 "+3V3" V 2265 7478 50  0000 L CNN
F 2 "" H 2250 7350 50  0001 C CNN
F 3 "" H 2250 7350 50  0001 C CNN
	1    2250 7350
	0    1    1    0   
$EndComp
$Comp
L Device:R R?
U 1 1 5EB24EB0
P 1900 7350
F 0 "R?" V 1693 7350 50  0000 C CNN
F 1 "10k" V 1784 7350 50  0000 C CNN
F 2 "" V 1830 7350 50  0001 C CNN
F 3 "~" H 1900 7350 50  0001 C CNN
	1    1900 7350
	0    1    1    0   
$EndComp
$Comp
L Device:R R?
U 1 1 5EB2563C
P 1900 7450
F 0 "R?" V 1700 7450 50  0000 C CNN
F 1 "10k" V 1800 7450 50  0000 C CNN
F 2 "" V 1830 7450 50  0001 C CNN
F 3 "~" H 1900 7450 50  0001 C CNN
	1    1900 7450
	0    -1   -1   0   
$EndComp
Wire Wire Line
	2050 7350 2150 7350
Wire Wire Line
	2050 7450 2150 7450
Wire Wire Line
	2150 7450 2150 7350
Connection ~ 2150 7350
Wire Wire Line
	2150 7350 2250 7350
Wire Wire Line
	1750 7350 1650 7350
Wire Wire Line
	1750 7450 1650 7450
Text Notes 1050 6950 0    50   ~ 0
verificar\ncostos para\notros C
$Comp
L power:GND #PWR?
U 1 1 5EBABB20
P 2550 6750
F 0 "#PWR?" H 2550 6500 50  0001 C CNN
F 1 "GND" V 2555 6622 50  0000 R CNN
F 2 "" H 2550 6750 50  0001 C CNN
F 3 "" H 2550 6750 50  0001 C CNN
	1    2550 6750
	0    1    1    0   
$EndComp
$Comp
L power:GND #PWR?
U 1 1 5EBAD1C1
P 4250 6650
F 0 "#PWR?" H 4250 6400 50  0001 C CNN
F 1 "GND" V 4255 6522 50  0000 R CNN
F 2 "" H 4250 6650 50  0001 C CNN
F 3 "" H 4250 6650 50  0001 C CNN
	1    4250 6650
	0    1    1    0   
$EndComp
Wire Wire Line
	4350 6650 4300 6650
Wire Wire Line
	4350 6750 4300 6750
Wire Wire Line
	4300 6750 4300 6650
Connection ~ 4300 6650
Wire Wire Line
	4300 6650 4250 6650
Wire Wire Line
	2650 6750 2550 6750
$Comp
L Device:R R?
U 1 1 5EBF505E
P 2250 6650
F 0 "R?" V 2457 6650 50  0000 C CNN
F 1 "10k" V 2366 6650 50  0000 C CNN
F 2 "" V 2180 6650 50  0001 C CNN
F 3 "~" H 2250 6650 50  0001 C CNN
	1    2250 6650
	0    -1   -1   0   
$EndComp
Wire Wire Line
	2400 6650 2650 6650
$Comp
L power:+3V3 #PWR?
U 1 1 5EC1A4AA
P 2000 6550
F 0 "#PWR?" H 2000 6400 50  0001 C CNN
F 1 "+3V3" H 2015 6723 50  0000 C CNN
F 2 "" H 2000 6550 50  0001 C CNN
F 3 "" H 2000 6550 50  0001 C CNN
	1    2000 6550
	1    0    0    -1  
$EndComp
Wire Wire Line
	2000 6550 2000 6650
Wire Wire Line
	2000 6650 2100 6650
Wire Notes Line
	2500 5050 2350 5050
Wire Notes Line
	2500 4650 2350 4650
Wire Notes Line
	2350 5000 2450 5000
Wire Notes Line
	2450 5000 2450 4700
Wire Notes Line
	2500 4650 2500 5050
Wire Notes Line
	2350 4650 2350 5050
Wire Notes Line
	2450 4700 2350 4700
$Comp
L power:VCC #PWR?
U 1 1 5ECAF2DD
P 2900 4800
F 0 "#PWR?" H 2900 4650 50  0001 C CNN
F 1 "VCC" V 2918 4927 50  0000 L CNN
F 2 "" H 2900 4800 50  0001 C CNN
F 3 "" H 2900 4800 50  0001 C CNN
	1    2900 4800
	0    1    1    0   
$EndComp
Wire Notes Line
	500  7750 6950 7750
Wire Notes Line
	6950 5750 500  5750
Text Notes 1000 5950 0    50   ~ 0
Double Bridge Hall I2C
Text Notes 8650 2950 0    50   ~ 0
Interruptor de apagado
Text Notes 8550 3650 0    50   ~ 0
Modo para dormir micro
Wire Notes Line
	9050 500  9050 2750
Wire Notes Line
	11200 500  11200 6500
Wire Notes Line
	500  500  11200 500 
Wire Notes Line
	2250 3700 2250 5750
Wire Notes Line
	11200 6500 6950 6500
Wire Notes Line
	6950 500  6950 7750
Wire Notes Line
	11200 2750 6950 2750
Wire Notes Line
	500  3700 6950 3700
Wire Notes Line
	5400 3700 5400 5750
Text Notes 700  3900 0    50   ~ 0
Led rgb serial
Text Notes 2450 3900 0    50   ~ 0
Puertos i2c para sensores adicionales
Text Notes 6050 3300 0    50   ~ 0
Selección de valor\nde tensión para los\nvcc de los pinout
Wire Notes Line
	500  500  500  7750
Wire Wire Line
	950  1650 950  1550
$Comp
L power:GND #PWR0128
U 1 1 5E08D2ED
P 950 1650
F 0 "#PWR0128" H 950 1400 50  0001 C CNN
F 1 "GND" H 955 1477 50  0000 C CNN
F 2 "" H 950 1650 50  0001 C CNN
F 3 "" H 950 1650 50  0001 C CNN
	1    950  1650
	1    0    0    -1  
$EndComp
Wire Wire Line
	1250 950  1350 950 
$Comp
L power:VBUS #PWR0125
U 1 1 5E00F796
P 1350 950
F 0 "#PWR0125" H 1350 800 50  0001 C CNN
F 1 "VBUS" V 1365 1078 50  0000 L CNN
F 2 "" H 1350 950 50  0001 C CNN
F 3 "" H 1350 950 50  0001 C CNN
	1    1350 950 
	0    1    1    0   
$EndComp
NoConn ~ 850  1550
NoConn ~ 1250 1350
NoConn ~ 1250 1250
NoConn ~ 1250 1150
$Comp
L Connector:USB_B_Micro J1
U 1 1 5DFA7D82
P 950 1150
F 0 "J1" H 1007 1617 50  0000 C CNN
F 1 "USB_B_Micro" H 1007 1526 50  0000 C CNN
F 2 "" H 1100 1100 50  0001 C CNN
F 3 "~" H 1100 1100 50  0001 C CNN
	1    950  1150
	1    0    0    -1  
$EndComp
$EndSCHEMATC
