<?xml version="1.0" standalone="no"?>
<!DOCTYPE svg PUBLIC "-//W3C//DTD SVG 1.1//EN" "http://www.w3.org/Graphics/SVG/1.1/DTD/svg11.dtd">
<svg xmlns="http://www.w3.org/2000/svg">
<metadata>Generated by Fontastic.me</metadata>
<defs>
<font id="catalejo" horiz-adv-x="512">
<font-face font-family="catalejo" units-per-em="512" ascent="480" descent="-32"/>
<missing-glyph horiz-adv-x="512" />

<glyph glyph-name="mode" unicode="&#97;" d="M62 300c16 4 114 30 114 30 0-3-1-10-1-10 0-35 25-64 64-64 40 0 64 30 64 64 0 6-4 11-9 16l24-1c0 0 4 1 16 4-26-7-54 15-63 49-9 34 4 68 30 75-12-3-16-4-16-4l-84-55c-17-5-27-23-23-40 1-5 4-9 6-12-3-6-6-13-7-20-14 1-26 10-30 23-4 17 6 35 23 39l-123-32c-17-5-27-22-22-39 4-17 20-27 36-23z m209-76l-64 0 0-32-160-160 64 0 96 64 0-64 64 0 0 64 96-64 64 0-160 160z m215 224c-9 34-35 55-61 48-35-9-49-14-93-26-26-7-40-40-31-74 9-34 37-57 63-51 43 12 58 17 93 26 25 7 38 42 29 77z m-35-45c-9-3-21 8-26 25-4 17-2 33 7 35 8 2 21-8 25-25 5-17 2-33-6-35z"/>
<glyph glyph-name="open" unicode="&#99;" d="M448 416l-176 0c-8 0-16 8-16 16 0 8 0 0 0 16 0 16-16 32-32 32l-160 0c-16 0-32-16-32-32 0-16 0-352 0-352l448 0c0 0 0 272 0 288 0 16-16 32-32 32z m-384 16c0 8 8 16 16 16l128 0c8 0 16-8 16-16 0-9 0-16 0-16l-160 0c0 0 0 7 0 16z m192-272l0 64c-62 0-112-28-128-96 0 104 54 160 128 160 0 24 0 64 0 64l128-96z"/>
<glyph glyph-name="save" unicode="&#100;" d="M478 233c8-17 11-34 7-49 0 0-17-94-17-94-1-7-4-13-10-18-6-5-12-7-20-7 0 0-364 0-364 0-8 0-15 2-20 7-6 5-9 11-10 18 0 0-18 94-18 94-2 17 0 34 8 49 0 0 80 192 80 192 8 16 20 24 37 24 0 0 54 0 54 0 0 0-11-105-11-105 0 0-68 0-68 0 0 0 130-107 130-107 0 0 131 107 131 107 0 0-70 0-70 0 0 0-9 105-9 105 0 0 52 0 52 0 17 0 30-8 38-24 0 0 80-192 80-192m-35-67c1 7-1 14-5 19-4 6-10 9-17 9 0 0-330 0-330 0-8 0-13-3-17-9-5-5-6-12-6-19 0 0 8-38 8-38 0-8 4-14 9-19 6-5 12-8 19-8 0 0 303 0 303 0 8 0 15 3 20 8 6 5 9 11 10 19 0 0 6 38 6 38"/>
<glyph glyph-name="blockly" unicode="&#101;" d="M378 224c-7 5-14 9-22 10-4 1-9 2-14 1-4 0-8-1-12-1-4-1-7-2-10-4-9-4-17-9-23-15-6-6-11-14-15-23-2-3-3-6-4-9 0-5-1-9-1-13-1-5 0-10 1-14 1-8 5-15 10-22 2-3 4-5 6-7 10-10 23-16 38-17 4-1 9-1 13-3 2 0 4-2 6-3 3-3 4-8 1-14-1-3-4-6-6-9l-2-2c-2-2-3-3-3-3-2-2-3-3-5-5l-1-1c-6-5-11-11-16-16-11-11-23-23-34-34-4-4-8-8-12-11-1-2-3-4-5-5-1 0-2-1-3-1-9-5-20-3-29 6-3 2-5 5-8 8-15 15-30 30-45 45-5 4-9 8-13 13-3 3-7 6-10 8-3 2-6 4-9 5-10 4-21 1-27-7-2-2-4-5-5-8-2-5-2-10-3-15-2-18-13-34-28-41-4-2-8-3-12-4-4-1-8-1-12 0-13 0-24 6-34 16-1 1-1 1-1 1-10 10-16 21-16 34-1 4-1 8 0 12 1 4 2 8 4 12 7 15 23 26 41 28 5 1 10 1 15 3 3 1 6 3 9 5 7 7 10 17 6 26-1 4-3 7-5 10-2 3-5 7-8 10-5 4-9 8-13 12-14 14-27 27-40 41l-5 5c-3 3-6 5-8 8-9 9-11 20-6 29 0 1 1 2 1 3 1 2 3 4 5 5 3 4 7 8 11 12 11 11 23 22 34 34 5 5 11 10 16 16l1 1c2 2 3 3 5 5 0 0 1 1 3 3l2 2c3 2 6 5 9 6 6 3 11 2 14-1 1-2 3-4 3-6 2-4 2-9 3-13 1-15 7-28 17-38 2-2 4-4 7-6 7-5 14-9 22-10 4-1 9-2 14-1 4 0 8 1 13 1 3 1 6 2 9 4 9 4 17 9 23 15 6 6 11 14 15 23 2 3 3 6 4 9 0 5 1 9 1 13 1 5 0 10-1 14-1 8-5 15-10 22-2 3-4 5-6 7-10 10-23 16-38 17-4 1-9 1-13 3-2 0-4 2-6 3-3 3-4 8-1 14 1 3 4 6 6 9l2 2c2 2 3 3 3 3 2 2 3 3 5 5l1 1c6 5 11 11 16 16 12 11 23 23 34 34 4 4 8 8 12 11 1 2 3 4 5 5 1 0 2 1 3 1 9 5 20 3 29-6 3-2 5-5 8-8 15-15 30-30 45-45 5-4 9-8 13-13 3-3 7-6 10-8 3-2 6-4 9-5 10-4 21-1 27 7 2 2 4 5 5 8 2 5 2 10 3 15 2 18 13 34 28 41 4 2 8 3 12 4 4 1 8 1 12 0 13 0 24-6 34-16 1-1 1-1 1-1 10-10 16-21 16-34 1-4 1-8 0-12-1-4-2-8-4-12-7-15-23-26-41-28-5-1-10-1-15-3-3-1-6-3-9-5-7-7-10-17-6-26 1-4 3-7 5-10 2-3 5-7 8-10 5-4 9-8 13-13 15-15 30-30 46-45 2-3 5-5 7-8 9-9 11-20 6-29 0-1-1-2-1-3-1-2-3-4-5-5-3-4-7-8-11-12-11-11-23-22-34-34-5-5-11-10-16-16l-1-1c-2-2-3-3-5-5 0 0-1-1-3-3l-2-2c-3-2-6-5-9-6-6-3-11-2-14 1-1 2-3 4-3 6-2 4-2 9-3 13-1 15-7 28-17 38-2 2-4 4-7 6z"/>
<glyph glyph-name="code" unicode="&#102;" d="M456 403c5-5 10-12 14-21 4-9 5-18 5-25l0-330c0-7-2-14-8-19-5-5-11-8-19-8l-384 0c-8 0-14 3-19 8-6 5-8 12-8 19l0 458c0 7 2 14 8 19 5 5 11 8 19 8l256 0c8 0 16-2 25-6 9-4 17-8 22-13z m-127 70l0-107 108 0c-2 5-4 9-7 11l-89 90c-2 2-6 4-12 6z m110-436l0 292-119 0c-8 0-14 3-19 8-6 5-8 12-8 20l0 118-220 0 0-438z m-293 246c0 3 1 5 3 7 2 2 4 3 6 3l202 0c2 0 4-1 6-3 2-2 3-4 3-7l0-18c0-3-1-5-3-6-2-2-4-3-6-3l-202 0c-2 0-4 1-6 3-2 1-3 3-3 6z m211-64c2 0 4 0 6-2 2-2 3-4 3-7l0-18c0-3-1-5-3-7-2-1-4-2-6-2l-202 0c-2 0-4 1-6 2-2 2-3 4-3 7l0 18c0 3 1 5 3 7 2 2 4 2 6 2z m0-73c2 0 4-1 6-2 2-2 3-4 3-7l0-18c0-3-1-5-3-7-2-1-4-2-6-2l-202 0c-2 0-4 1-6 2-2 2-3 4-3 7l0 18c0 3 1 5 3 7 2 1 4 2 6 2z"/>
<glyph glyph-name="disconnected" unicode="&#103;" d="M490 512c-5 0-9-2-12-6l-32-32c-44 31-104 26-144-13 0-2-17-18-32-33l-20 19c-4 5-10 7-16 7 0-1-1-1-2-1-7-1-13-7-15-14-2-7 0-15 5-20l45-45-65-64c-5-6-7-13-5-20 2-7 8-12 14-14 7-2 15 0 20 5l64 65 51-51-65-64c-5-5-7-13-5-20 2-6 7-12 14-14 7-2 15 0 20 5l64 65 45-45c5-5 13-7 19-5 7 2 13 7 15 14 1 7-1 14-6 20l-19 19 33 32c39 38 42 98 12 143l34 33c6 6 8 16 4 23-4 8-13 12-21 11z m-413-216c-1 0-2 0-3-1-7-1-13-6-15-13-2-8 0-15 6-20l19-20-33-32c-38-38-42-98-12-143l-33-33c-6-5-8-13-6-20 2-6 8-12 15-14 6-2 14 0 19 5l32 33c44-31 104-26 144 13 0 2 17 18 32 33l20-19c7-8 20-8 28 0 8 7 8 20 0 28l-197 197c-4 4-10 6-16 6z"/>
<glyph glyph-name="new" unicode="&#104;" d="M256 0c-141 0-256 115-256 256 0 141 115 256 256 256 141 0 256-115 256-256 0-141-115-256-256-256z m0 448c-106 0-192-86-192-192 0-106 86-192 192-192 106 0 192 86 192 192 0 106-86 192-192 192z m32-320l-64 0 0 96-96 0 0 64 96 0 0 96 64 0 0-96 96 0 0-64-96 0z"/>
<glyph glyph-name="python" unicode="&#98;" d="M389 191l-120 0c-3 0-6-1-9-4-3-2-4-5-4-9 0-4 1-7 4-9 3-3 6-4 9-4l80 0c4 0 7-2 9-4 3-3 4-6 4-10l0-13c0-14-5-27-15-37-11-11-23-16-38-16l-80 0c-14 0-27 5-37 16-10 10-16 23-16 37l0 93c0 15 3 25 9 31 6 6 17 9 31 9l106 0c15 0 30 7 45 22 14 15 22 30 22 44l0 67 26 0c15 0 28-5 38-16 10-10 15-23 15-37l0-80c0-20-8-39-24-55-17-16-35-25-55-25z m-106-73c0-2 0-3 1-5 2-1 3-1 5-1l13 0c2 0 4 0 5 1 1 2 2 3 2 5l0 14c0 1-1 3-2 4-1 2-3 2-5 2l-13 0c-2 0-3 0-5-2-1-1-1-3-1-4z m26 179l-106 0c-15 0-27-5-38-15-10-10-15-23-15-38l0-53-53 0c-15 0-28 5-38 16-10 10-15 23-15 37l0 80c0 20 8 39 24 55 17 16 35 25 55 25l120 0c3 0 6 1 9 4 3 2 4 5 4 9 0 4-1 7-4 9-3 3-6 4-9 4l-80 0c-4 0-7 2-9 4-3 3-4 6-4 10l0 13c0 14 5 27 15 37 11 11 23 16 38 16l106 0c15 0 27-5 38-16 10-10 15-23 15-37l0-106c0-15-5-28-15-38-11-10-23-16-38-16z m-80 180c0 2 0 3-1 5-2 1-3 1-5 1l-13 0c-2 0-4 0-5-1-1-2-2-3-2-5l0-14c0-1 1-3 2-4 1-2 3-2 5-2l13 0c2 0 3 0 5 2 1 1 1 3 1 4z"/>
<glyph glyph-name="lua" unicode="&#105;" d="M408 208c0 88-73 160-164 160-91 0-164-72-164-160 0-88 73-160 164-160 91 0 164 72 164 160z m56 216c0-31-25-56-56-56-31 0-56 25-56 56 0 31 25 56 56 56 31 0 56-25 56-56z"/>
<glyph glyph-name="connected" unicode="&#106;" d="M490 512c-5 0-9-2-12-6l-92-91c-43 31-103 25-144-13 0-2-16-18-32-33l-19 19c-4 5-11 7-18 6-7-1-13-7-15-14-3-7 0-15 5-20l197-197c5-5 12-7 19-5 7 2 13 7 15 14 1 7-1 14-6 19l-19 19 33 32c38 39 42 99 12 144l93 92c6 6 8 15 4 23-4 8-13 12-21 11z m-354-157c-1 0-2 0-2-1-8-1-14-6-16-13-2-8 0-15 6-20l19-19-33-32c-38-39-42-99-12-144l-92-92c-6-5-8-13-6-20 2-6 8-12 15-14 6-2 14 0 19 5l92 92c43-31 103-26 144 13 0 2 16 18 32 33l19-19c5-5 12-7 19-6 7 2 12 8 14 15 2 7 0 14-5 19l-197 197c-4 4-10 7-16 6z"/>
<glyph glyph-name="stop" unicode="&#108;" d="M256 0c-141 0-256 115-256 256 0 141 115 256 256 256 141 0 256-115 256-256 0-141-115-256-256-256z m0 448c-106 0-192-86-192-192 0-106 86-192 192-192 106 0 192 86 192 192 0 106-86 192-192 192z m-64-128l128 0 0-128-128 0z"/>
<glyph glyph-name="card" unicode="&#109;" d="M160 384c18 0 32-14 32-32 0-18-14-32-32-32-18 0-32 14-32 32 0 18 14 32 32 32z m320-256c0-53-43-96-96-96l-224 0 96 96 41 0c11-19 31-32 55-32 35 0 64 29 64 64 0 35-29 64-64 64-24 0-44-13-55-32l-73 0-146-146c-28 17-46 47-46 82l0 256c0 53 43 96 96 96l0-73c-19-11-32-31-32-55 0-35 29-64 64-64 24 0 44 13 55 32l82 0c11-19 31-32 55-32 35 0 64 29 64 64 0 35-29 64-64 64-24 0-44-13-55-32l-81 0c-6 10-14 18-24 23l0 73 192 0c53 0 96-43 96-96z m-160 32c0 18 14 32 32 32 18 0 32-14 32-32 0-18-14-32-32-32-18 0-32 14-32 32z m0 192c0 18 14 32 32 32 18 0 32-14 32-32 0-18-14-32-32-32-18 0-32 14-32 32z"/>
<glyph glyph-name="graph" unicode="&#110;" d="M549 73l0-36-586 0 0 438 37 0 0-402z m-37 357l0-125c0-4-2-6-6-8-3-2-7-1-10 2l-34 35-181-181c-2-2-4-3-7-3-2 0-4 1-6 3l-67 66-119-118-55 54 168 168c1 1 4 2 6 2 3 0 5-1 7-2l66-67 133 133-35 34c-3 3-3 7-2 10 2 4 5 6 9 6l124 0c3 0 5-1 6-3 2-1 3-4 3-6z"/>
<glyph glyph-name="config" unicode="&#112;" d="M143 279c9-8 41-42 41-42l18 18-28 30 54 57c0 0-24 24-14 14 11 38 1 81-28 110-28 30-69 40-105 30l62-64-17-63-60-17-62 64c-10-38-1-79 28-109 30-31 73-40 111-28z m206-62l-74-73 123-128c10-10 23-15 36-15 13 0 27 5 37 15 20 21 20 55 0 76z m163 214l-78 81-231-239 28-29-138-143-32-16-44-73 11-12 70 46 17 33 138 143 28-30z"/>
<glyph glyph-name="baby" unicode="&#113;" d="M256 512c-141 0-256-115-256-256 0-141 115-256 256-256 141 0 256 115 256 256 0 141-115 256-256 256m0-480c-123 0-224 100-224 224 0 123 101 224 224 224 123 0 224-101 224-224 0-124-101-224-224-224m-64 256c18 0 32 21 32 48 0 26-14 48-32 48-18 0-32-22-32-48 0-27 14-48 32-48m64-128c-53 0-99 26-128 65l0-1c0-71 57-128 128-128 71 0 128 57 128 128l0 1c-29-39-75-65-128-65m32 192l96 0 0-32-96 0z"/>
<glyph glyph-name="upload" unicode="&#114;" d="M256 474c0 0 133-125 133-125 0 0-84 0-84 0 0 0 0-131 0-131 0 0-97 0-97 0 0 0 0 131 0 131 0 0-85 0-85 0 0 0 133 125 133 125m239-296c7-3 11-9 14-16 3-8 4-15 2-21 0 0-14-79-14-79-2-6-6-12-12-16-6-5-13-7-20-7 0 0-418 0-418 0-8 0-14 2-21 7-6 4-9 10-11 16 0 0-14 79-14 79-4 17 2 29 16 37 0 0 81 55 81 55 0 0 50 0 50 0 0 0-87-66-87-66 0 0 91 0 91 0 3 0 5-1 7-4 0 0 20-57 20-57 0 0 154 0 154 0 0 0 20 57 20 57 3 3 5 4 6 4 0 0 91 0 91 0 0 0-87 66-87 66 0 0 51 0 51 0 0 0 81-55 81-55"/>
<glyph glyph-name="download" unicode="&#115;" d="M495 178c7-3 11-9 14-16 3-8 4-15 2-21 0 0-14-79-14-79-2-6-6-12-12-16-6-5-13-7-20-7 0 0-418 0-418 0-8 0-14 2-21 7-6 4-9 10-11 16 0 0-14 79-14 79-4 17 2 29 16 37 0 0 81 55 81 55 0 0 50 0 50 0 0 0-87-66-87-66 0 0 91 0 91 0 3 0 5-1 7-4 0 0 20-57 20-57 0 0 154 0 154 0 0 0 20 57 20 57 3 3 5 4 6 4 0 0 91 0 91 0 0 0-87 66-87 66 0 0 51 0 51 0 0 0 81-55 81-55m-106 165c0 0-133-125-133-125 0 0-133 125-133 125 0 0 85 0 85 0 0 0 0 131 0 131 0 0 97 0 97 0 0 0 0-131 0-131 0 0 84 0 84 0"/>
<glyph glyph-name="import" unicode="&#116;" d="M384 128c0 5-2 9-5 13-4 3-8 5-13 5-5 0-10-2-13-5-4-4-6-8-6-13 0-5 2-9 6-13 3-3 8-5 13-5 5 0 9 2 13 5 3 4 5 8 5 13z m73 0c0 5-2 9-5 13-4 3-8 5-13 5-5 0-9-2-13-5-4-4-5-8-5-13 0-5 1-9 5-13 4-3 8-5 13-5 5 0 9 2 13 5 3 4 5 8 5 13z m37 64l0-91c0-8-3-15-8-20-6-5-12-8-20-8l-420 0c-8 0-14 3-20 8-5 5-8 12-8 20l0 91c0 8 3 14 8 19 6 6 12 8 20 8l133 0 38-38c11-11 24-16 39-16 15 0 28 5 39 16l39 38 132 0c8 0 14-2 20-8 5-5 8-11 8-19z m-93 163c3-8 2-15-4-20l-128-128c-4-4-8-6-13-6-5 0-9 2-13 6l-128 128c-6 5-7 12-4 20 3 7 9 11 17 11l73 0 0 128c0 5 2 9 6 13 3 3 7 5 12 5l74 0c5 0 9-2 12-5 4-4 6-8 6-13l0-128 73 0c8 0 14-4 17-11z"/>
<glyph glyph-name="export" unicode="&#117;" d="M384 91c0 5-2 10-5 13-4 4-8 6-13 6-5 0-10-2-13-6-4-3-6-8-6-13 0-5 2-9 6-12 3-4 8-6 13-6 5 0 9 2 13 6 3 3 5 7 5 12z m73 0c0 5-2 10-5 13-4 4-8 6-13 6-5 0-9-2-13-6-4-3-5-8-5-13 0-5 1-9 5-12 4-4 8-6 13-6 5 0 9 2 13 6 3 3 5 7 5 12z m37 64l0-91c0-8-3-14-8-19-6-6-12-8-20-8l-420 0c-8 0-14 2-20 8-5 5-8 11-8 19l0 91c0 8 3 15 8 20 6 5 12 8 20 8l122 0c4-11 10-20 20-26 9-7 20-11 31-11l74 0c11 0 22 4 31 11 10 6 16 15 20 26l122 0c8 0 14-3 20-8 5-5 8-12 8-20z m-93 186c-3-8-9-12-17-12l-73 0 0-128c0-5-2-9-6-13-3-3-7-5-12-5l-74 0c-5 0-9 2-12 5-4 4-6 8-6 13l0 128-73 0c-8 0-14 4-17 12-3 7-2 14 4 19l128 128c4 4 8 6 13 6 5 0 9-2 13-6l128-128c6-5 7-12 4-19z"/>
<glyph glyph-name="super" unicode="&#118;" d="M505 509c-3 2-6 3-9 3-3 0-6-1-9-3l-480-320c-5-3-8-9-7-15 1-6 5-11 10-13l125-50 59-103c3-5 8-8 14-8 0 0 0 0 0 0 6 0 11 3 14 8l33 55 155-62c2-1 4-1 6-1 3 0 5 1 8 2 4 2 7 7 8 11l80 480c1 7-2 13-7 16z m-455-329l371 247-270-289c-1 1-2 2-4 3z m113-53c0 0 0 0 0 0l303 325-258-403z m240-89l-136 55c-3 1-7 2-10 2l210 326z"/>
<glyph glyph-name="terminal" unicode="&#119;" d="M448 448l-384 0c-18 0-32-14-32-32l0-320c0-17 14-32 32-32l384 0c17 0 32 15 32 32l0 320c0 18-15 32-32 32z m-352-224l64 64-64 64 32 32 96-96-96-96z m256-32l-128 0 0 32 128 0z"/>
<glyph glyph-name="sun" unicode="&#120;" d="M421 256c0 22-5 44-13 64-9 20-21 38-36 52-14 15-32 27-52 36-20 8-42 13-64 13-22 0-44-5-64-13-20-9-38-21-52-36-15-14-27-32-36-52-8-20-13-42-13-64 0-22 5-44 13-64 9-20 21-38 36-52 14-15 32-27 52-36 20-8 42-13 64-13 22 0 44 5 64 13 20 9 38 21 52 36 15 14 27 32 36 52 8 20 13 42 13 64z m78-79c0-3-2-5-5-6l-84-27 0-88c0-3-1-5-3-7-3-2-6-2-9-1l-83 27-52-71c-1-3-4-4-7-4-3 0-6 1-7 4l-52 71-83-27c-3-1-6-1-9 1-2 2-3 4-3 7l0 88-84 27c-3 1-5 3-5 6-1 3-1 6 1 8l51 71-51 71c-2 2-2 5-1 8 0 3 2 5 5 6l84 27 0 88c0 3 1 5 3 7 3 2 6 2 9 1l83-27 52 71c1 3 4 4 7 4 3 0 6-1 7-4l52-71 83 27c3 1 6 1 9-1 2-2 3-4 3-7l0-88 84-27c3-1 5-3 5-6 1-3 1-6-1-8l-51-71 51-71c2-2 2-5 1-8z"/>
<glyph glyph-name="moon" unicode="&#121;" d="M435 250c5 3 10 7 14 11 14 14 24 30 30 48 2 6 1 13-4 17-4 4-10 6-16 4-36-13-74-4-100 22-26 26-35 64-22 100 2 6 0 12-4 16-5 5-11 6-17 4-18-6-34-16-48-30-33-33-44-81-32-123-43-6-82-29-108-64-5 1-11 1-16 1-62 0-112-50-112-112 0-62 50-112 112-112 14 0 27 2 40 7 29-25 66-39 104-39 39 0 75 14 104 39 13-5 26-7 40-7 62 0 112 50 112 112 0 49-32 91-77 106z m-144 170c2 2 5 5 8 7-2-36 11-71 37-98 27-26 62-39 98-37-14-17-33-28-53-33-28 35-68 57-112 60-12 34-5 74 22 101z"/>
<glyph glyph-name="language" unicode="&#122;" d="M223 204c0-1-1-1-3 0-2 1-5 2-9 3l-6 3c-8 4-17 8-25 14-1 1-5 4-11 9-7 5-11 8-11 8-13-19-26-37-39-52-15-18-25-28-30-31 0 0-2-1-5-1-3-1-5-1-5 0 1 1 9 9 23 26 4 5 12 16 24 33 13 17 20 29 23 34 3 5 8 15 14 28 7 13 10 20 11 22-2 0-12-3-32-9-1-1-4-2-8-3-3-1-7-2-9-2-3-1-5-2-5-2-1 0-1-1-1-3 0-1 0-2 0-2-1-2-4-4-9-5-4-1-9-1-13 0-4 1-7 3-8 6-1 1-2 4-2 7 1 0 4 1 7 1 4 1 6 1 9 2 11 3 21 6 30 9 19 7 28 10 29 10 2 1 6 2 12 6 6 3 10 5 13 6 1 0 3 1 6 2 2 1 3 2 4 2 0 0 1 0 2 0 0-3 0-6-1-10 0 0-1-3-3-8-3-4-5-9-8-15-3-5-4-8-5-9-4-10-12-22-22-38l19-8c2-1 9-4 21-9 12-5 18-8 19-8 1 0 2-3 3-7 1-5 2-8 1-9z m-58 139c0-3 0-6-1-8-3-5-7-8-15-11-5-2-11-3-17-3-5 0-9 3-14 7-2 3-4 7-5 12l0 1c1-1 3-1 6-2 3 0 6 0 8 0 1 1 7 2 16 5 7 2 12 3 16 4 3 0 5-2 6-5z m199-37l18-65-39 12z m-316-229l198 67 0 295-198-67z m354 91l29-9-51 188-29 9-62-153 30-9 12 31 61-18z m-143 275l163-53 0 109z m88-378l46-4-16-46-11 19c-25-16-51-26-79-31-11-2-20-3-26-3l-24 0c-15 0-34 4-57 11-23 8-41 16-53 24-1 2-2 3-2 5 0 2 1 3 2 4 1 1 2 1 3 1 1 0 3 0 5-2 3-1 6-3 9-4 3-2 5-3 6-4 14-7 29-12 46-17 16-5 31-7 45-7 18 0 34 1 47 4 14 3 29 8 45 14 3 2 6 3 9 5 3 1 6 3 10 5 3 2 6 4 8 5z m128 308l0-308-221 70c-2-1-38-13-107-36-69-23-104-35-105-35-2 0-4 1-5 4 0 0 0 0 0 1l0 308c0 1 1 2 1 2 1 2 3 3 5 4 21 6 35 11 43 14l0 110 159-57c1 0 16 5 46 16 30 10 61 21 91 31 30 10 45 15 46 15 4 0 5-2 5-6l0-119z"/>
<glyph glyph-name="wifi" unicode="&#65;" d="M256 416c-80 0-156-30-214-84l-10-10 10-9 32-32 10-10 9 9c45 41 102 64 163 64 60 0 118-23 163-64l9-9 10 10 32 32 10 9-10 10c-58 54-134 84-214 84z m141-160c-38 35-88 54-141 54l-9 0 0 0c-49-2-96-21-132-54l-11-10 10-10 33-32 9-9 10 8c25 22 57 35 90 35 33 0 65-13 91-35l9-8 9 9 33 32 10 10z m-141-160l10 9 53 53 10 10-11 10c-16 11-33 20-62 20-29 0-45-10-61-20l-12-10 11-10 53-53z"/>
<glyph glyph-name="bluetooth" unicode="&#66;" d="M140 368c-16-16-12-17-11-18 2-1 90-86 90-86 0 0 4-3 4-8 0-5-4-8-4-8 0 0-88-85-90-86-1-1-5-3 11-18 16-16 18-13 19-12l68 64c0 1 0 1 0 1 0 0 0 0 0 0 3 2 10 11 10 3 0-7 0-152 0-156l0-2c0-5 5-10 12-10 3 0 6 1 9 3 0 0 118 113 122 118 5 4 5 10 1 14l-83 81c0 0-5 4-5 8 0 4 5 8 5 8l83 81c4 4 4 10-1 14-4 5-122 117-122 117-2 3-6 4-9 4-7 0-12-5-12-10l0-2c0-5 0-149 0-156 0-8-7 1-10 3 0 0 0 0 0 0 0 0 0 0 0 0l-68 65c-1 1-3 4-19-12z m140 24c0 7 8-2 10-4l30-30c2-2 3-4 3-7 0-2-1-5-3-7-1-2-30-30-30-30-3-1-10-9-10-1 0 0 0 72 0 79z m0-193c0 8 7 0 10-2 0 0 29-27 31-29 1-2 2-5 2-7 0-3 0-6-3-8l-30-29c-2-2-10-11-10-4 0 6 0 79 0 79z"/>
<glyph glyph-name="usb" unicode="&#68;" d="M144 292c0 0 0 0 0 0z m240 92c0 17-14 32-32 32-18 0-32-15-32-32 0-12 7-23 16-28 2-2 3-5 3-6 0-1 0-1 0-1-1-17-4-32-7-42-5-12-39-39-52-42-6-1-8 1-8 10 0 0 0 139 0 141 0 1 0 3 2 5 9 6 14 15 14 27 0 17-14 32-32 32-17 0-32-15-32-32 0-12 6-22 15-27 0 0 0 0 0 0 0-1 0-1 0-1 0 0 1 0 1 0 2-2 3-3 3-4 0-2 0-190 0-197 0-7-1-12-8-11-8 0-42 23-52 44-4 9-6 19-6 28 0 0 0 0 0 0 0 3 0 12 3 14 8 6 13 15 13 26 0 17-15 32-33 32-17 0-32-14-32-32 0-12 7-23 16-28 2-2 3-3 4-11 1-7 3-24 9-40 7-18 21-32 40-45 13-9 25-16 32-26 7-10 10-14 10-27 0 0 0 1 0 0 0-13-4-14-9-18-14-9-24-24-24-42 0 0 0 0 0 0 0-1 0-1 0-1 0-28 22-50 50-50 27 0 50 22 50 50 0 13-5 25-14 34-3 3-6 6-10 9-7 5-10 11-10 18l0 24c0 25 4 41 11 53 8 13 19 23 36 34 18 13 32 27 39 45 6 15 8 31 9 51 0 2 1 6 3 7 8 6 14 16 14 27z m-224-80c-9 0-16 7-16 16 0 9 7 16 16 16 9 0 16-7 16-16 0-9-7-16-16-16z m96 128c-9 0-16 7-16 16 0 9 7 16 16 16 9 0 16-7 16-16 0-9-7-16-16-16z m96-64c-9 0-16 7-16 16 0 9 7 16 16 16 9 0 16-7 16-16 0-9-7-16-16-16z"/>
<glyph glyph-name="socket" unicode="&#67;" d="M0 43c0-24 19-43 43-43l426 0c24 0 43 19 43 43l0 117c0 24-19 43-43 43l-128 0 0 112c0 14-12 26-26 26-15 0-27-12-27-26l0-112-245 0c-24 0-43-19-43-43z m53 58c0 15 12 27 27 27 15 0 27-12 27-27 0-14-12-26-27-26-15 0-27 12-27 26z m96 0c0 15 12 27 27 27 15 0 27-12 27-27 0-14-12-26-27-26-15 0-27 12-27 26z m166 326c-62 0-112-50-112-112 0-15 12-27 26-27 15 0 27 12 27 27 0 32 26 58 59 58 32 0 58-26 58-58 0-15 12-27 27-27 15 0 27 12 27 27 0 62-50 112-112 112z m0 85c-109 0-198-88-198-197 0-15 12-27 27-27 15 0 27 12 27 27 0 79 64 144 144 144 79 0 144-65 144-144 0-15 12-27 26-27 15 0 27 12 27 27 0 109-88 197-197 197z"/>
<glyph glyph-name="websocket" unicode="&#69;" d="M256 512c-141 0-256-115-256-256 0-141 115-256 256-256 141 0 256 115 256 256 0 141-115 256-256 256z m0-472c-119 0-216 97-216 216 0 119 97 216 216 216 119 0 216-97 216-216 0-119-97-216-216-216z m0 136c-9 0-16-7-16-16 0-9 7-16 16-16 9 0 16 7 16 16 0 9-7 16-16 16z m0 64c-23 0-44-11-57-27l14-19c9 13 25 22 43 22 18 0 34-9 43-22l14 19c-13 16-34 27-57 27z m-93 26l14-19c20 21 48 33 79 33 31 0 59-12 79-33l14 19c-24 24-57 38-93 38-36 0-69-14-93-38z m-35 52l16-20c29 27 69 44 112 44 43 0 83-17 112-44l16 20c-34 31-79 50-128 50-49 0-94-19-128-50z"/>
<glyph glyph-name="project" unicode="&#71;" d="M132 426l-23 22c-6 6-17 6-23 0-6-6-6-16 0-22l23-23c6-6 16-6 23 0 6 6 6 16 0 23m-84-138l-32 0c-9 0-16-7-16-16 0-9 7-16 16-16l32 0c9 0 16 7 16 16 0 9-7 16-16 16m448-32l-32 0c-9 0-16-7-16-16 0-9 7-16 16-16l32 0c9 0 16 7 16 16 0 9-7 16-16 16m-48 170c-6 6-16 6-22 0l-23-23c-6-6-6-16 0-23 6-6 16-6 23 0l22 23c6 6 6 16 0 23m-176 22c4 0 8 2 11 5 3 3 5 7 5 11l0 32c0 9-7 16-16 16-7 0-12-4-15-10l-1-6 0-32c0-9 7-16 16-16m-16-64c-71 0-128-57-128-128 0-47 26-88 64-110l0-50 128 0 0 50c38 22 64 63 64 110 0 71-57 128-128 128m48-211l-16-9 0-36-64 0 0 36-16 9c-30 18-48 49-48 83 0 53 43 96 96 96 53 0 96-43 96-96 0-34-18-65-48-83m-112-141l33 0-1-4c0-15 14-28 32-28 18 0 32 13 32 28l-1 4 33 0 0 32-128 0z"/>
<glyph glyph-name="compress" unicode="&#70;" d="M256 238l0-128c0-5-2-10-5-13-4-4-8-6-13-6-5 0-10 2-13 6l-41 41-95-95c-2-2-4-3-7-3-2 0-4 1-6 3l-33 33c-2 2-3 4-3 6 0 3 1 5 3 7l95 95-41 41c-4 3-6 8-6 13 0 5 2 9 6 13 3 3 8 5 13 5l128 0c5 0 9-2 13-5 3-4 5-8 5-13z m216 192c0-3-1-5-3-7l-95-95 41-41c4-3 6-8 6-13 0-5-2-9-6-13-3-3-8-5-13-5l-128 0c-5 0-9 2-13 5-3 4-5 8-5 13l0 128c0 5 2 10 5 13 4 4 8 6 13 6 5 0 10-2 13-6l41-41 95 95c2 2 4 3 7 3 2 0 4-1 6-3l33-33c2-2 3-4 3-6z"/>
<glyph glyph-name="connect" unicode="&#72;" d="M21 331l0 10 256 0 0 139c0 18-13 32-30 32l-217 0c-16 0-30-14-30-32l0-149c0-18 14-32 30-32l98 0 0 21-98 0c-5 0-9 5-9 11z m0 149c0 6 4 11 9 11l217 0c5 0 9-5 9-11l0-117-235 0z m32-203c-6 0-10-4-10-10 0-6 4-11 10-11l75 0 0 21z m414 43l-273 0c-25 0-45-22-45-49l0-179c0-27 20-49 45-49l126 0 0-22-85 0c-6 0-11-4-11-10 0-6 5-11 11-11l188 0c6 0 11 5 11 11 0 6-5 10-11 10l-82 0 0 22 126 0c25 0 45 22 45 49l0 179c0 27-20 49-45 49z m-273-21l273 0c13 0 24-13 24-28l0-143-320 0 0 143c0 15 10 28 23 28z m273-235l-273 0c-13 0-23 12-23 28l0 15 320 0 0-15c0-16-11-28-24-28z m-126 21c0-6-4-10-10-10-6 0-11 4-11 10 0 6 5 11 11 11 6 0 10-5 10-11z"/>
<glyph glyph-name="help" unicode="&#74;" d="M256 0c-141 0-256 115-256 256 0 141 115 256 256 256 141 0 256-115 256-256 0-141-115-256-256-256z m0 448c-106 0-192-86-192-192 0-106 86-192 192-192 106 0 192 86 192 192 0 106-86 192-192 192z m0-64c-53 0-96-43-96-96l64 0c0 18 14 32 32 32 18 0 32-14 32-32 0-18-14-32-32-32-1 0-5 0-16 0-9 0-16-7-16-16l0-48 64 0 0 6c37 13 64 48 64 90 0 53-43 96-96 96z m0-224l-32 0 0-32 64 0 0 32z"/>
<glyph glyph-name="play" unicode="&#73;" d="M256 0c-141 0-256 115-256 256 0 141 115 256 256 256 141 0 256-115 256-256 0-141-115-256-256-256z m0 448c-106 0-192-86-192-192 0-106 86-192 192-192 106 0 192 86 192 192 0 106-86 192-192 192z m-64-96l160-96-160-96z"/>
<glyph glyph-name="remove" unicode="&#107;" d="M75 75c-100 100-100 262 0 362 100 100 262 100 362 0 100-100 100-262 0-362-100-100-262-100-362 0z m317 317c-75 75-197 75-272 0-75-75-75-197 0-272 75-75 197-75 272 0 75 75 75 197 0 272z m-204-249l-45 45 68 68-68 68 45 45 68-68 68 68 45-45-68-68 68-68-45-45-68 68z"/>
<glyph glyph-name="warning" unicode="&#111;" d="M293 119l0 54c0 3-1 5-3 7-2 2-4 3-7 3l-54 0c-3 0-5-1-7-3-2-2-3-4-3-7l0-54c0-3 1-5 3-7 2-1 4-2 7-2l54 0c3 0 5 1 7 2 2 2 3 4 3 7z m-1 107l5 131c0 2-1 4-3 6-2 2-4 3-7 3l-62 0c-3 0-5-1-7-3-2-2-3-4-3-6l5-131c0-2 1-3 3-5 1-1 4-2 6-2l53 0c3 0 5 1 7 2 2 2 3 3 3 5z m-4 267l219-402c7-12 7-24 0-36-3-6-8-10-13-14-6-3-12-4-19-4l-438 0c-7 0-13 1-19 4-5 4-10 8-13 14-7 12-7 24 0 36l219 402c3 6 8 10 13 14 6 3 12 5 19 5 7 0 13-2 19-5 5-4 10-8 13-14z"/>
</font></defs></svg>
