{
    "name": "Tes",
    "alias": "tes",
    "description": "",
    "keywords": [],
    "order": 0,
    "providers": [
        "Modules\\Tes\\Providers\\TesServiceProvider"
    ],
    "aliases": {},
    "files": [],
    "requires": []
}
