{
    "name": "Developer",
    "alias": "developer",
    "description": "",
    "keywords": [],
    "order": 0,
    "providers": [
        "Modules\\Developer\\Providers\\DeveloperServiceProvider"
    ],
    "aliases": {},
    "files": [],
    "requires": []
}
