{
    "version": "2.0.0",
    "tasks": [
        {
            "label": "rauth-client",
            "type": "npm",
            "script": "start:debug",
            "path": ".",
            "problemMatcher": []
        }
   ]
}