{
    // Use IntelliSense to learn about possible attributes.
    // Hover to view descriptions of existing attributes.
    // For more information, visit: https://go.microsoft.com/fwlink/?linkid=830387
    "version": "0.2.0",
    "configurations": [
        {
            "type": "chrome",
            "request": "launch",
            "name": "rauth-client",
            "url": "http://accounts.localhost:4210",
            "runtimeExecutable": "/usr/bin/chromium",
            "runtimeArgs": ["--remote-debugging-port=9222", "--user-data-dir=/tmp/rauth-client"],
            "webRoot": "${workspaceFolder}",
            "sourceMapPathOverrides": {
                "webpack:/*": "${webRoot}/*",
                "/./*": "${webRoot}/*",
                "/src/*": "${webRoot}/*",
                "/*": "*",
                "/./~/*": "${webRoot}/node_modules/*"
            }
        }
    ]
}