{
	"household_ID": null,
	"general_settings": {
		"n_items_before_shopping": 1,
    "thingspeak_write_API": null,
    "thingspeak_read_API": null,
    "thingspeak_channel_id": null
	},
	"users": []
}
