<?xml version="1.0" encoding="UTF-8" standalone="no"?>
<!-- Created with Inkscape (http://www.inkscape.org/) -->

<svg
   width="11.017217mm"
   height="4.7131543mm"
   viewBox="0 0 11.017217 4.7131543"
   version="1.1"
   id="svg496857"
   inkscape:version="1.1.2 (0a00cf5339, 2022-02-04)"
   sodipodi:docname="menu-button.svg"
   xmlns:inkscape="http://www.inkscape.org/namespaces/inkscape"
   xmlns:sodipodi="http://sodipodi.sourceforge.net/DTD/sodipodi-0.dtd"
   xmlns="http://www.w3.org/2000/svg"
   xmlns:svg="http://www.w3.org/2000/svg">
  <sodipodi:namedview
     id="namedview496859"
     pagecolor="#ffffff"
     bordercolor="#666666"
     borderopacity="1.0"
     inkscape:pageshadow="2"
     inkscape:pageopacity="0.0"
     inkscape:pagecheckerboard="0"
     inkscape:document-units="mm"
     showgrid="false"
     inkscape:zoom="0.75366162"
     inkscape:cx="-45.113084"
     inkscape:cy="84.918747"
     inkscape:window-width="1366"
     inkscape:window-height="736"
     inkscape:window-x="1920"
     inkscape:window-y="312"
     inkscape:window-maximized="1"
     inkscape:current-layer="layer1" />
  <defs
     id="defs496854" />
  <g
     inkscape:label="Layer 1"
     inkscape:groupmode="layer"
     id="layer1"
     transform="translate(-116.6616,-126.13278)">
    <g
       id="g249330"
       transform="matrix(1.3198391,0,0,1.0489583,2.65611,-247.06689)">
      <g
         id="g249328"
         transform="translate(-1.2707909,-0.13658921)">
        <rect
           style="fill:#ddac17;fill-opacity:1;stroke-width:0.21357"
           id="rect249322"
           width="8.2984285"
           height="0.25674254"
           x="87.698082"
           y="355.91782" />
        <rect
           style="fill:#ddac17;fill-opacity:1;stroke-width:0.223572"
           id="rect249324"
           width="8.2984285"
           height="0.28135371"
           x="87.649117"
           y="360.12964" />
        <rect
           style="fill:#ddac17;fill-opacity:1;stroke-width:0.176614"
           id="rect249326"
           width="5.1786084"
           height="0.28135371"
           x="90.768936"
           y="358.01303" />
      </g>
    </g>
  </g>
</svg>
