tick: 0.0, Temperature: 293.706
tick: 1.0, Temperature: 293.706
tick: 2.0, Temperature: 293.706
tick: 3.0, Temperature: 293.706
tick: 4.0, Temperature: 293.706
tick: 5.0, Temperature: 293.706
tick: 6.0, Temperature: 293.706
tick: 7.0, Temperature: 293.706
tick: 8.0, Temperature: 293.706
tick: 9.0, Temperature: 293.706
tick: 10.0, Temperature: 293.706
tick: 11.0, Temperature: 293.706
tick: 12.0, Temperature: 293.706
tick: 13.0, Temperature: 293.706
tick: 14.0, Temperature: 293.706
tick: 15.0, Temperature: 293.706
tick: 16.0, Temperature: 293.706
tick: 17.0, Temperature: 293.706
tick: 18.0, Temperature: 293.706
tick: 19.0, Temperature: 293.706
tick: 20.0, Temperature: 293.706
tick: 21.0, Temperature: 293.706
tick: 22.0, Temperature: 293.706
tick: 23.0, Temperature: 293.706
tick: 24.0, Temperature: 293.706
tick: 25.0, Temperature: 293.706
tick: 26.0, Temperature: 293.706
tick: 27.0, Temperature: 293.706
tick: 28.0, Temperature: 293.706
tick: 29.0, Temperature: 293.706
tick: 30.0, Temperature: 293.706
tick: 31.0, Temperature: 293.706
tick: 32.0, Temperature: 293.706
tick: 33.0, Temperature: 293.706
tick: 34.0, Temperature: 293.706
tick: 35.0, Temperature: 293.706
tick: 36.0, Temperature: 293.706
tick: 37.0, Temperature: 293.706
tick: 38.0, Temperature: 293.706
tick: 39.0, Temperature: 293.706
tick: 40.0, Temperature: 293.706
tick: 41.0, Temperature: 293.706
tick: 42.0, Temperature: 293.706
tick: 43.0, Temperature: 293.706
tick: 44.0, Temperature: 293.706
tick: 45.0, Temperature: 293.706
tick: 46.0, Temperature: 293.706
tick: 47.0, Temperature: 293.706
tick: 48.0, Temperature: 293.706
tick: 49.0, Temperature: 293.706
tick: 50.0, Temperature: 293.706
tick: 51.0, Temperature: 293.706
tick: 52.0, Temperature: 293.706
tick: 53.0, Temperature: 293.706
tick: 54.0, Temperature: 293.706
tick: 55.0, Temperature: 293.706
tick: 56.0, Temperature: 293.706
tick: 57.0, Temperature: 293.706
tick: 58.0, Temperature: 293.706
tick: 59.0, Temperature: 293.706
tick: 60.0, Temperature: 293.706
tick: 61.0, Temperature: 293.706
tick: 62.0, Temperature: 293.706
tick: 63.0, Temperature: 293.706
tick: 64.0, Temperature: 293.706
tick: 65.0, Temperature: 293.706
tick: 66.0, Temperature: 293.706
tick: 67.0, Temperature: 293.706
tick: 68.0, Temperature: 293.706
tick: 69.0, Temperature: 293.706
tick: 70.0, Temperature: 293.706
tick: 71.0, Temperature: 293.706
tick: 72.0, Temperature: 293.706
tick: 73.0, Temperature: 293.706
tick: 74.0, Temperature: 293.706
tick: 75.0, Temperature: 293.706
tick: 76.0, Temperature: 293.706
tick: 77.0, Temperature: 293.706
tick: 78.0, Temperature: 293.706
tick: 79.0, Temperature: 293.706
tick: 80.0, Temperature: 293.706
tick: 81.0, Temperature: 293.706
tick: 82.0, Temperature: 293.706
tick: 83.0, Temperature: 293.706
tick: 84.0, Temperature: 293.706
tick: 85.0, Temperature: 293.706
tick: 86.0, Temperature: 293.706
tick: 87.0, Temperature: 293.706
tick: 88.0, Temperature: 293.706
tick: 89.0, Temperature: 293.706
tick: 90.0, Temperature: 293.706
tick: 91.0, Temperature: 293.706
tick: 92.0, Temperature: 293.706
tick: 93.0, Temperature: 293.706
tick: 94.0, Temperature: 293.706
tick: 95.0, Temperature: 293.706
tick: 96.0, Temperature: 293.706
tick: 97.0, Temperature: 293.706
tick: 98.0, Temperature: 293.706
tick: 99.0, Temperature: 293.706
tick: 100.0, Temperature: 293.706
tick: 101.0, Temperature: 293.706
tick: 102.0, Temperature: 293.706
tick: 103.0, Temperature: 293.706
tick: 104.0, Temperature: 293.706
tick: 105.0, Temperature: 293.706
tick: 106.0, Temperature: 293.706
tick: 107.0, Temperature: 293.706
tick: 108.0, Temperature: 293.706
tick: 109.0, Temperature: 293.706
tick: 110.0, Temperature: 293.706
tick: 111.0, Temperature: 293.706
tick: 112.0, Temperature: 293.706
tick: 113.0, Temperature: 293.706
tick: 114.0, Temperature: 293.706
tick: 115.0, Temperature: 293.706
tick: 116.0, Temperature: 293.706
tick: 117.0, Temperature: 293.706
tick: 118.0, Temperature: 293.706
tick: 119.0, Temperature: 293.706
tick: 120.0, Temperature: 293.706
tick: 121.0, Temperature: 293.706
tick: 122.0, Temperature: 293.706
tick: 123.0, Temperature: 293.706
tick: 124.0, Temperature: 293.706
tick: 125.0, Temperature: 293.706
tick: 126.0, Temperature: 293.706
tick: 127.0, Temperature: 293.706
tick: 128.0, Temperature: 293.706
tick: 129.0, Temperature: 293.706
tick: 130.0, Temperature: 293.706
tick: 131.0, Temperature: 293.706
tick: 132.0, Temperature: 293.706
tick: 133.0, Temperature: 293.706
tick: 134.0, Temperature: 293.706
tick: 135.0, Temperature: 293.706
tick: 136.0, Temperature: 293.706
tick: 137.0, Temperature: 293.706
tick: 138.0, Temperature: 293.706
tick: 139.0, Temperature: 293.706
tick: 140.0, Temperature: 293.706
tick: 141.0, Temperature: 293.706
tick: 142.0, Temperature: 293.706
tick: 143.0, Temperature: 293.706
tick: 144.0, Temperature: 293.706
tick: 145.0, Temperature: 293.706
tick: 146.0, Temperature: 293.706
tick: 147.0, Temperature: 293.706
tick: 148.0, Temperature: 293.706
tick: 149.0, Temperature: 293.706
tick: 150.0, Temperature: 293.706
tick: 151.0, Temperature: 293.706
tick: 152.0, Temperature: 293.706
tick: 153.0, Temperature: 293.706
tick: 154.0, Temperature: 293.706
tick: 155.0, Temperature: 293.706
tick: 156.0, Temperature: 293.706
tick: 157.0, Temperature: 293.706
tick: 158.0, Temperature: 293.706
tick: 159.0, Temperature: 293.706
tick: 160.0, Temperature: 293.706
tick: 161.0, Temperature: 293.706
tick: 162.0, Temperature: 293.706
tick: 163.0, Temperature: 293.706
tick: 164.0, Temperature: 293.706
tick: 165.0, Temperature: 293.706
tick: 166.0, Temperature: 293.706
tick: 167.0, Temperature: 293.706
tick: 168.0, Temperature: 293.706
tick: 169.0, Temperature: 293.706
tick: 170.0, Temperature: 293.706
tick: 171.0, Temperature: 293.706
tick: 172.0, Temperature: 293.706
tick: 173.0, Temperature: 293.706
tick: 174.0, Temperature: 293.706
tick: 175.0, Temperature: 293.706
tick: 176.0, Temperature: 293.706
tick: 177.0, Temperature: 293.706
tick: 178.0, Temperature: 293.706
tick: 179.0, Temperature: 293.706
tick: 180.0, Temperature: 293.706
tick: 181.0, Temperature: 293.706
tick: 182.0, Temperature: 293.706
tick: 183.0, Temperature: 293.706
tick: 184.0, Temperature: 293.706
tick: 185.0, Temperature: 293.706
tick: 186.0, Temperature: 293.706
tick: 187.0, Temperature: 293.706
tick: 188.0, Temperature: 293.706
tick: 189.0, Temperature: 293.706
tick: 190.0, Temperature: 293.706
tick: 191.0, Temperature: 293.706
tick: 192.0, Temperature: 293.706
tick: 193.0, Temperature: 293.706
tick: 194.0, Temperature: 293.706
tick: 195.0, Temperature: 293.706
tick: 196.0, Temperature: 293.706
tick: 197.0, Temperature: 293.706
tick: 198.0, Temperature: 293.706
tick: 199.0, Temperature: 293.706
tick: 200.0, Temperature: 293.706
tick: 201.0, Temperature: 293.706
tick: 202.0, Temperature: 293.706
tick: 203.0, Temperature: 293.706
tick: 204.0, Temperature: 293.706
tick: 205.0, Temperature: 293.706
tick: 206.0, Temperature: 293.706
tick: 207.0, Temperature: 293.706
tick: 208.0, Temperature: 293.706
tick: 209.0, Temperature: 293.706
tick: 210.0, Temperature: 293.706
tick: 211.0, Temperature: 293.706
tick: 212.0, Temperature: 293.706
tick: 213.0, Temperature: 293.706
tick: 214.0, Temperature: 293.706
tick: 215.0, Temperature: 293.706
tick: 216.0, Temperature: 293.706
tick: 217.0, Temperature: 293.706
tick: 218.0, Temperature: 293.706
tick: 219.0, Temperature: 293.706
tick: 220.0, Temperature: 293.706
tick: 221.0, Temperature: 293.706
tick: 222.0, Temperature: 293.706
tick: 223.0, Temperature: 293.706
tick: 224.0, Temperature: 293.706
tick: 225.0, Temperature: 293.706
tick: 226.0, Temperature: 293.706
tick: 227.0, Temperature: 293.706
tick: 228.0, Temperature: 293.706
tick: 229.0, Temperature: 293.706
tick: 230.0, Temperature: 293.706
tick: 231.0, Temperature: 293.706
tick: 232.0, Temperature: 293.706
tick: 233.0, Temperature: 293.706
tick: 234.0, Temperature: 293.706
tick: 235.0, Temperature: 293.706
tick: 236.0, Temperature: 293.706
tick: 237.0, Temperature: 293.706
tick: 238.0, Temperature: 293.706
tick: 239.0, Temperature: 293.706
tick: 240.0, Temperature: 293.706
tick: 241.0, Temperature: 293.706
tick: 242.0, Temperature: 293.706
tick: 243.0, Temperature: 293.706
tick: 244.0, Temperature: 293.706
tick: 245.0, Temperature: 293.706
tick: 246.0, Temperature: 293.706
tick: 247.0, Temperature: 293.706
tick: 248.0, Temperature: 293.706
tick: 249.0, Temperature: 293.706
tick: 250.0, Temperature: 293.706
tick: 251.0, Temperature: 293.706
tick: 252.0, Temperature: 293.706
tick: 253.0, Temperature: 293.706
tick: 254.0, Temperature: 293.706
tick: 255.0, Temperature: 293.706
tick: 256.0, Temperature: 293.706
tick: 257.0, Temperature: 293.706
tick: 258.0, Temperature: 293.706
tick: 259.0, Temperature: 293.706
tick: 260.0, Temperature: 293.706
tick: 261.0, Temperature: 293.706
tick: 262.0, Temperature: 293.706
tick: 263.0, Temperature: 293.706
tick: 264.0, Temperature: 293.706
tick: 265.0, Temperature: 293.706
tick: 266.0, Temperature: 293.706
tick: 267.0, Temperature: 293.706
tick: 268.0, Temperature: 293.706
tick: 269.0, Temperature: 293.706
tick: 270.0, Temperature: 293.706
tick: 271.0, Temperature: 293.706
tick: 272.0, Temperature: 293.706
tick: 273.0, Temperature: 293.706
tick: 274.0, Temperature: 293.706
tick: 275.0, Temperature: 293.706
tick: 276.0, Temperature: 293.706
tick: 277.0, Temperature: 293.706
tick: 278.0, Temperature: 293.706
tick: 279.0, Temperature: 293.706
tick: 280.0, Temperature: 293.706
tick: 281.0, Temperature: 293.706
tick: 282.0, Temperature: 293.706
tick: 283.0, Temperature: 293.706
tick: 284.0, Temperature: 293.706
tick: 285.0, Temperature: 293.706
tick: 286.0, Temperature: 293.706
tick: 287.0, Temperature: 293.706
tick: 288.0, Temperature: 293.706
tick: 289.0, Temperature: 293.706
tick: 290.0, Temperature: 293.706
tick: 291.0, Temperature: 293.706
tick: 292.0, Temperature: 293.706
tick: 293.0, Temperature: 293.706
tick: 294.0, Temperature: 293.706
tick: 295.0, Temperature: 293.706
tick: 296.0, Temperature: 293.706
tick: 297.0, Temperature: 293.706
tick: 298.0, Temperature: 293.706
tick: 299.0, Temperature: 293.706
tick: 300.0, Temperature: 293.706
tick: 301.0, Temperature: 293.706
tick: 302.0, Temperature: 293.706
tick: 303.0, Temperature: 293.706
tick: 304.0, Temperature: 293.706
tick: 305.0, Temperature: 293.706
tick: 306.0, Temperature: 293.706
tick: 307.0, Temperature: 293.706
tick: 308.0, Temperature: 293.706
tick: 309.0, Temperature: 293.706
tick: 310.0, Temperature: 293.706
tick: 311.0, Temperature: 293.706
tick: 312.0, Temperature: 293.706
tick: 313.0, Temperature: 293.706
tick: 314.0, Temperature: 293.706
tick: 315.0, Temperature: 293.706
tick: 316.0, Temperature: 293.706
tick: 317.0, Temperature: 293.706
tick: 318.0, Temperature: 293.706
tick: 319.0, Temperature: 293.706
tick: 320.0, Temperature: 293.706
tick: 321.0, Temperature: 293.706
tick: 322.0, Temperature: 293.706
tick: 323.0, Temperature: 293.706
tick: 324.0, Temperature: 293.706
tick: 325.0, Temperature: 293.706
tick: 326.0, Temperature: 293.706
tick: 327.0, Temperature: 293.706
tick: 328.0, Temperature: 293.706
tick: 329.0, Temperature: 293.706
tick: 330.0, Temperature: 293.706
tick: 331.0, Temperature: 293.706
tick: 332.0, Temperature: 293.706
tick: 333.0, Temperature: 293.706
tick: 334.0, Temperature: 293.706
tick: 335.0, Temperature: 293.706
tick: 336.0, Temperature: 293.706
tick: 337.0, Temperature: 293.706
tick: 338.0, Temperature: 293.706
tick: 339.0, Temperature: 293.706
tick: 340.0, Temperature: 293.706
tick: 341.0, Temperature: 293.706
tick: 342.0, Temperature: 293.706
tick: 343.0, Temperature: 293.706
tick: 344.0, Temperature: 293.706
tick: 345.0, Temperature: 293.706
tick: 346.0, Temperature: 293.706
tick: 347.0, Temperature: 293.706
tick: 348.0, Temperature: 293.706
tick: 349.0, Temperature: 293.706
tick: 350.0, Temperature: 293.706
tick: 351.0, Temperature: 293.706
tick: 352.0, Temperature: 293.706
tick: 353.0, Temperature: 293.706
tick: 354.0, Temperature: 293.706
tick: 355.0, Temperature: 293.706
tick: 356.0, Temperature: 293.706
tick: 357.0, Temperature: 293.706
tick: 358.0, Temperature: 293.706
tick: 359.0, Temperature: 293.706
tick: 360.0, Temperature: 293.706
tick: 361.0, Temperature: 293.706
tick: 362.0, Temperature: 293.706
tick: 363.0, Temperature: 293.706
tick: 364.0, Temperature: 293.706
tick: 365.0, Temperature: 293.706
tick: 366.0, Temperature: 293.706
tick: 367.0, Temperature: 293.706
tick: 368.0, Temperature: 293.706
tick: 369.0, Temperature: 293.706
tick: 370.0, Temperature: 293.706
tick: 371.0, Temperature: 293.706
tick: 372.0, Temperature: 293.706
tick: 373.0, Temperature: 293.706
tick: 374.0, Temperature: 293.706
tick: 375.0, Temperature: 293.706
tick: 376.0, Temperature: 293.706
tick: 377.0, Temperature: 293.706
tick: 378.0, Temperature: 293.706
tick: 379.0, Temperature: 293.706
tick: 380.0, Temperature: 293.706
tick: 381.0, Temperature: 293.706
tick: 382.0, Temperature: 293.706
tick: 383.0, Temperature: 293.706
tick: 384.0, Temperature: 293.706
tick: 385.0, Temperature: 293.706
tick: 386.0, Temperature: 293.706
tick: 387.0, Temperature: 293.706
tick: 388.0, Temperature: 293.706
tick: 389.0, Temperature: 293.706
tick: 390.0, Temperature: 293.706
tick: 391.0, Temperature: 293.706
tick: 392.0, Temperature: 293.706
tick: 393.0, Temperature: 293.706
tick: 394.0, Temperature: 293.706
tick: 395.0, Temperature: 293.706
tick: 396.0, Temperature: 293.706
tick: 397.0, Temperature: 293.706
tick: 398.0, Temperature: 293.706
tick: 399.0, Temperature: 293.706
tick: 400.0, Temperature: 293.706
tick: 401.0, Temperature: 293.706
tick: 402.0, Temperature: 293.706
tick: 403.0, Temperature: 293.706
tick: 404.0, Temperature: 293.706
tick: 405.0, Temperature: 293.706
tick: 406.0, Temperature: 293.706
tick: 407.0, Temperature: 293.706
tick: 408.0, Temperature: 293.706
tick: 409.0, Temperature: 293.706
tick: 410.0, Temperature: 293.706
tick: 411.0, Temperature: 293.706
tick: 412.0, Temperature: 293.706
tick: 413.0, Temperature: 293.706
tick: 414.0, Temperature: 293.706
tick: 415.0, Temperature: 293.706
tick: 416.0, Temperature: 293.706
tick: 417.0, Temperature: 293.706
tick: 418.0, Temperature: 293.706
tick: 419.0, Temperature: 293.706
tick: 420.0, Temperature: 293.706
tick: 421.0, Temperature: 293.706
tick: 422.0, Temperature: 293.706
tick: 423.0, Temperature: 293.706
tick: 424.0, Temperature: 293.706
tick: 425.0, Temperature: 293.706
tick: 426.0, Temperature: 293.706
tick: 427.0, Temperature: 293.706
tick: 428.0, Temperature: 293.706
tick: 429.0, Temperature: 293.706
tick: 430.0, Temperature: 293.706
tick: 431.0, Temperature: 293.706
tick: 432.0, Temperature: 293.706
tick: 433.0, Temperature: 293.706
tick: 434.0, Temperature: 293.706
tick: 435.0, Temperature: 293.706
tick: 436.0, Temperature: 293.706
tick: 437.0, Temperature: 293.706
tick: 438.0, Temperature: 293.706
tick: 439.0, Temperature: 293.706
tick: 440.0, Temperature: 293.706
tick: 441.0, Temperature: 293.706
tick: 442.0, Temperature: 293.706
tick: 443.0, Temperature: 293.706
tick: 444.0, Temperature: 293.706
tick: 445.0, Temperature: 293.706
tick: 446.0, Temperature: 293.706
tick: 447.0, Temperature: 293.706
tick: 448.0, Temperature: 293.706
tick: 449.0, Temperature: 293.706
tick: 450.0, Temperature: 293.706
tick: 451.0, Temperature: 293.706
