tick: 1.0, Sterile: 0.0
tick: 2.0, Sterile: 0.0
tick: 3.0, Sterile: 0.0
tick: 4.0, Sterile: 0.0
tick: 5.0, Sterile: 0.0
tick: 6.0, Sterile: 0.0
tick: 7.0, Sterile: 0.0
tick: 8.0, Sterile: 0.0
tick: 9.0, Sterile: 0.0
tick: 10.0, Sterile: 0.0
