tick: 1.0, Fetal Count: 0.0
tick: 25.0, Fetal Count: 2.0
tick: 49.0, Fetal Count: 30.0
tick: 73.0, Fetal Count: 68.0
tick: 97.0, Fetal Count: 132.0
tick: 121.0, Fetal Count: 174.0
tick: 145.0, Fetal Count: 248.0
tick: 169.0, Fetal Count: 320.0
tick: 193.0, Fetal Count: 370.0
tick: 217.0, Fetal Count: 450.0
tick: 241.0, Fetal Count: 532.0
tick: 265.0, Fetal Count: 602.0
tick: 289.0, Fetal Count: 684.0
tick: 313.0, Fetal Count: 780.0
tick: 337.0, Fetal Count: 838.0
tick: 361.0, Fetal Count: 910.0
tick: 385.0, Fetal Count: 964.0
tick: 409.0, Fetal Count: 1036.0
tick: 433.0, Fetal Count: 1114.0
tick: 457.0, Fetal Count: 1170.0
tick: 481.0, Fetal Count: 1235.0
tick: 505.0, Fetal Count: 1291.0
tick: 529.0, Fetal Count: 1325.0
tick: 553.0, Fetal Count: 1338.0
tick: 577.0, Fetal Count: 1310.0
tick: 601.0, Fetal Count: 1300.0
tick: 625.0, Fetal Count: 1273.0
tick: 649.0, Fetal Count: 1228.0
tick: 673.0, Fetal Count: 1182.0
tick: 697.0, Fetal Count: 1126.0
tick: 721.0, Fetal Count: 1072.0
tick: 745.0, Fetal Count: 1055.0
tick: 769.0, Fetal Count: 1004.0
tick: 793.0, Fetal Count: 924.0
tick: 817.0, Fetal Count: 844.0
tick: 841.0, Fetal Count: 776.0
tick: 865.0, Fetal Count: 720.0
tick: 889.0, Fetal Count: 660.0
tick: 913.0, Fetal Count: 613.0
tick: 937.0, Fetal Count: 553.0
tick: 961.0, Fetal Count: 497.0
tick: 985.0, Fetal Count: 461.0
tick: 1009.0, Fetal Count: 426.0
tick: 1033.0, Fetal Count: 383.0
tick: 1057.0, Fetal Count: 352.0
tick: 1081.0, Fetal Count: 354.0
tick: 1105.0, Fetal Count: 347.0
tick: 1129.0, Fetal Count: 345.0
tick: 1153.0, Fetal Count: 380.0
tick: 1177.0, Fetal Count: 409.0
tick: 1201.0, Fetal Count: 421.0
tick: 1225.0, Fetal Count: 436.0
tick: 1249.0, Fetal Count: 463.0
tick: 1273.0, Fetal Count: 507.0
tick: 1297.0, Fetal Count: 558.0
tick: 1321.0, Fetal Count: 613.0
tick: 1345.0, Fetal Count: 676.0
tick: 1369.0, Fetal Count: 720.0
tick: 1393.0, Fetal Count: 752.0
tick: 1417.0, Fetal Count: 801.0
tick: 1441.0, Fetal Count: 832.0
tick: 1465.0, Fetal Count: 627.0
tick: 1489.0, Fetal Count: 670.0
tick: 1513.0, Fetal Count: 725.0
tick: 1537.0, Fetal Count: 768.0
tick: 1561.0, Fetal Count: 821.0
tick: 1585.0, Fetal Count: 829.0
tick: 1609.0, Fetal Count: 859.0
tick: 1633.0, Fetal Count: 851.0
tick: 1657.0, Fetal Count: 884.0
tick: 1681.0, Fetal Count: 870.0
tick: 1705.0, Fetal Count: 885.0
tick: 1729.0, Fetal Count: 842.0
tick: 1753.0, Fetal Count: 877.0
tick: 1777.0, Fetal Count: 820.0
tick: 1801.0, Fetal Count: 774.0
tick: 1825.0, Fetal Count: 737.0
tick: 1849.0, Fetal Count: 673.0
tick: 1873.0, Fetal Count: 689.0
tick: 1897.0, Fetal Count: 639.0
tick: 1921.0, Fetal Count: 644.0
tick: 1945.0, Fetal Count: 650.0
tick: 1969.0, Fetal Count: 610.0
tick: 1993.0, Fetal Count: 650.0
tick: 2017.0, Fetal Count: 682.0
tick: 2041.0, Fetal Count: 681.0
tick: 2065.0, Fetal Count: 682.0
tick: 2089.0, Fetal Count: 750.0
tick: 2113.0, Fetal Count: 820.0
tick: 2137.0, Fetal Count: 844.0
tick: 2161.0, Fetal Count: 828.0
tick: 2185.0, Fetal Count: 860.0
tick: 2209.0, Fetal Count: 860.0
tick: 2233.0, Fetal Count: 906.0
tick: 2257.0, Fetal Count: 931.0
tick: 2281.0, Fetal Count: 925.0
tick: 2305.0, Fetal Count: 923.0
tick: 2329.0, Fetal Count: 900.0
tick: 2353.0, Fetal Count: 900.0
tick: 2377.0, Fetal Count: 855.0
tick: 2401.0, Fetal Count: 809.0
tick: 2425.0, Fetal Count: 801.0
tick: 2449.0, Fetal Count: 791.0
tick: 2473.0, Fetal Count: 749.0
tick: 2497.0, Fetal Count: 677.0
tick: 2521.0, Fetal Count: 745.0
tick: 2545.0, Fetal Count: 718.0
tick: 2569.0, Fetal Count: 673.0
tick: 2593.0, Fetal Count: 699.0
tick: 2617.0, Fetal Count: 686.0
tick: 2641.0, Fetal Count: 748.0
tick: 2665.0, Fetal Count: 752.0
tick: 2689.0, Fetal Count: 764.0
tick: 2713.0, Fetal Count: 752.0
tick: 2737.0, Fetal Count: 783.0
tick: 2761.0, Fetal Count: 760.0
tick: 2785.0, Fetal Count: 736.0
tick: 2809.0, Fetal Count: 703.0
