tick: 0.0, Temperature: 293.706
tick: 1.0, Temperature: 293.706
tick: 2.0, Temperature: 293.706
tick: 3.0, Temperature: 293.706
tick: 4.0, Temperature: 293.706
tick: 5.0, Temperature: 293.706
tick: 6.0, Temperature: 293.706
tick: 7.0, Temperature: 293.706
tick: 8.0, Temperature: 293.706
tick: 9.0, Temperature: 293.706
tick: 10.0, Temperature: 293.706
tick: 11.0, Temperature: 293.706
tick: 12.0, Temperature: 293.706
tick: 13.0, Temperature: 293.706
tick: 14.0, Temperature: 293.706
tick: 15.0, Temperature: 293.706
tick: 16.0, Temperature: 293.706
tick: 17.0, Temperature: 293.706
tick: 18.0, Temperature: 293.706
tick: 19.0, Temperature: 293.706
tick: 20.0, Temperature: 293.706
tick: 21.0, Temperature: 293.706
tick: 22.0, Temperature: 293.706
tick: 23.0, Temperature: 293.706
tick: 24.0, Temperature: 293.706
tick: 25.0, Temperature: 293.706
tick: 26.0, Temperature: 293.706
tick: 27.0, Temperature: 293.706
tick: 28.0, Temperature: 293.706
tick: 29.0, Temperature: 293.706
tick: 30.0, Temperature: 293.706
tick: 31.0, Temperature: 293.706
tick: 32.0, Temperature: 293.706
tick: 33.0, Temperature: 293.706
tick: 34.0, Temperature: 293.706
tick: 35.0, Temperature: 293.706
tick: 36.0, Temperature: 293.706
tick: 37.0, Temperature: 293.706
tick: 38.0, Temperature: 293.706
tick: 39.0, Temperature: 293.706
tick: 40.0, Temperature: 293.706
tick: 41.0, Temperature: 293.706
