tick: 1.0, AdultDuration: 31.955549387816507
tick: 25.0, AdultDuration: 31.96513402331493
tick: 49.0, AdultDuration: 31.967249938541887
tick: 73.0, AdultDuration: 31.967725582957318
tick: 97.0, AdultDuration: 31.967915109454477
tick: 121.0, AdultDuration: 31.967983703182167
tick: 145.0, AdultDuration: 31.96800171528437
tick: 169.0, AdultDuration: 31.968678576403477
tick: 193.0, AdultDuration: 31.96934700233745
tick: 217.0, AdultDuration: 31.970168413551203
tick: 241.0, AdultDuration: 31.970991068130452
tick: 265.0, AdultDuration: 31.971743004934602
tick: 289.0, AdultDuration: 31.972215112922022
tick: 313.0, AdultDuration: 31.973184009446236
tick: 337.0, AdultDuration: 31.97408632262653
tick: 361.0, AdultDuration: 31.975272109835615
tick: 385.0, AdultDuration: 31.977149316853843
tick: 409.0, AdultDuration: 31.979794452233946
tick: 433.0, AdultDuration: 31.980294586787352
tick: 457.0, AdultDuration: 31.982506641518395
tick: 481.0, AdultDuration: 31.986781584457393
tick: 505.0, AdultDuration: 31.991050462497505
tick: 529.0, AdultDuration: 31.994594197097022
tick: 553.0, AdultDuration: 31.999492645139554
tick: 577.0, AdultDuration: 32.012727760756576
tick: 601.0, AdultDuration: 32.02483838653418
tick: 625.0, AdultDuration: 32.046646487305594
tick: 649.0, AdultDuration: 32.076711312879
tick: 673.0, AdultDuration: 32.14134762349858
tick: 697.0, AdultDuration: 32.23786715966686
tick: 721.0, AdultDuration: 31.757651433670528
tick: 745.0, AdultDuration: 32.05875438224088
tick: 769.0, AdultDuration: 32.30115507323218
tick: 793.0, AdultDuration: 32.55046420041485
tick: 817.0, AdultDuration: NaN
