tick: 1.0, Sterile: 0.0
tick: 2.0, Sterile: 0.0
tick: 3.0, Sterile: 0.0
tick: 4.0, Sterile: 0.0
tick: 5.0, Sterile: 0.0
tick: 6.0, Sterile: 0.0
tick: 7.0, Sterile: 0.0
tick: 8.0, Sterile: 0.0
tick: 9.0, Sterile: 0.0
tick: 10.0, Sterile: 0.0
tick: 11.0, Sterile: 0.0
tick: 12.0, Sterile: 0.0
tick: 13.0, Sterile: 0.0
tick: 14.0, Sterile: 0.0
tick: 15.0, Sterile: 0.0
tick: 16.0, Sterile: 0.0
tick: 17.0, Sterile: 0.0
tick: 18.0, Sterile: 0.0
tick: 19.0, Sterile: 0.0
tick: 20.0, Sterile: 0.0
tick: 21.0, Sterile: 0.0
tick: 22.0, Sterile: 0.0
tick: 23.0, Sterile: 0.0
tick: 24.0, Sterile: 0.0
tick: 25.0, Sterile: 0.0
tick: 26.0, Sterile: 0.0
tick: 27.0, Sterile: 0.0
tick: 28.0, Sterile: 0.0
tick: 29.0, Sterile: 0.0
tick: 30.0, Sterile: 0.0
tick: 31.0, Sterile: 0.0
tick: 32.0, Sterile: 0.0
tick: 33.0, Sterile: 0.0
tick: 34.0, Sterile: 0.0
tick: 35.0, Sterile: 0.0
tick: 36.0, Sterile: 0.0
tick: 37.0, Sterile: 0.0
tick: 38.0, Sterile: 0.0
tick: 39.0, Sterile: 0.0
tick: 40.0, Sterile: 0.0
tick: 41.0, Sterile: 0.0
tick: 42.0, Sterile: 0.0
tick: 43.0, Sterile: 0.0
tick: 44.0, Sterile: 0.0
tick: 45.0, Sterile: 0.0
tick: 46.0, Sterile: 0.0
tick: 47.0, Sterile: 0.0
tick: 48.0, Sterile: 0.0
tick: 49.0, Sterile: 0.0
tick: 50.0, Sterile: 0.0
tick: 51.0, Sterile: 0.0
tick: 52.0, Sterile: 0.0
tick: 53.0, Sterile: 0.0
tick: 54.0, Sterile: 0.0
tick: 55.0, Sterile: 0.0
tick: 56.0, Sterile: 0.0
tick: 57.0, Sterile: 0.0
tick: 58.0, Sterile: 0.0
tick: 59.0, Sterile: 0.0
tick: 60.0, Sterile: 0.0
tick: 61.0, Sterile: 0.0
tick: 62.0, Sterile: 0.0
tick: 63.0, Sterile: 0.0
tick: 64.0, Sterile: 0.0
tick: 65.0, Sterile: 0.0
tick: 66.0, Sterile: 0.0
tick: 67.0, Sterile: 0.0
tick: 68.0, Sterile: 0.0
tick: 69.0, Sterile: 0.0
tick: 70.0, Sterile: 0.0
tick: 71.0, Sterile: 0.0
tick: 72.0, Sterile: 0.0
tick: 73.0, Sterile: 0.0
tick: 74.0, Sterile: 0.0
tick: 75.0, Sterile: 0.0
tick: 76.0, Sterile: 0.0
tick: 77.0, Sterile: 0.0
tick: 78.0, Sterile: 0.0
tick: 79.0, Sterile: 0.0
tick: 80.0, Sterile: 0.0
tick: 81.0, Sterile: 0.0
tick: 82.0, Sterile: 0.0
tick: 83.0, Sterile: 0.0
tick: 84.0, Sterile: 0.0
tick: 85.0, Sterile: 0.0
tick: 86.0, Sterile: 0.0
tick: 87.0, Sterile: 0.0
tick: 88.0, Sterile: 0.0
tick: 89.0, Sterile: 0.0
tick: 90.0, Sterile: 0.0
tick: 91.0, Sterile: 0.0
tick: 92.0, Sterile: 0.0
tick: 93.0, Sterile: 0.0
tick: 94.0, Sterile: 0.0
tick: 95.0, Sterile: 0.0
tick: 96.0, Sterile: 0.0
tick: 97.0, Sterile: 0.0
tick: 98.0, Sterile: 0.0
tick: 99.0, Sterile: 0.0
tick: 100.0, Sterile: 0.0
tick: 101.0, Sterile: 0.0
tick: 102.0, Sterile: 0.0
tick: 103.0, Sterile: 0.0
tick: 104.0, Sterile: 0.0
tick: 105.0, Sterile: 0.0
tick: 106.0, Sterile: 0.0
tick: 107.0, Sterile: 0.0
tick: 108.0, Sterile: 0.0
tick: 109.0, Sterile: 0.0
tick: 110.0, Sterile: 0.0
tick: 111.0, Sterile: 0.0
tick: 112.0, Sterile: 0.0
tick: 113.0, Sterile: 0.0
tick: 114.0, Sterile: 0.0
tick: 115.0, Sterile: 0.0
tick: 116.0, Sterile: 0.0
tick: 117.0, Sterile: 0.0
tick: 118.0, Sterile: 0.0
tick: 119.0, Sterile: 0.0
tick: 120.0, Sterile: 0.0
tick: 121.0, Sterile: 0.0
tick: 122.0, Sterile: 0.0
tick: 123.0, Sterile: 0.0
tick: 124.0, Sterile: 0.0
tick: 125.0, Sterile: 0.0
tick: 126.0, Sterile: 0.0
tick: 127.0, Sterile: 0.0
tick: 128.0, Sterile: 0.0
tick: 129.0, Sterile: 0.0
tick: 130.0, Sterile: 0.0
tick: 131.0, Sterile: 0.0
tick: 132.0, Sterile: 0.0
tick: 133.0, Sterile: 0.0
tick: 134.0, Sterile: 0.0
tick: 135.0, Sterile: 0.0
tick: 136.0, Sterile: 0.0
tick: 137.0, Sterile: 0.0
tick: 138.0, Sterile: 0.0
tick: 139.0, Sterile: 0.0
tick: 140.0, Sterile: 0.0
tick: 141.0, Sterile: 0.0
tick: 142.0, Sterile: 0.0
tick: 143.0, Sterile: 0.0
tick: 144.0, Sterile: 0.0
tick: 145.0, Sterile: 0.0
tick: 146.0, Sterile: 0.0
tick: 147.0, Sterile: 0.0
tick: 148.0, Sterile: 0.0
tick: 149.0, Sterile: 0.0
tick: 150.0, Sterile: 0.0
tick: 151.0, Sterile: 0.0
tick: 152.0, Sterile: 0.0
tick: 153.0, Sterile: 0.0
tick: 154.0, Sterile: 0.0
tick: 155.0, Sterile: 0.0
tick: 156.0, Sterile: 0.0
tick: 157.0, Sterile: 0.0
tick: 158.0, Sterile: 0.0
tick: 159.0, Sterile: 0.0
tick: 160.0, Sterile: 0.0
tick: 161.0, Sterile: 0.0
tick: 162.0, Sterile: 0.0
tick: 163.0, Sterile: 0.0
tick: 164.0, Sterile: 0.0
tick: 165.0, Sterile: 0.0
tick: 166.0, Sterile: 0.0
tick: 167.0, Sterile: 0.0
tick: 168.0, Sterile: 0.0
tick: 169.0, Sterile: 0.0
tick: 170.0, Sterile: 0.0
tick: 171.0, Sterile: 0.0
tick: 172.0, Sterile: 0.0
tick: 173.0, Sterile: 0.0
tick: 174.0, Sterile: 0.0
tick: 175.0, Sterile: 0.0
tick: 176.0, Sterile: 0.0
tick: 177.0, Sterile: 0.0
tick: 178.0, Sterile: 0.0
tick: 179.0, Sterile: 0.0
tick: 180.0, Sterile: 0.0
tick: 181.0, Sterile: 0.0
tick: 182.0, Sterile: 0.0
tick: 183.0, Sterile: 0.0
tick: 184.0, Sterile: 0.0
tick: 185.0, Sterile: 0.0
tick: 186.0, Sterile: 0.0
tick: 187.0, Sterile: 0.0
tick: 188.0, Sterile: 0.0
tick: 189.0, Sterile: 0.0
tick: 190.0, Sterile: 0.0
tick: 191.0, Sterile: 0.0
tick: 192.0, Sterile: 0.0
tick: 193.0, Sterile: 0.0
tick: 194.0, Sterile: 0.0
tick: 195.0, Sterile: 0.0
tick: 196.0, Sterile: 0.0
tick: 197.0, Sterile: 0.0
tick: 198.0, Sterile: 0.0
tick: 199.0, Sterile: 0.0
tick: 200.0, Sterile: 0.0
tick: 201.0, Sterile: 0.0
tick: 202.0, Sterile: 0.0
tick: 203.0, Sterile: 0.0
tick: 204.0, Sterile: 0.0
tick: 205.0, Sterile: 0.0
tick: 206.0, Sterile: 0.0
tick: 207.0, Sterile: 0.0
tick: 208.0, Sterile: 0.0
tick: 209.0, Sterile: 0.0
tick: 210.0, Sterile: 0.0
tick: 211.0, Sterile: 0.0
tick: 212.0, Sterile: 0.0
tick: 213.0, Sterile: 0.0
tick: 214.0, Sterile: 0.0
tick: 215.0, Sterile: 0.0
tick: 216.0, Sterile: 0.0
tick: 217.0, Sterile: 0.0
tick: 218.0, Sterile: 0.0
tick: 219.0, Sterile: 0.0
tick: 220.0, Sterile: 0.0
tick: 221.0, Sterile: 0.0
tick: 222.0, Sterile: 0.0
tick: 223.0, Sterile: 0.0
tick: 224.0, Sterile: 0.0
tick: 225.0, Sterile: 0.0
tick: 226.0, Sterile: 0.0
tick: 227.0, Sterile: 0.0
tick: 228.0, Sterile: 0.0
tick: 229.0, Sterile: 0.0
tick: 230.0, Sterile: 0.0
tick: 231.0, Sterile: 0.0
tick: 232.0, Sterile: 0.0
tick: 233.0, Sterile: 0.0
tick: 234.0, Sterile: 0.0
tick: 235.0, Sterile: 0.0
tick: 236.0, Sterile: 0.0
tick: 237.0, Sterile: 0.0
tick: 238.0, Sterile: 0.0
tick: 239.0, Sterile: 0.0
tick: 240.0, Sterile: 0.0
tick: 241.0, Sterile: 0.0
tick: 242.0, Sterile: 0.0
tick: 243.0, Sterile: 0.0
tick: 244.0, Sterile: 0.0
tick: 245.0, Sterile: 0.0
tick: 246.0, Sterile: 0.0
tick: 247.0, Sterile: 0.0
tick: 248.0, Sterile: 0.0
tick: 249.0, Sterile: 0.0
tick: 250.0, Sterile: 0.0
tick: 251.0, Sterile: 0.0
tick: 252.0, Sterile: 0.0
tick: 253.0, Sterile: 0.0
tick: 254.0, Sterile: 0.0
tick: 255.0, Sterile: 0.0
tick: 256.0, Sterile: 0.0
tick: 257.0, Sterile: 0.0
tick: 258.0, Sterile: 0.0
tick: 259.0, Sterile: 0.0
tick: 260.0, Sterile: 0.0
tick: 261.0, Sterile: 0.0
tick: 262.0, Sterile: 0.0
tick: 263.0, Sterile: 0.0
tick: 264.0, Sterile: 0.0
tick: 265.0, Sterile: 0.0
tick: 266.0, Sterile: 0.0
tick: 267.0, Sterile: 0.0
tick: 268.0, Sterile: 0.0
tick: 269.0, Sterile: 0.0
tick: 270.0, Sterile: 0.0
tick: 271.0, Sterile: 0.0
tick: 272.0, Sterile: 0.0
tick: 273.0, Sterile: 0.0
tick: 274.0, Sterile: 0.0
tick: 275.0, Sterile: 0.0
tick: 276.0, Sterile: 0.0
tick: 277.0, Sterile: 0.0
tick: 278.0, Sterile: 0.0
tick: 279.0, Sterile: 0.0
tick: 280.0, Sterile: 0.0
tick: 281.0, Sterile: 0.0
tick: 282.0, Sterile: 0.0
tick: 283.0, Sterile: 0.0
tick: 284.0, Sterile: 0.0
tick: 285.0, Sterile: 0.0
tick: 286.0, Sterile: 0.0
tick: 287.0, Sterile: 0.0
tick: 288.0, Sterile: 0.0
tick: 289.0, Sterile: 0.0
tick: 290.0, Sterile: 0.0
tick: 291.0, Sterile: 0.0
tick: 292.0, Sterile: 0.0
tick: 293.0, Sterile: 0.0
tick: 294.0, Sterile: 0.0
tick: 295.0, Sterile: 0.0
tick: 296.0, Sterile: 0.0
tick: 297.0, Sterile: 0.0
tick: 298.0, Sterile: 0.0
tick: 299.0, Sterile: 0.0
tick: 300.0, Sterile: 0.0
tick: 301.0, Sterile: 0.0
tick: 302.0, Sterile: 0.0
tick: 303.0, Sterile: 0.0
tick: 304.0, Sterile: 0.0
tick: 305.0, Sterile: 0.0
tick: 306.0, Sterile: 0.0
tick: 307.0, Sterile: 0.0
tick: 308.0, Sterile: 0.0
tick: 309.0, Sterile: 0.0
tick: 310.0, Sterile: 0.0
tick: 311.0, Sterile: 0.0
tick: 312.0, Sterile: 0.0
tick: 313.0, Sterile: 0.0
tick: 314.0, Sterile: 0.0
tick: 315.0, Sterile: 0.0
tick: 316.0, Sterile: 0.0
tick: 317.0, Sterile: 0.0
tick: 318.0, Sterile: 0.0
tick: 319.0, Sterile: 0.0
tick: 320.0, Sterile: 0.0
tick: 321.0, Sterile: 0.0
tick: 322.0, Sterile: 0.0
tick: 323.0, Sterile: 0.0
tick: 324.0, Sterile: 0.0
tick: 325.0, Sterile: 0.0
tick: 326.0, Sterile: 0.0
tick: 327.0, Sterile: 0.0
tick: 328.0, Sterile: 0.0
tick: 329.0, Sterile: 0.0
tick: 330.0, Sterile: 0.0
tick: 331.0, Sterile: 0.0
tick: 332.0, Sterile: 0.0
tick: 333.0, Sterile: 0.0
tick: 334.0, Sterile: 0.0
tick: 335.0, Sterile: 0.0
tick: 336.0, Sterile: 0.0
tick: 337.0, Sterile: 0.0
tick: 338.0, Sterile: 0.0
tick: 339.0, Sterile: 0.0
tick: 340.0, Sterile: 0.0
tick: 341.0, Sterile: 0.0
tick: 342.0, Sterile: 0.0
tick: 343.0, Sterile: 0.0
tick: 344.0, Sterile: 0.0
tick: 345.0, Sterile: 0.0
tick: 346.0, Sterile: 0.0
tick: 347.0, Sterile: 0.0
tick: 348.0, Sterile: 0.0
tick: 349.0, Sterile: 0.0
tick: 350.0, Sterile: 0.0
tick: 351.0, Sterile: 0.0
tick: 352.0, Sterile: 0.0
tick: 353.0, Sterile: 0.0
tick: 354.0, Sterile: 0.0
tick: 355.0, Sterile: 0.0
tick: 356.0, Sterile: 0.0
tick: 357.0, Sterile: 0.0
tick: 358.0, Sterile: 0.0
tick: 359.0, Sterile: 0.0
tick: 360.0, Sterile: 0.0
tick: 361.0, Sterile: 0.0
tick: 362.0, Sterile: 0.0
tick: 363.0, Sterile: 0.0
tick: 364.0, Sterile: 0.0
tick: 365.0, Sterile: 0.0
tick: 366.0, Sterile: 0.0
tick: 367.0, Sterile: 0.0
tick: 368.0, Sterile: 0.0
tick: 369.0, Sterile: 0.0
tick: 370.0, Sterile: 0.0
tick: 371.0, Sterile: 0.0
tick: 372.0, Sterile: 0.0
tick: 373.0, Sterile: 0.0
tick: 374.0, Sterile: 0.0
tick: 375.0, Sterile: 0.0
tick: 376.0, Sterile: 0.0
tick: 377.0, Sterile: 0.0
tick: 378.0, Sterile: 0.0
tick: 379.0, Sterile: 0.0
tick: 380.0, Sterile: 0.0
tick: 381.0, Sterile: 0.0
tick: 382.0, Sterile: 0.0
tick: 383.0, Sterile: 0.0
tick: 384.0, Sterile: 0.0
tick: 385.0, Sterile: 0.0
tick: 386.0, Sterile: 0.0
tick: 387.0, Sterile: 0.0
tick: 388.0, Sterile: 0.0
tick: 389.0, Sterile: 0.0
tick: 390.0, Sterile: 0.0
tick: 391.0, Sterile: 0.0
tick: 392.0, Sterile: 0.0
tick: 393.0, Sterile: 0.0
tick: 394.0, Sterile: 0.0
tick: 395.0, Sterile: 0.0
tick: 396.0, Sterile: 0.0
tick: 397.0, Sterile: 0.0
tick: 398.0, Sterile: 0.0
tick: 399.0, Sterile: 0.0
tick: 400.0, Sterile: 0.0
tick: 401.0, Sterile: 0.0
tick: 402.0, Sterile: 0.0
tick: 403.0, Sterile: 0.0
tick: 404.0, Sterile: 0.0
tick: 405.0, Sterile: 0.0
tick: 406.0, Sterile: 0.0
tick: 407.0, Sterile: 0.0
tick: 408.0, Sterile: 0.0
tick: 409.0, Sterile: 0.0
tick: 410.0, Sterile: 0.0
tick: 411.0, Sterile: 0.0
tick: 412.0, Sterile: 0.0
tick: 413.0, Sterile: 0.0
tick: 414.0, Sterile: 0.0
tick: 415.0, Sterile: 0.0
tick: 416.0, Sterile: 0.0
tick: 417.0, Sterile: 0.0
tick: 418.0, Sterile: 0.0
tick: 419.0, Sterile: 0.0
tick: 420.0, Sterile: 0.0
tick: 421.0, Sterile: 0.0
tick: 422.0, Sterile: 0.0
tick: 423.0, Sterile: 0.0
tick: 424.0, Sterile: 0.0
tick: 425.0, Sterile: 0.0
tick: 426.0, Sterile: 0.0
tick: 427.0, Sterile: 0.0
tick: 428.0, Sterile: 0.0
tick: 429.0, Sterile: 0.0
tick: 430.0, Sterile: 0.0
tick: 431.0, Sterile: 0.0
tick: 432.0, Sterile: 0.0
tick: 433.0, Sterile: 0.0
tick: 434.0, Sterile: 0.0
tick: 435.0, Sterile: 0.0
tick: 436.0, Sterile: 0.0
tick: 437.0, Sterile: 0.0
tick: 438.0, Sterile: 0.0
tick: 439.0, Sterile: 0.0
tick: 440.0, Sterile: 0.0
tick: 441.0, Sterile: 0.0
tick: 442.0, Sterile: 0.0
tick: 443.0, Sterile: 0.0
tick: 444.0, Sterile: 0.0
tick: 445.0, Sterile: 0.0
tick: 446.0, Sterile: 0.0
tick: 447.0, Sterile: 0.0
tick: 448.0, Sterile: 0.0
tick: 449.0, Sterile: 0.0
tick: 450.0, Sterile: 0.0
tick: 451.0, Sterile: 0.0
tick: 452.0, Sterile: 0.0
tick: 453.0, Sterile: 0.0
tick: 454.0, Sterile: 0.0
tick: 455.0, Sterile: 0.0
tick: 456.0, Sterile: 0.0
tick: 457.0, Sterile: 0.0
tick: 458.0, Sterile: 0.0
tick: 459.0, Sterile: 0.0
tick: 460.0, Sterile: 0.0
tick: 461.0, Sterile: 0.0
tick: 462.0, Sterile: 0.0
tick: 463.0, Sterile: 0.0
tick: 464.0, Sterile: 0.0
tick: 465.0, Sterile: 0.0
tick: 466.0, Sterile: 0.0
tick: 467.0, Sterile: 0.0
tick: 468.0, Sterile: 0.0
tick: 469.0, Sterile: 0.0
tick: 470.0, Sterile: 0.0
tick: 471.0, Sterile: 0.0
tick: 472.0, Sterile: 0.0
tick: 473.0, Sterile: 0.0
tick: 474.0, Sterile: 0.0
tick: 475.0, Sterile: 0.0
tick: 476.0, Sterile: 0.0
tick: 477.0, Sterile: 0.0
tick: 478.0, Sterile: 0.0
tick: 479.0, Sterile: 0.0
tick: 480.0, Sterile: 0.0
tick: 481.0, Sterile: 0.0
tick: 482.0, Sterile: 0.0
tick: 483.0, Sterile: 0.0
tick: 484.0, Sterile: 0.0
tick: 485.0, Sterile: 0.0
tick: 486.0, Sterile: 0.0
tick: 487.0, Sterile: 0.0
tick: 488.0, Sterile: 0.0
tick: 489.0, Sterile: 0.0
tick: 490.0, Sterile: 0.0
tick: 491.0, Sterile: 0.0
tick: 492.0, Sterile: 0.0
tick: 493.0, Sterile: 0.0
tick: 494.0, Sterile: 0.0
tick: 495.0, Sterile: 0.0
tick: 496.0, Sterile: 0.0
tick: 497.0, Sterile: 0.0
tick: 498.0, Sterile: 0.0
tick: 499.0, Sterile: 0.0
tick: 500.0, Sterile: 0.0
tick: 501.0, Sterile: 0.0
tick: 502.0, Sterile: 0.0
tick: 503.0, Sterile: 0.0
tick: 504.0, Sterile: 0.0
tick: 505.0, Sterile: 0.0
tick: 506.0, Sterile: 0.0
tick: 507.0, Sterile: 0.0
tick: 508.0, Sterile: 0.0
tick: 509.0, Sterile: 0.0
tick: 510.0, Sterile: 0.0
tick: 511.0, Sterile: 0.0
tick: 512.0, Sterile: 0.0
tick: 513.0, Sterile: 0.0
tick: 514.0, Sterile: 0.0
tick: 515.0, Sterile: 0.0
tick: 516.0, Sterile: 0.0
tick: 517.0, Sterile: 0.0
tick: 518.0, Sterile: 0.0
tick: 519.0, Sterile: 0.0
tick: 520.0, Sterile: 0.0
tick: 521.0, Sterile: 0.0
tick: 522.0, Sterile: 0.0
tick: 523.0, Sterile: 0.0
tick: 524.0, Sterile: 0.0
tick: 525.0, Sterile: 0.0
tick: 526.0, Sterile: 0.0
tick: 527.0, Sterile: 0.0
tick: 528.0, Sterile: 0.0
tick: 529.0, Sterile: 0.0
tick: 530.0, Sterile: 0.0
tick: 531.0, Sterile: 0.0
tick: 532.0, Sterile: 0.0
tick: 533.0, Sterile: 0.0
tick: 534.0, Sterile: 0.0
tick: 535.0, Sterile: 0.0
tick: 536.0, Sterile: 0.0
tick: 537.0, Sterile: 0.0
tick: 538.0, Sterile: 0.0
tick: 539.0, Sterile: 0.0
tick: 540.0, Sterile: 0.0
tick: 541.0, Sterile: 0.0
tick: 542.0, Sterile: 0.0
tick: 543.0, Sterile: 0.0
tick: 544.0, Sterile: 0.0
tick: 545.0, Sterile: 0.0
tick: 546.0, Sterile: 0.0
tick: 547.0, Sterile: 0.0
tick: 548.0, Sterile: 0.0
tick: 549.0, Sterile: 0.0
tick: 550.0, Sterile: 0.0
tick: 551.0, Sterile: 0.0
tick: 552.0, Sterile: 0.0
tick: 553.0, Sterile: 0.0
tick: 554.0, Sterile: 0.0
tick: 555.0, Sterile: 0.0
tick: 556.0, Sterile: 0.0
tick: 557.0, Sterile: 0.0
tick: 558.0, Sterile: 0.0
tick: 559.0, Sterile: 0.0
tick: 560.0, Sterile: 0.0
tick: 561.0, Sterile: 0.0
tick: 562.0, Sterile: 0.0
tick: 563.0, Sterile: 0.0
tick: 564.0, Sterile: 0.0
tick: 565.0, Sterile: 0.0
tick: 566.0, Sterile: 0.0
tick: 567.0, Sterile: 0.0
tick: 568.0, Sterile: 0.0
tick: 569.0, Sterile: 0.0
tick: 570.0, Sterile: 0.0
tick: 571.0, Sterile: 0.0
tick: 572.0, Sterile: 0.0
tick: 573.0, Sterile: 0.0
tick: 574.0, Sterile: 0.0
tick: 575.0, Sterile: 0.0
tick: 576.0, Sterile: 0.0
tick: 577.0, Sterile: 0.0
tick: 578.0, Sterile: 0.0
tick: 579.0, Sterile: 0.0
tick: 580.0, Sterile: 0.0
tick: 581.0, Sterile: 0.0
tick: 582.0, Sterile: 0.0
tick: 583.0, Sterile: 0.0
tick: 584.0, Sterile: 0.0
tick: 585.0, Sterile: 0.0
tick: 586.0, Sterile: 0.0
tick: 587.0, Sterile: 0.0
tick: 588.0, Sterile: 0.0
tick: 589.0, Sterile: 0.0
tick: 590.0, Sterile: 0.0
tick: 591.0, Sterile: 0.0
tick: 592.0, Sterile: 0.0
tick: 593.0, Sterile: 0.0
tick: 594.0, Sterile: 0.0
tick: 595.0, Sterile: 0.0
tick: 596.0, Sterile: 0.0
tick: 597.0, Sterile: 0.0
tick: 598.0, Sterile: 0.0
tick: 599.0, Sterile: 0.0
tick: 600.0, Sterile: 0.0
tick: 601.0, Sterile: 0.0
tick: 602.0, Sterile: 0.0
tick: 603.0, Sterile: 0.0
tick: 604.0, Sterile: 0.0
tick: 605.0, Sterile: 0.0
tick: 606.0, Sterile: 0.0
tick: 607.0, Sterile: 0.0
tick: 608.0, Sterile: 0.0
tick: 609.0, Sterile: 0.0
tick: 610.0, Sterile: 0.0
tick: 611.0, Sterile: 0.0
tick: 612.0, Sterile: 0.0
tick: 613.0, Sterile: 0.0
tick: 614.0, Sterile: 0.0
tick: 615.0, Sterile: 0.0
tick: 616.0, Sterile: 0.0
tick: 617.0, Sterile: 0.0
tick: 618.0, Sterile: 0.0
tick: 619.0, Sterile: 0.0
tick: 620.0, Sterile: 0.0
tick: 621.0, Sterile: 0.0
tick: 622.0, Sterile: 0.0
tick: 623.0, Sterile: 0.0
tick: 624.0, Sterile: 0.0
tick: 625.0, Sterile: 0.0
tick: 626.0, Sterile: 0.0
tick: 627.0, Sterile: 0.0
tick: 628.0, Sterile: 0.0
tick: 629.0, Sterile: 0.0
tick: 630.0, Sterile: 0.0
tick: 631.0, Sterile: 0.0
tick: 632.0, Sterile: 0.0
tick: 633.0, Sterile: 0.0
tick: 634.0, Sterile: 0.0
tick: 635.0, Sterile: 0.0
tick: 636.0, Sterile: 0.0
tick: 637.0, Sterile: 0.0
tick: 638.0, Sterile: 0.0
tick: 639.0, Sterile: 0.0
tick: 640.0, Sterile: 0.0
tick: 641.0, Sterile: 0.0
tick: 642.0, Sterile: 0.0
tick: 643.0, Sterile: 0.0
tick: 644.0, Sterile: 0.0
tick: 645.0, Sterile: 0.0
tick: 646.0, Sterile: 0.0
tick: 647.0, Sterile: 0.0
tick: 648.0, Sterile: 0.0
tick: 649.0, Sterile: 0.0
tick: 650.0, Sterile: 0.0
tick: 651.0, Sterile: 0.0
tick: 652.0, Sterile: 0.0
tick: 653.0, Sterile: 0.0
tick: 654.0, Sterile: 0.0
tick: 655.0, Sterile: 0.0
tick: 656.0, Sterile: 0.0
tick: 657.0, Sterile: 0.0
tick: 658.0, Sterile: 0.0
tick: 659.0, Sterile: 0.0
tick: 660.0, Sterile: 0.0
tick: 661.0, Sterile: 0.0
tick: 662.0, Sterile: 0.0
tick: 663.0, Sterile: 0.0
tick: 664.0, Sterile: 0.0
tick: 665.0, Sterile: 0.0
tick: 666.0, Sterile: 0.0
tick: 667.0, Sterile: 0.0
tick: 668.0, Sterile: 0.0
tick: 669.0, Sterile: 0.0
tick: 670.0, Sterile: 0.0
tick: 671.0, Sterile: 0.0
tick: 672.0, Sterile: 0.0
tick: 673.0, Sterile: 0.0
tick: 674.0, Sterile: 0.0
tick: 675.0, Sterile: 0.0
tick: 676.0, Sterile: 0.0
tick: 677.0, Sterile: 0.0
tick: 678.0, Sterile: 0.0
tick: 679.0, Sterile: 0.0
tick: 680.0, Sterile: 0.0
tick: 681.0, Sterile: 0.0
tick: 682.0, Sterile: 0.0
tick: 683.0, Sterile: 0.0
tick: 684.0, Sterile: 0.0
tick: 685.0, Sterile: 0.0
tick: 686.0, Sterile: 0.0
tick: 687.0, Sterile: 0.0
tick: 688.0, Sterile: 0.0
tick: 689.0, Sterile: 0.0
tick: 690.0, Sterile: 0.0
tick: 691.0, Sterile: 0.0
tick: 692.0, Sterile: 0.0
tick: 693.0, Sterile: 0.0
tick: 694.0, Sterile: 0.0
tick: 695.0, Sterile: 0.0
tick: 696.0, Sterile: 0.0
tick: 697.0, Sterile: 0.0
tick: 698.0, Sterile: 0.0
tick: 699.0, Sterile: 0.0
tick: 700.0, Sterile: 0.0
tick: 701.0, Sterile: 0.0
tick: 702.0, Sterile: 0.0
tick: 703.0, Sterile: 0.0
tick: 704.0, Sterile: 0.0
tick: 705.0, Sterile: 0.0
tick: 706.0, Sterile: 0.0
tick: 707.0, Sterile: 0.0
tick: 708.0, Sterile: 0.0
tick: 709.0, Sterile: 0.0
tick: 710.0, Sterile: 0.0
tick: 711.0, Sterile: 0.0
tick: 712.0, Sterile: 0.0
tick: 713.0, Sterile: 0.0
tick: 714.0, Sterile: 0.0
tick: 715.0, Sterile: 0.0
tick: 716.0, Sterile: 0.0
tick: 717.0, Sterile: 0.0
tick: 718.0, Sterile: 0.0
tick: 719.0, Sterile: 0.0
tick: 720.0, Sterile: 0.0
tick: 721.0, Sterile: 0.0
tick: 722.0, Sterile: 0.0
tick: 723.0, Sterile: 0.0
tick: 724.0, Sterile: 0.0
tick: 725.0, Sterile: 0.0
tick: 726.0, Sterile: 0.0
tick: 727.0, Sterile: 0.0
tick: 728.0, Sterile: 0.0
tick: 729.0, Sterile: 0.0
tick: 730.0, Sterile: 0.0
tick: 731.0, Sterile: 0.0
tick: 732.0, Sterile: 0.0
tick: 733.0, Sterile: 0.0
tick: 734.0, Sterile: 0.0
tick: 735.0, Sterile: 0.0
tick: 736.0, Sterile: 0.0
tick: 737.0, Sterile: 0.0
tick: 738.0, Sterile: 0.0
tick: 739.0, Sterile: 0.0
tick: 740.0, Sterile: 0.0
tick: 741.0, Sterile: 0.0
tick: 742.0, Sterile: 0.0
tick: 743.0, Sterile: 0.0
tick: 744.0, Sterile: 0.0
tick: 745.0, Sterile: 0.0
tick: 746.0, Sterile: 0.0
tick: 747.0, Sterile: 0.0
tick: 748.0, Sterile: 0.0
tick: 749.0, Sterile: 0.0
tick: 750.0, Sterile: 0.0
tick: 751.0, Sterile: 0.0
tick: 752.0, Sterile: 0.0
tick: 753.0, Sterile: 0.0
tick: 754.0, Sterile: 0.0
tick: 755.0, Sterile: 0.0
tick: 756.0, Sterile: 0.0
tick: 757.0, Sterile: 0.0
tick: 758.0, Sterile: 0.0
tick: 759.0, Sterile: 0.0
tick: 760.0, Sterile: 0.0
tick: 761.0, Sterile: 0.0
tick: 762.0, Sterile: 0.0
tick: 763.0, Sterile: 0.0
tick: 764.0, Sterile: 0.0
tick: 765.0, Sterile: 0.0
tick: 766.0, Sterile: 0.0
tick: 767.0, Sterile: 0.0
tick: 768.0, Sterile: 0.0
tick: 769.0, Sterile: 0.0
tick: 770.0, Sterile: 0.0
tick: 771.0, Sterile: 0.0
tick: 772.0, Sterile: 0.0
tick: 773.0, Sterile: 0.0
tick: 774.0, Sterile: 0.0
tick: 775.0, Sterile: 0.0
tick: 776.0, Sterile: 0.0
tick: 777.0, Sterile: 0.0
tick: 778.0, Sterile: 0.0
tick: 779.0, Sterile: 0.0
tick: 780.0, Sterile: 0.0
tick: 781.0, Sterile: 0.0
tick: 782.0, Sterile: 0.0
tick: 783.0, Sterile: 0.0
tick: 784.0, Sterile: 0.0
tick: 785.0, Sterile: 0.0
tick: 786.0, Sterile: 0.0
tick: 787.0, Sterile: 0.0
tick: 788.0, Sterile: 0.0
tick: 789.0, Sterile: 0.0
tick: 790.0, Sterile: 0.0
tick: 791.0, Sterile: 0.0
tick: 792.0, Sterile: 0.0
tick: 793.0, Sterile: 0.0
tick: 794.0, Sterile: 0.0
tick: 795.0, Sterile: 0.0
tick: 796.0, Sterile: 0.0
tick: 797.0, Sterile: 0.0
tick: 798.0, Sterile: 0.0
tick: 799.0, Sterile: 0.0
tick: 800.0, Sterile: 0.0
tick: 801.0, Sterile: 0.0
tick: 802.0, Sterile: 0.0
tick: 803.0, Sterile: 0.0
tick: 804.0, Sterile: 0.0
tick: 805.0, Sterile: 0.0
tick: 806.0, Sterile: 0.0
tick: 807.0, Sterile: 0.0
tick: 808.0, Sterile: 0.0
tick: 809.0, Sterile: 0.0
tick: 810.0, Sterile: 0.0
tick: 811.0, Sterile: 0.0
tick: 812.0, Sterile: 0.0
tick: 813.0, Sterile: 0.0
tick: 814.0, Sterile: 0.0
tick: 815.0, Sterile: 0.0
tick: 816.0, Sterile: 0.0
tick: 817.0, Sterile: 0.0
