tick: 1.0, AdultFemales: 414.0, AdultMales: 383.0
tick: 25.0, AdultFemales: 402.0, AdultMales: 374.0
tick: 49.0, AdultFemales: 386.0, AdultMales: 358.0
tick: 73.0, AdultFemales: 363.0, AdultMales: 346.0
tick: 97.0, AdultFemales: 351.0, AdultMales: 333.0
tick: 121.0, AdultFemales: 334.0, AdultMales: 310.0
tick: 145.0, AdultFemales: 321.0, AdultMales: 298.0
tick: 169.0, AdultFemales: 307.0, AdultMales: 285.0
tick: 193.0, AdultFemales: 290.0, AdultMales: 273.0
tick: 217.0, AdultFemales: 278.0, AdultMales: 255.0
tick: 241.0, AdultFemales: 262.0, AdultMales: 235.0
tick: 265.0, AdultFemales: 245.0, AdultMales: 224.0
tick: 289.0, AdultFemales: 228.0, AdultMales: 213.0
tick: 313.0, AdultFemales: 211.0, AdultMales: 207.0
tick: 337.0, AdultFemales: 199.0, AdultMales: 203.0
tick: 361.0, AdultFemales: 183.0, AdultMales: 188.0
tick: 385.0, AdultFemales: 166.0, AdultMales: 176.0
tick: 409.0, AdultFemales: 153.0, AdultMales: 165.0
tick: 433.0, AdultFemales: 137.0, AdultMales: 153.0
tick: 457.0, AdultFemales: 125.0, AdultMales: 140.0
tick: 481.0, AdultFemales: 117.0, AdultMales: 131.0
tick: 505.0, AdultFemales: 101.0, AdultMales: 127.0
tick: 529.0, AdultFemales: 100.0, AdultMales: 115.0
tick: 553.0, AdultFemales: 108.0, AdultMales: 126.0
tick: 577.0, AdultFemales: 124.0, AdultMales: 148.0
tick: 601.0, AdultFemales: 129.0, AdultMales: 154.0
tick: 625.0, AdultFemales: 146.0, AdultMales: 165.0
tick: 649.0, AdultFemales: 159.0, AdultMales: 173.0
tick: 673.0, AdultFemales: 174.0, AdultMales: 184.0
tick: 697.0, AdultFemales: 195.0, AdultMales: 199.0
tick: 721.0, AdultFemales: 220.0, AdultMales: 208.0
tick: 745.0, AdultFemales: 217.0, AdultMales: 210.0
tick: 769.0, AdultFemales: 232.0, AdultMales: 221.0
tick: 793.0, AdultFemales: 255.0, AdultMales: 251.0
tick: 817.0, AdultFemales: 290.0, AdultMales: 282.0
tick: 841.0, AdultFemales: 323.0, AdultMales: 309.0
tick: 865.0, AdultFemales: 361.0, AdultMales: 333.0
tick: 889.0, AdultFemales: 389.0, AdultMales: 355.0
tick: 913.0, AdultFemales: 406.0, AdultMales: 372.0
tick: 937.0, AdultFemales: 425.0, AdultMales: 396.0
tick: 961.0, AdultFemales: 447.0, AdultMales: 423.0
tick: 985.0, AdultFemales: 474.0, AdultMales: 446.0
tick: 1009.0, AdultFemales: 486.0, AdultMales: 481.0
tick: 1033.0, AdultFemales: 511.0, AdultMales: 506.0
tick: 1057.0, AdultFemales: 522.0, AdultMales: 528.0
tick: 1081.0, AdultFemales: 539.0, AdultMales: 546.0
tick: 1105.0, AdultFemales: 558.0, AdultMales: 561.0
tick: 1129.0, AdultFemales: 569.0, AdultMales: 578.0
tick: 1153.0, AdultFemales: 576.0, AdultMales: 591.0
tick: 1177.0, AdultFemales: 585.0, AdultMales: 600.0
tick: 1201.0, AdultFemales: 591.0, AdultMales: 605.0
tick: 1225.0, AdultFemales: 598.0, AdultMales: 610.0
tick: 1249.0, AdultFemales: 602.0, AdultMales: 612.0
tick: 1273.0, AdultFemales: 604.0, AdultMales: 613.0
tick: 1297.0, AdultFemales: 599.0, AdultMales: 617.0
tick: 1321.0, AdultFemales: 587.0, AdultMales: 603.0
tick: 1345.0, AdultFemales: 568.0, AdultMales: 582.0
tick: 1369.0, AdultFemales: 540.0, AdultMales: 556.0
tick: 1393.0, AdultFemales: 522.0, AdultMales: 528.0
tick: 1417.0, AdultFemales: 502.0, AdultMales: 505.0
tick: 1441.0, AdultFemales: 358.0, AdultMales: 388.0
tick: 1465.0, AdultFemales: 367.0, AdultMales: 389.0
tick: 1489.0, AdultFemales: 372.0, AdultMales: 394.0
tick: 1513.0, AdultFemales: 367.0, AdultMales: 385.0
tick: 1537.0, AdultFemales: 361.0, AdultMales: 383.0
tick: 1561.0, AdultFemales: 371.0, AdultMales: 384.0
tick: 1585.0, AdultFemales: 363.0, AdultMales: 379.0
tick: 1609.0, AdultFemales: 362.0, AdultMales: 374.0
tick: 1633.0, AdultFemales: 369.0, AdultMales: 371.0
tick: 1657.0, AdultFemales: 373.0, AdultMales: 370.0
tick: 1681.0, AdultFemales: 384.0, AdultMales: 374.0
tick: 1705.0, AdultFemales: 392.0, AdultMales: 389.0
tick: 1729.0, AdultFemales: 401.0, AdultMales: 395.0
tick: 1753.0, AdultFemales: 407.0, AdultMales: 403.0
tick: 1777.0, AdultFemales: 417.0, AdultMales: 420.0
tick: 1801.0, AdultFemales: 435.0, AdultMales: 436.0
tick: 1825.0, AdultFemales: 459.0, AdultMales: 459.0
tick: 1849.0, AdultFemales: 479.0, AdultMales: 480.0
tick: 1873.0, AdultFemales: 493.0, AdultMales: 494.0
tick: 1897.0, AdultFemales: 512.0, AdultMales: 506.0
tick: 1921.0, AdultFemales: 528.0, AdultMales: 524.0
tick: 1945.0, AdultFemales: 552.0, AdultMales: 563.0
tick: 1969.0, AdultFemales: 586.0, AdultMales: 597.0
tick: 1993.0, AdultFemales: 603.0, AdultMales: 612.0
tick: 2017.0, AdultFemales: 612.0, AdultMales: 623.0
tick: 2041.0, AdultFemales: 617.0, AdultMales: 628.0
tick: 2065.0, AdultFemales: 623.0, AdultMales: 642.0
tick: 2089.0, AdultFemales: 643.0, AdultMales: 656.0
tick: 2113.0, AdultFemales: 658.0, AdultMales: 688.0
tick: 2137.0, AdultFemales: 660.0, AdultMales: 697.0
tick: 2161.0, AdultFemales: 665.0, AdultMales: 711.0
tick: 2185.0, AdultFemales: 664.0, AdultMales: 710.0
tick: 2209.0, AdultFemales: 677.0, AdultMales: 736.0
tick: 2233.0, AdultFemales: 692.0, AdultMales: 742.0
tick: 2257.0, AdultFemales: 685.0, AdultMales: 738.0
tick: 2281.0, AdultFemales: 678.0, AdultMales: 743.0
tick: 2305.0, AdultFemales: 682.0, AdultMales: 744.0
tick: 2329.0, AdultFemales: 687.0, AdultMales: 746.0
tick: 2353.0, AdultFemales: 695.0, AdultMales: 737.0
tick: 2377.0, AdultFemales: 702.0, AdultMales: 744.0
tick: 2401.0, AdultFemales: 701.0, AdultMales: 749.0
tick: 2425.0, AdultFemales: 695.0, AdultMales: 756.0
tick: 2449.0, AdultFemales: 691.0, AdultMales: 755.0
tick: 2473.0, AdultFemales: 703.0, AdultMales: 760.0
tick: 2497.0, AdultFemales: 713.0, AdultMales: 765.0
tick: 2521.0, AdultFemales: 715.0, AdultMales: 760.0
tick: 2545.0, AdultFemales: 717.0, AdultMales: 758.0
tick: 2569.0, AdultFemales: 722.0, AdultMales: 760.0
tick: 2593.0, AdultFemales: 721.0, AdultMales: 766.0
tick: 2617.0, AdultFemales: 731.0, AdultMales: 763.0
tick: 2641.0, AdultFemales: 737.0, AdultMales: 763.0
tick: 2665.0, AdultFemales: 738.0, AdultMales: 777.0
tick: 2689.0, AdultFemales: 744.0, AdultMales: 777.0
tick: 2713.0, AdultFemales: 732.0, AdultMales: 773.0
tick: 2737.0, AdultFemales: 724.0, AdultMales: 773.0
tick: 2761.0, AdultFemales: 712.0, AdultMales: 769.0
tick: 2785.0, AdultFemales: 722.0, AdultMales: 785.0
tick: 2809.0, AdultFemales: 738.0, AdultMales: 791.0
tick: 2833.0, AdultFemales: 738.0, AdultMales: 782.0
tick: 2857.0, AdultFemales: 743.0, AdultMales: 770.0
tick: 2881.0, AdultFemales: 723.0, AdultMales: 761.0
tick: 2905.0, AdultFemales: 716.0, AdultMales: 746.0
tick: 2929.0, AdultFemales: 725.0, AdultMales: 755.0
tick: 2953.0, AdultFemales: 746.0, AdultMales: 790.0
tick: 2977.0, AdultFemales: 741.0, AdultMales: 767.0
tick: 3001.0, AdultFemales: 741.0, AdultMales: 775.0
tick: 3025.0, AdultFemales: 745.0, AdultMales: 782.0
tick: 3049.0, AdultFemales: 756.0, AdultMales: 793.0
tick: 3073.0, AdultFemales: 767.0, AdultMales: 783.0
tick: 3097.0, AdultFemales: 772.0, AdultMales: 795.0
tick: 3121.0, AdultFemales: 767.0, AdultMales: 801.0
tick: 3145.0, AdultFemales: 783.0, AdultMales: 814.0
tick: 3169.0, AdultFemales: 795.0, AdultMales: 830.0
tick: 3193.0, AdultFemales: 809.0, AdultMales: 854.0
tick: 3217.0, AdultFemales: 825.0, AdultMales: 863.0
tick: 3241.0, AdultFemales: 827.0, AdultMales: 863.0
tick: 3265.0, AdultFemales: 829.0, AdultMales: 881.0
tick: 3289.0, AdultFemales: 830.0, AdultMales: 885.0
tick: 3313.0, AdultFemales: 845.0, AdultMales: 898.0
tick: 3337.0, AdultFemales: 842.0, AdultMales: 897.0
tick: 3361.0, AdultFemales: 831.0, AdultMales: 883.0
tick: 3385.0, AdultFemales: 838.0, AdultMales: 902.0
tick: 3409.0, AdultFemales: 847.0, AdultMales: 898.0
tick: 3433.0, AdultFemales: 842.0, AdultMales: 886.0
tick: 3457.0, AdultFemales: 841.0, AdultMales: 884.0
tick: 3481.0, AdultFemales: 837.0, AdultMales: 879.0
tick: 3505.0, AdultFemales: 840.0, AdultMales: 891.0
tick: 3529.0, AdultFemales: 860.0, AdultMales: 894.0
tick: 3553.0, AdultFemales: 852.0, AdultMales: 891.0
tick: 3577.0, AdultFemales: 847.0, AdultMales: 891.0
tick: 3601.0, AdultFemales: 828.0, AdultMales: 886.0
tick: 3625.0, AdultFemales: 835.0, AdultMales: 888.0
tick: 3649.0, AdultFemales: 842.0, AdultMales: 898.0
tick: 3673.0, AdultFemales: 844.0, AdultMales: 897.0
tick: 3697.0, AdultFemales: 839.0, AdultMales: 891.0
tick: 3721.0, AdultFemales: 838.0, AdultMales: 900.0
tick: 3745.0, AdultFemales: 835.0, AdultMales: 916.0
tick: 3769.0, AdultFemales: 833.0, AdultMales: 916.0
tick: 3793.0, AdultFemales: 830.0, AdultMales: 915.0
tick: 3817.0, AdultFemales: 839.0, AdultMales: 898.0
tick: 3841.0, AdultFemales: 850.0, AdultMales: 896.0
tick: 3865.0, AdultFemales: 844.0, AdultMales: 903.0
tick: 3889.0, AdultFemales: 828.0, AdultMales: 901.0
tick: 3913.0, AdultFemales: 821.0, AdultMales: 893.0
tick: 3937.0, AdultFemales: 827.0, AdultMales: 905.0
tick: 3961.0, AdultFemales: 829.0, AdultMales: 930.0
tick: 3985.0, AdultFemales: 843.0, AdultMales: 934.0
tick: 4009.0, AdultFemales: 841.0, AdultMales: 935.0
tick: 4033.0, AdultFemales: 837.0, AdultMales: 939.0
tick: 4057.0, AdultFemales: 866.0, AdultMales: 962.0
tick: 4081.0, AdultFemales: 893.0, AdultMales: 987.0
tick: 4105.0, AdultFemales: 906.0, AdultMales: 976.0
tick: 4129.0, AdultFemales: 914.0, AdultMales: 977.0
tick: 4153.0, AdultFemales: 917.0, AdultMales: 982.0
tick: 4177.0, AdultFemales: 924.0, AdultMales: 986.0
tick: 4201.0, AdultFemales: 919.0, AdultMales: 990.0
tick: 4225.0, AdultFemales: 925.0, AdultMales: 996.0
tick: 4249.0, AdultFemales: 923.0, AdultMales: 993.0
tick: 4273.0, AdultFemales: 917.0, AdultMales: 984.0
tick: 4297.0, AdultFemales: 913.0, AdultMales: 986.0
tick: 4321.0, AdultFemales: 884.0, AdultMales: 951.0
tick: 4345.0, AdultFemales: 871.0, AdultMales: 923.0
tick: 4369.0, AdultFemales: 872.0, AdultMales: 896.0
tick: 4393.0, AdultFemales: 874.0, AdultMales: 890.0
tick: 4417.0, AdultFemales: 865.0, AdultMales: 878.0
tick: 4441.0, AdultFemales: 858.0, AdultMales: 872.0
tick: 4465.0, AdultFemales: 834.0, AdultMales: 855.0
tick: 4489.0, AdultFemales: 823.0, AdultMales: 851.0
tick: 4513.0, AdultFemales: 813.0, AdultMales: 848.0
tick: 4537.0, AdultFemales: 810.0, AdultMales: 855.0
tick: 4561.0, AdultFemales: 805.0, AdultMales: 857.0
tick: 4585.0, AdultFemales: 810.0, AdultMales: 854.0
tick: 4609.0, AdultFemales: 802.0, AdultMales: 855.0
tick: 4633.0, AdultFemales: 789.0, AdultMales: 845.0
tick: 4657.0, AdultFemales: 763.0, AdultMales: 804.0
tick: 4681.0, AdultFemales: 735.0, AdultMales: 768.0
tick: 4705.0, AdultFemales: 731.0, AdultMales: 772.0
tick: 4729.0, AdultFemales: 728.0, AdultMales: 775.0
tick: 4753.0, AdultFemales: 725.0, AdultMales: 772.0
tick: 4777.0, AdultFemales: 729.0, AdultMales: 788.0
tick: 4801.0, AdultFemales: 720.0, AdultMales: 800.0
tick: 4825.0, AdultFemales: 738.0, AdultMales: 821.0
tick: 4849.0, AdultFemales: 766.0, AdultMales: 846.0
tick: 4873.0, AdultFemales: 764.0, AdultMales: 844.0
tick: 4897.0, AdultFemales: 750.0, AdultMales: 843.0
tick: 4921.0, AdultFemales: 756.0, AdultMales: 848.0
tick: 4945.0, AdultFemales: 773.0, AdultMales: 852.0
tick: 4969.0, AdultFemales: 799.0, AdultMales: 876.0
tick: 4993.0, AdultFemales: 811.0, AdultMales: 884.0
tick: 5017.0, AdultFemales: 818.0, AdultMales: 882.0
tick: 5041.0, AdultFemales: 822.0, AdultMales: 906.0
tick: 5065.0, AdultFemales: 813.0, AdultMales: 917.0
tick: 5089.0, AdultFemales: 815.0, AdultMales: 915.0
tick: 5113.0, AdultFemales: 810.0, AdultMales: 908.0
tick: 5137.0, AdultFemales: 828.0, AdultMales: 918.0
tick: 5161.0, AdultFemales: 854.0, AdultMales: 940.0
tick: 5185.0, AdultFemales: 865.0, AdultMales: 967.0
tick: 5209.0, AdultFemales: 882.0, AdultMales: 993.0
tick: 5233.0, AdultFemales: 880.0, AdultMales: 994.0
tick: 5257.0, AdultFemales: 885.0, AdultMales: 984.0
tick: 5281.0, AdultFemales: 897.0, AdultMales: 969.0
tick: 5305.0, AdultFemales: 889.0, AdultMales: 959.0
tick: 5329.0, AdultFemales: 875.0, AdultMales: 952.0
tick: 5353.0, AdultFemales: 874.0, AdultMales: 947.0
tick: 5377.0, AdultFemales: 862.0, AdultMales: 938.0
tick: 5401.0, AdultFemales: 855.0, AdultMales: 930.0
tick: 5425.0, AdultFemales: 854.0, AdultMales: 923.0
tick: 5449.0, AdultFemales: 853.0, AdultMales: 902.0
tick: 5473.0, AdultFemales: 854.0, AdultMales: 902.0
tick: 5497.0, AdultFemales: 834.0, AdultMales: 869.0
tick: 5521.0, AdultFemales: 808.0, AdultMales: 843.0
tick: 5545.0, AdultFemales: 784.0, AdultMales: 821.0
tick: 5569.0, AdultFemales: 776.0, AdultMales: 796.0
tick: 5593.0, AdultFemales: 783.0, AdultMales: 801.0
tick: 5617.0, AdultFemales: 770.0, AdultMales: 802.0
tick: 5641.0, AdultFemales: 733.0, AdultMales: 776.0
tick: 5665.0, AdultFemales: 704.0, AdultMales: 747.0
tick: 5689.0, AdultFemales: 712.0, AdultMales: 760.0
tick: 5713.0, AdultFemales: 761.0, AdultMales: 801.0
tick: 5737.0, AdultFemales: 787.0, AdultMales: 830.0
tick: 5761.0, AdultFemales: 792.0, AdultMales: 849.0
tick: 5785.0, AdultFemales: 804.0, AdultMales: 860.0
tick: 5809.0, AdultFemales: 808.0, AdultMales: 871.0
tick: 5833.0, AdultFemales: 822.0, AdultMales: 894.0
tick: 5857.0, AdultFemales: 829.0, AdultMales: 896.0
tick: 5881.0, AdultFemales: 832.0, AdultMales: 884.0
tick: 5905.0, AdultFemales: 851.0, AdultMales: 865.0
tick: 5929.0, AdultFemales: 863.0, AdultMales: 875.0
tick: 5953.0, AdultFemales: 867.0, AdultMales: 887.0
tick: 5977.0, AdultFemales: 854.0, AdultMales: 879.0
tick: 6001.0, AdultFemales: 849.0, AdultMales: 869.0
tick: 6025.0, AdultFemales: 861.0, AdultMales: 878.0
tick: 6049.0, AdultFemales: 880.0, AdultMales: 903.0
tick: 6073.0, AdultFemales: 878.0, AdultMales: 900.0
tick: 6097.0, AdultFemales: 885.0, AdultMales: 901.0
tick: 6121.0, AdultFemales: 886.0, AdultMales: 910.0
tick: 6145.0, AdultFemales: 885.0, AdultMales: 907.0
tick: 6169.0, AdultFemales: 871.0, AdultMales: 897.0
tick: 6193.0, AdultFemales: 853.0, AdultMales: 880.0
tick: 6217.0, AdultFemales: 844.0, AdultMales: 870.0
tick: 6241.0, AdultFemales: 837.0, AdultMales: 860.0
tick: 6265.0, AdultFemales: 835.0, AdultMales: 868.0
tick: 6289.0, AdultFemales: 847.0, AdultMales: 870.0
tick: 6313.0, AdultFemales: 843.0, AdultMales: 864.0
tick: 6337.0, AdultFemales: 852.0, AdultMales: 863.0
tick: 6361.0, AdultFemales: 851.0, AdultMales: 868.0
tick: 6385.0, AdultFemales: 844.0, AdultMales: 868.0
tick: 6409.0, AdultFemales: 828.0, AdultMales: 827.0
tick: 6433.0, AdultFemales: 791.0, AdultMales: 790.0
tick: 6457.0, AdultFemales: 792.0, AdultMales: 772.0
tick: 6481.0, AdultFemales: 814.0, AdultMales: 787.0
tick: 6505.0, AdultFemales: 839.0, AdultMales: 806.0
tick: 6529.0, AdultFemales: 853.0, AdultMales: 809.0
tick: 6553.0, AdultFemales: 852.0, AdultMales: 814.0
tick: 6577.0, AdultFemales: 850.0, AdultMales: 819.0
tick: 6601.0, AdultFemales: 834.0, AdultMales: 820.0
tick: 6625.0, AdultFemales: 839.0, AdultMales: 818.0
tick: 6649.0, AdultFemales: 836.0, AdultMales: 820.0
tick: 6673.0, AdultFemales: 831.0, AdultMales: 824.0
tick: 6697.0, AdultFemales: 818.0, AdultMales: 817.0
tick: 6721.0, AdultFemales: 818.0, AdultMales: 815.0
tick: 6745.0, AdultFemales: 837.0, AdultMales: 829.0
tick: 6769.0, AdultFemales: 841.0, AdultMales: 835.0
tick: 6793.0, AdultFemales: 832.0, AdultMales: 837.0
tick: 6817.0, AdultFemales: 845.0, AdultMales: 848.0
tick: 6841.0, AdultFemales: 865.0, AdultMales: 853.0
tick: 6865.0, AdultFemales: 873.0, AdultMales: 857.0
tick: 6889.0, AdultFemales: 867.0, AdultMales: 849.0
tick: 6913.0, AdultFemales: 868.0, AdultMales: 847.0
tick: 6937.0, AdultFemales: 869.0, AdultMales: 851.0
tick: 6961.0, AdultFemales: 873.0, AdultMales: 849.0
tick: 6985.0, AdultFemales: 884.0, AdultMales: 865.0
tick: 7009.0, AdultFemales: 888.0, AdultMales: 860.0
tick: 7033.0, AdultFemales: 898.0, AdultMales: 881.0
tick: 7057.0, AdultFemales: 923.0, AdultMales: 894.0
tick: 7081.0, AdultFemales: 917.0, AdultMales: 892.0
tick: 7105.0, AdultFemales: 919.0, AdultMales: 900.0
tick: 7129.0, AdultFemales: 920.0, AdultMales: 907.0
tick: 7153.0, AdultFemales: 908.0, AdultMales: 908.0
tick: 7177.0, AdultFemales: 902.0, AdultMales: 914.0
tick: 7201.0, AdultFemales: 897.0, AdultMales: 922.0
tick: 7225.0, AdultFemales: 899.0, AdultMales: 925.0
tick: 7249.0, AdultFemales: 897.0, AdultMales: 923.0
tick: 7273.0, AdultFemales: 885.0, AdultMales: 929.0
tick: 7297.0, AdultFemales: 862.0, AdultMales: 914.0
tick: 7321.0, AdultFemales: 844.0, AdultMales: 897.0
tick: 7345.0, AdultFemales: 831.0, AdultMales: 865.0
tick: 7369.0, AdultFemales: 815.0, AdultMales: 847.0
tick: 7393.0, AdultFemales: 790.0, AdultMales: 820.0
tick: 7417.0, AdultFemales: 761.0, AdultMales: 785.0
tick: 7441.0, AdultFemales: 737.0, AdultMales: 761.0
tick: 7465.0, AdultFemales: 724.0, AdultMales: 766.0
tick: 7489.0, AdultFemales: 720.0, AdultMales: 770.0
tick: 7513.0, AdultFemales: 729.0, AdultMales: 796.0
tick: 7537.0, AdultFemales: 745.0, AdultMales: 811.0
tick: 7561.0, AdultFemales: 748.0, AdultMales: 807.0
tick: 7585.0, AdultFemales: 749.0, AdultMales: 790.0
tick: 7609.0, AdultFemales: 726.0, AdultMales: 765.0
tick: 7633.0, AdultFemales: 698.0, AdultMales: 739.0
tick: 7657.0, AdultFemales: 673.0, AdultMales: 722.0
tick: 7681.0, AdultFemales: 683.0, AdultMales: 715.0
tick: 7705.0, AdultFemales: 687.0, AdultMales: 731.0
tick: 7729.0, AdultFemales: 691.0, AdultMales: 738.0
tick: 7753.0, AdultFemales: 678.0, AdultMales: 732.0
tick: 7777.0, AdultFemales: 665.0, AdultMales: 726.0
tick: 7801.0, AdultFemales: 651.0, AdultMales: 723.0
tick: 7825.0, AdultFemales: 651.0, AdultMales: 719.0
tick: 7849.0, AdultFemales: 658.0, AdultMales: 709.0
tick: 7873.0, AdultFemales: 677.0, AdultMales: 711.0
tick: 7897.0, AdultFemales: 667.0, AdultMales: 711.0
tick: 7921.0, AdultFemales: 675.0, AdultMales: 703.0
tick: 7945.0, AdultFemales: 676.0, AdultMales: 706.0
tick: 7969.0, AdultFemales: 662.0, AdultMales: 691.0
tick: 7993.0, AdultFemales: 655.0, AdultMales: 685.0
tick: 8017.0, AdultFemales: 663.0, AdultMales: 685.0
tick: 8041.0, AdultFemales: 671.0, AdultMales: 688.0
tick: 8065.0, AdultFemales: 673.0, AdultMales: 681.0
tick: 8089.0, AdultFemales: 678.0, AdultMales: 681.0
tick: 8113.0, AdultFemales: 704.0, AdultMales: 686.0
tick: 8137.0, AdultFemales: 717.0, AdultMales: 694.0
tick: 8161.0, AdultFemales: 708.0, AdultMales: 701.0
tick: 8185.0, AdultFemales: 699.0, AdultMales: 700.0
tick: 8209.0, AdultFemales: 702.0, AdultMales: 699.0
tick: 8233.0, AdultFemales: 715.0, AdultMales: 703.0
tick: 8257.0, AdultFemales: 711.0, AdultMales: 696.0
tick: 8281.0, AdultFemales: 702.0, AdultMales: 684.0
tick: 8305.0, AdultFemales: 700.0, AdultMales: 661.0
tick: 8329.0, AdultFemales: 664.0, AdultMales: 647.0
tick: 8353.0, AdultFemales: 659.0, AdultMales: 631.0
tick: 8377.0, AdultFemales: 652.0, AdultMales: 627.0
tick: 8401.0, AdultFemales: 650.0, AdultMales: 624.0
tick: 8425.0, AdultFemales: 648.0, AdultMales: 630.0
tick: 8449.0, AdultFemales: 655.0, AdultMales: 636.0
tick: 8473.0, AdultFemales: 655.0, AdultMales: 637.0
tick: 8497.0, AdultFemales: 646.0, AdultMales: 628.0
tick: 8521.0, AdultFemales: 619.0, AdultMales: 613.0
tick: 8545.0, AdultFemales: 607.0, AdultMales: 602.0
tick: 8569.0, AdultFemales: 611.0, AdultMales: 609.0
tick: 8593.0, AdultFemales: 616.0, AdultMales: 610.0
tick: 8617.0, AdultFemales: 602.0, AdultMales: 593.0
tick: 8641.0, AdultFemales: 492.0, AdultMales: 467.0
tick: 8665.0, AdultFemales: 494.0, AdultMales: 468.0
tick: 8689.0, AdultFemales: 499.0, AdultMales: 478.0
tick: 8713.0, AdultFemales: 508.0, AdultMales: 493.0
tick: 8737.0, AdultFemales: 518.0, AdultMales: 506.0
tick: 8761.0, AdultFemales: 526.0, AdultMales: 517.0
tick: 8785.0, AdultFemales: 539.0, AdultMales: 543.0
tick: 8809.0, AdultFemales: 556.0, AdultMales: 562.0
tick: 8833.0, AdultFemales: 554.0, AdultMales: 560.0
tick: 8857.0, AdultFemales: 554.0, AdultMales: 559.0
tick: 8881.0, AdultFemales: 567.0, AdultMales: 581.0
tick: 8905.0, AdultFemales: 564.0, AdultMales: 588.0
tick: 8929.0, AdultFemales: 567.0, AdultMales: 598.0
tick: 8953.0, AdultFemales: 563.0, AdultMales: 606.0
tick: 8977.0, AdultFemales: 571.0, AdultMales: 605.0
tick: 9001.0, AdultFemales: 558.0, AdultMales: 598.0
tick: 9025.0, AdultFemales: 542.0, AdultMales: 589.0
tick: 9049.0, AdultFemales: 530.0, AdultMales: 583.0
tick: 9073.0, AdultFemales: 519.0, AdultMales: 567.0
tick: 9097.0, AdultFemales: 501.0, AdultMales: 549.0
tick: 9121.0, AdultFemales: 492.0, AdultMales: 549.0
tick: 9145.0, AdultFemales: 491.0, AdultMales: 544.0
tick: 9169.0, AdultFemales: 486.0, AdultMales: 531.0
tick: 9193.0, AdultFemales: 474.0, AdultMales: 525.0
tick: 9217.0, AdultFemales: 455.0, AdultMales: 515.0
tick: 9241.0, AdultFemales: 449.0, AdultMales: 516.0
tick: 9265.0, AdultFemales: 436.0, AdultMales: 505.0
tick: 9289.0, AdultFemales: 418.0, AdultMales: 488.0
tick: 9313.0, AdultFemales: 399.0, AdultMales: 479.0
tick: 9337.0, AdultFemales: 395.0, AdultMales: 477.0
tick: 9361.0, AdultFemales: 393.0, AdultMales: 473.0
tick: 9385.0, AdultFemales: 392.0, AdultMales: 473.0
tick: 9409.0, AdultFemales: 387.0, AdultMales: 466.0
tick: 9433.0, AdultFemales: 378.0, AdultMales: 460.0
tick: 9457.0, AdultFemales: 387.0, AdultMales: 459.0
tick: 9481.0, AdultFemales: 387.0, AdultMales: 446.0
tick: 9505.0, AdultFemales: 382.0, AdultMales: 445.0
tick: 9529.0, AdultFemales: 380.0, AdultMales: 450.0
tick: 9553.0, AdultFemales: 386.0, AdultMales: 440.0
tick: 9577.0, AdultFemales: 375.0, AdultMales: 432.0
tick: 9601.0, AdultFemales: 367.0, AdultMales: 424.0
tick: 9625.0, AdultFemales: 368.0, AdultMales: 409.0
tick: 9649.0, AdultFemales: 352.0, AdultMales: 388.0
tick: 9673.0, AdultFemales: 338.0, AdultMales: 373.0
tick: 9697.0, AdultFemales: 325.0, AdultMales: 354.0
tick: 9721.0, AdultFemales: 318.0, AdultMales: 338.0
tick: 9745.0, AdultFemales: 299.0, AdultMales: 320.0
tick: 9769.0, AdultFemales: 294.0, AdultMales: 308.0
tick: 9793.0, AdultFemales: 290.0, AdultMales: 291.0
tick: 9817.0, AdultFemales: 282.0, AdultMales: 282.0
tick: 9841.0, AdultFemales: 277.0, AdultMales: 273.0
tick: 9865.0, AdultFemales: 274.0, AdultMales: 269.0
tick: 9889.0, AdultFemales: 267.0, AdultMales: 271.0
tick: 9913.0, AdultFemales: 268.0, AdultMales: 264.0
tick: 9937.0, AdultFemales: 267.0, AdultMales: 270.0
tick: 9961.0, AdultFemales: 265.0, AdultMales: 268.0
tick: 9985.0, AdultFemales: 257.0, AdultMales: 262.0
tick: 10009.0, AdultFemales: 253.0, AdultMales: 253.0
tick: 10033.0, AdultFemales: 256.0, AdultMales: 248.0
tick: 10057.0, AdultFemales: 254.0, AdultMales: 253.0
tick: 10081.0, AdultFemales: 245.0, AdultMales: 247.0
tick: 10105.0, AdultFemales: 243.0, AdultMales: 248.0
tick: 10129.0, AdultFemales: 241.0, AdultMales: 246.0
tick: 10153.0, AdultFemales: 240.0, AdultMales: 242.0
tick: 10177.0, AdultFemales: 233.0, AdultMales: 249.0
tick: 10201.0, AdultFemales: 227.0, AdultMales: 253.0
tick: 10225.0, AdultFemales: 223.0, AdultMales: 253.0
tick: 10249.0, AdultFemales: 218.0, AdultMales: 245.0
tick: 10273.0, AdultFemales: 212.0, AdultMales: 243.0
tick: 10297.0, AdultFemales: 215.0, AdultMales: 246.0
tick: 10321.0, AdultFemales: 220.0, AdultMales: 251.0
tick: 10345.0, AdultFemales: 223.0, AdultMales: 255.0
tick: 10369.0, AdultFemales: 224.0, AdultMales: 258.0
tick: 10393.0, AdultFemales: 225.0, AdultMales: 261.0
tick: 10417.0, AdultFemales: 230.0, AdultMales: 272.0
tick: 10441.0, AdultFemales: 242.0, AdultMales: 284.0
tick: 10465.0, AdultFemales: 257.0, AdultMales: 288.0
tick: 10489.0, AdultFemales: 270.0, AdultMales: 294.0
tick: 10513.0, AdultFemales: 270.0, AdultMales: 288.0
tick: 10537.0, AdultFemales: 286.0, AdultMales: 304.0
tick: 10561.0, AdultFemales: 296.0, AdultMales: 326.0
tick: 10585.0, AdultFemales: 306.0, AdultMales: 337.0
tick: 10609.0, AdultFemales: 317.0, AdultMales: 349.0
tick: 10633.0, AdultFemales: 329.0, AdultMales: 357.0
tick: 10657.0, AdultFemales: 340.0, AdultMales: 374.0
tick: 10681.0, AdultFemales: 351.0, AdultMales: 396.0
tick: 10705.0, AdultFemales: 361.0, AdultMales: 408.0
tick: 10729.0, AdultFemales: 384.0, AdultMales: 437.0
tick: 10753.0, AdultFemales: 398.0, AdultMales: 454.0
tick: 10777.0, AdultFemales: 416.0, AdultMales: 468.0
tick: 10801.0, AdultFemales: 437.0, AdultMales: 490.0
tick: 10825.0, AdultFemales: 441.0, AdultMales: 501.0
tick: 10849.0, AdultFemales: 435.0, AdultMales: 504.0
tick: 10873.0, AdultFemales: 432.0, AdultMales: 512.0
tick: 10897.0, AdultFemales: 443.0, AdultMales: 520.0
tick: 10921.0, AdultFemales: 457.0, AdultMales: 525.0
tick: 10945.0, AdultFemales: 459.0, AdultMales: 522.0
tick: 10969.0, AdultFemales: 462.0, AdultMales: 516.0
tick: 10993.0, AdultFemales: 480.0, AdultMales: 533.0
tick: 11017.0, AdultFemales: 500.0, AdultMales: 544.0
tick: 11041.0, AdultFemales: 498.0, AdultMales: 552.0
tick: 11065.0, AdultFemales: 507.0, AdultMales: 576.0
tick: 11089.0, AdultFemales: 525.0, AdultMales: 614.0
tick: 11113.0, AdultFemales: 550.0, AdultMales: 626.0
tick: 11137.0, AdultFemales: 558.0, AdultMales: 635.0
tick: 11161.0, AdultFemales: 565.0, AdultMales: 648.0
tick: 11185.0, AdultFemales: 572.0, AdultMales: 653.0
tick: 11209.0, AdultFemales: 579.0, AdultMales: 656.0
tick: 11233.0, AdultFemales: 576.0, AdultMales: 663.0
tick: 11257.0, AdultFemales: 577.0, AdultMales: 670.0
tick: 11281.0, AdultFemales: 592.0, AdultMales: 681.0
tick: 11305.0, AdultFemales: 585.0, AdultMales: 674.0
tick: 11329.0, AdultFemales: 586.0, AdultMales: 677.0
tick: 11353.0, AdultFemales: 579.0, AdultMales: 662.0
tick: 11377.0, AdultFemales: 577.0, AdultMales: 655.0
tick: 11401.0, AdultFemales: 570.0, AdultMales: 643.0
tick: 11425.0, AdultFemales: 573.0, AdultMales: 649.0
tick: 11449.0, AdultFemales: 570.0, AdultMales: 645.0
tick: 11473.0, AdultFemales: 553.0, AdultMales: 638.0
tick: 11497.0, AdultFemales: 545.0, AdultMales: 620.0
tick: 11521.0, AdultFemales: 534.0, AdultMales: 591.0
tick: 11545.0, AdultFemales: 533.0, AdultMales: 588.0
tick: 11569.0, AdultFemales: 527.0, AdultMales: 575.0
tick: 11593.0, AdultFemales: 534.0, AdultMales: 566.0
tick: 11617.0, AdultFemales: 534.0, AdultMales: 575.0
tick: 11641.0, AdultFemales: 562.0, AdultMales: 603.0
tick: 11665.0, AdultFemales: 583.0, AdultMales: 617.0
tick: 11689.0, AdultFemales: 589.0, AdultMales: 633.0
tick: 11713.0, AdultFemales: 596.0, AdultMales: 634.0
tick: 11737.0, AdultFemales: 598.0, AdultMales: 648.0
tick: 11761.0, AdultFemales: 600.0, AdultMales: 649.0
tick: 11785.0, AdultFemales: 604.0, AdultMales: 647.0
tick: 11809.0, AdultFemales: 604.0, AdultMales: 639.0
tick: 11833.0, AdultFemales: 587.0, AdultMales: 619.0
tick: 11857.0, AdultFemales: 584.0, AdultMales: 596.0
tick: 11881.0, AdultFemales: 586.0, AdultMales: 596.0
tick: 11905.0, AdultFemales: 568.0, AdultMales: 580.0
tick: 11929.0, AdultFemales: 555.0, AdultMales: 570.0
tick: 11953.0, AdultFemales: 555.0, AdultMales: 573.0
tick: 11977.0, AdultFemales: 565.0, AdultMales: 572.0
tick: 12001.0, AdultFemales: 550.0, AdultMales: 564.0
tick: 12025.0, AdultFemales: 543.0, AdultMales: 566.0
tick: 12049.0, AdultFemales: 542.0, AdultMales: 561.0
tick: 12073.0, AdultFemales: 540.0, AdultMales: 560.0
tick: 12097.0, AdultFemales: 545.0, AdultMales: 562.0
tick: 12121.0, AdultFemales: 546.0, AdultMales: 571.0
tick: 12145.0, AdultFemales: 554.0, AdultMales: 594.0
tick: 12169.0, AdultFemales: 555.0, AdultMales: 599.0
tick: 12193.0, AdultFemales: 542.0, AdultMales: 588.0
tick: 12217.0, AdultFemales: 545.0, AdultMales: 594.0
tick: 12241.0, AdultFemales: 570.0, AdultMales: 613.0
tick: 12265.0, AdultFemales: 569.0, AdultMales: 611.0
tick: 12289.0, AdultFemales: 562.0, AdultMales: 625.0
tick: 12313.0, AdultFemales: 552.0, AdultMales: 618.0
tick: 12337.0, AdultFemales: 540.0, AdultMales: 599.0
tick: 12361.0, AdultFemales: 512.0, AdultMales: 578.0
tick: 12385.0, AdultFemales: 506.0, AdultMales: 559.0
tick: 12409.0, AdultFemales: 502.0, AdultMales: 537.0
tick: 12433.0, AdultFemales: 511.0, AdultMales: 547.0
tick: 12457.0, AdultFemales: 506.0, AdultMales: 543.0
tick: 12481.0, AdultFemales: 491.0, AdultMales: 527.0
tick: 12505.0, AdultFemales: 498.0, AdultMales: 525.0
tick: 12529.0, AdultFemales: 489.0, AdultMales: 512.0
tick: 12553.0, AdultFemales: 485.0, AdultMales: 517.0
tick: 12577.0, AdultFemales: 486.0, AdultMales: 521.0
tick: 12601.0, AdultFemales: 488.0, AdultMales: 525.0
tick: 12625.0, AdultFemales: 503.0, AdultMales: 539.0
tick: 12649.0, AdultFemales: 522.0, AdultMales: 558.0
tick: 12673.0, AdultFemales: 554.0, AdultMales: 575.0
tick: 12697.0, AdultFemales: 560.0, AdultMales: 586.0
tick: 12721.0, AdultFemales: 563.0, AdultMales: 593.0
tick: 12745.0, AdultFemales: 570.0, AdultMales: 597.0
tick: 12769.0, AdultFemales: 567.0, AdultMales: 586.0
tick: 12793.0, AdultFemales: 562.0, AdultMales: 579.0
tick: 12817.0, AdultFemales: 566.0, AdultMales: 574.0
tick: 12841.0, AdultFemales: 578.0, AdultMales: 584.0
tick: 12865.0, AdultFemales: 596.0, AdultMales: 580.0
tick: 12889.0, AdultFemales: 592.0, AdultMales: 582.0
tick: 12913.0, AdultFemales: 580.0, AdultMales: 576.0
tick: 12937.0, AdultFemales: 575.0, AdultMales: 565.0
tick: 12961.0, AdultFemales: 513.0, AdultMales: 516.0
tick: 12985.0, AdultFemales: 508.0, AdultMales: 500.0
tick: 13009.0, AdultFemales: 509.0, AdultMales: 489.0
tick: 13033.0, AdultFemales: 514.0, AdultMales: 513.0
tick: 13057.0, AdultFemales: 520.0, AdultMales: 528.0
tick: 13081.0, AdultFemales: 532.0, AdultMales: 537.0
tick: 13105.0, AdultFemales: 529.0, AdultMales: 536.0
tick: 13129.0, AdultFemales: 515.0, AdultMales: 526.0
tick: 13153.0, AdultFemales: 513.0, AdultMales: 536.0
tick: 13177.0, AdultFemales: 526.0, AdultMales: 551.0
tick: 13201.0, AdultFemales: 516.0, AdultMales: 552.0
tick: 13225.0, AdultFemales: 522.0, AdultMales: 548.0
tick: 13249.0, AdultFemales: 534.0, AdultMales: 553.0
tick: 13273.0, AdultFemales: 533.0, AdultMales: 560.0
tick: 13297.0, AdultFemales: 521.0, AdultMales: 553.0
tick: 13321.0, AdultFemales: 513.0, AdultMales: 538.0
tick: 13345.0, AdultFemales: 502.0, AdultMales: 530.0
tick: 13369.0, AdultFemales: 481.0, AdultMales: 503.0
tick: 13393.0, AdultFemales: 457.0, AdultMales: 484.0
tick: 13417.0, AdultFemales: 443.0, AdultMales: 481.0
tick: 13441.0, AdultFemales: 425.0, AdultMales: 476.0
tick: 13465.0, AdultFemales: 429.0, AdultMales: 478.0
tick: 13489.0, AdultFemales: 432.0, AdultMales: 472.0
tick: 13513.0, AdultFemales: 438.0, AdultMales: 471.0
tick: 13537.0, AdultFemales: 442.0, AdultMales: 466.0
tick: 13561.0, AdultFemales: 422.0, AdultMales: 450.0
tick: 13585.0, AdultFemales: 408.0, AdultMales: 436.0
tick: 13609.0, AdultFemales: 413.0, AdultMales: 436.0
tick: 13633.0, AdultFemales: 425.0, AdultMales: 456.0
tick: 13657.0, AdultFemales: 442.0, AdultMales: 482.0
tick: 13681.0, AdultFemales: 452.0, AdultMales: 501.0
tick: 13705.0, AdultFemales: 450.0, AdultMales: 509.0
tick: 13729.0, AdultFemales: 469.0, AdultMales: 526.0
tick: 13753.0, AdultFemales: 479.0, AdultMales: 523.0
tick: 13777.0, AdultFemales: 483.0, AdultMales: 521.0
tick: 13801.0, AdultFemales: 473.0, AdultMales: 520.0
tick: 13825.0, AdultFemales: 476.0, AdultMales: 521.0
tick: 13849.0, AdultFemales: 480.0, AdultMales: 496.0
tick: 13873.0, AdultFemales: 484.0, AdultMales: 500.0
tick: 13897.0, AdultFemales: 494.0, AdultMales: 514.0
tick: 13921.0, AdultFemales: 503.0, AdultMales: 524.0
tick: 13945.0, AdultFemales: 493.0, AdultMales: 521.0
tick: 13969.0, AdultFemales: 500.0, AdultMales: 519.0
tick: 13993.0, AdultFemales: 500.0, AdultMales: 522.0
tick: 14017.0, AdultFemales: 509.0, AdultMales: 534.0
tick: 14041.0, AdultFemales: 528.0, AdultMales: 558.0
tick: 14065.0, AdultFemales: 541.0, AdultMales: 575.0
tick: 14089.0, AdultFemales: 558.0, AdultMales: 591.0
tick: 14113.0, AdultFemales: 564.0, AdultMales: 595.0
tick: 14137.0, AdultFemales: 582.0, AdultMales: 596.0
tick: 14161.0, AdultFemales: 583.0, AdultMales: 591.0
tick: 14185.0, AdultFemales: 566.0, AdultMales: 588.0
tick: 14209.0, AdultFemales: 551.0, AdultMales: 587.0
tick: 14233.0, AdultFemales: 542.0, AdultMales: 588.0
tick: 14257.0, AdultFemales: 543.0, AdultMales: 575.0
tick: 14281.0, AdultFemales: 551.0, AdultMales: 591.0
tick: 14305.0, AdultFemales: 551.0, AdultMales: 586.0
tick: 14329.0, AdultFemales: 540.0, AdultMales: 582.0
tick: 14353.0, AdultFemales: 517.0, AdultMales: 560.0
tick: 14377.0, AdultFemales: 507.0, AdultMales: 534.0
tick: 14401.0, AdultFemales: 507.0, AdultMales: 542.0
tick: 14425.0, AdultFemales: 513.0, AdultMales: 543.0
tick: 14449.0, AdultFemales: 510.0, AdultMales: 555.0
tick: 14473.0, AdultFemales: 504.0, AdultMales: 549.0
tick: 14497.0