0,0.0,0.0,2.0,0_1,831_0,91
1,1.0,6179.0,2.0,0_1,951_0,110
2,2.0,3092.0,2.0,0_1,851_0,106
3,3.0,2512.0,2.0,0_1,861_0,103
4,4.0,3683.0,2.0,0_1,921_0,100
5,5.0,3995.0,2.0,0_1,921_0,104
6,6.0,3664.0,2.0,0_1,1051_0,98
7,7.0,3619.0,2.0,0_1,1051_0,102
8,8.0,4346.0,2.0,0_1,1131_0,100
9,9.0,4282.0,2.0,0_1,1161_0,110
10,10.0,4587.0,2.0,0_1,1231_0,115
11,11.0,5026.0,2.0,0_1,1261_0,118
12,12.0,4491.0,2.0,0_1,1251_0,124
13,13.0,4250.0,2.0,0_1,1291_0,126
14,14.0,3831.0,2.0,0_1,1301_0,123
15,15.0,3232.0,2.0,0_1,1301_0,125
16,16.0,4456.0,2.0,0_1,1391_0,134
17,17.0,5498.0,2.0,0_1,1421_0,137
18,18.0,5420.0,2.0,0_1,1481_0,146
19,19.0,5529.0,2.0,0_1,1491_0,145
20,20.0,4065.0,2.0,0_1,1511_0,153
21,21.0,5470.0,2.0,0_1,1571_0,156
22,22.0,6580.0,2.0,0_1,1571_0,163
23,23.0,5725.0,2.0,0_1,1591_0,160
24,24.0,6209.0,2.0,0_1,1781_0,171
25,25.0,6930.0,2.0,0_1,1761_0,173
26,26.0,5359.0,2.0,0_1,1841_0,176
27,27.0,6080.0,2.0,0_1,1791_0,171
28,28.0,5836.0,2.0,0_1,1771_0,181
29,29.0,6615.0,2.0,0_1,1831_0,183
30,30.0,5876.0,2.0,0_1,1901_0,189
31,31.0,6567.0,2.0,0_1,2031_0,193
32,32.0,7752.0,2.0,0_1,1941_0,195
33,33.0,7025.0,2.0,0_1,2021_0,199
34,34.0,8292.0,2.0,0_1,2071_0,202
35,35.0,7824.0,2.0,0_1,2201_0,211
36,36.0,8107.0,2.0,0_1,2231_0,214
37,37.0,9038.0,2.0,0_1,2311_0,211
38,38.0,7624.0,2.0,0_1,2401_0,211
39,39.0,8734.0,2.0,0_1,2421_0,212
40,40.0,8410.0,2.0,0_1,2431_0,208
41,41.0,6772.0,2.0,0_1,2501_0,209
42,42.0,7515.0,2.0,0_1,2561_0,214
43,43.0,8990.0,2.0,0_1,2581_0,225
44,44.0,9324.0,2.0,0_1,2581_0,243
45,45.0,9121.0,2.0,0_1,2541_0,253
46,46.0,8875.0,2.0,0_1,2591_0,258
47,47.0,9187.0,2.0,0_1,2691_0,264
48,48.0,9527.0,2.0,0_1,2781_0,280
49,49.0,11002.0,2.0,0_1,2841_0,290
50,50.0,10669.0,2.0,0_1,2861_0,294
51,51.0,9922.0,2.0,0_1,2971_0,300
52,52.0,11142.0,2.0,0_1,3061_0,307
53,53.0,10757.0,2.0,0_1,3181_0,307
54,54.0,9903.0,2.0,0_1,3151_0,302
55,55.0,9895.0,2.0,0_1,3281_0,298
56,56.0,11427.0,2.0,0_1,3271_0,308
57,57.0,11321.0,2.0,0_1,3381_0,305
58,58.0,9590.0,2.0,0_1,3571_0,318
59,59.0,12875.0,2.0,0_1,3591_0,328
60,60.0,10580.0,2.0,0_1,3771_0,344
61,61.0,12954.0,2.0,0_1,3731_0,350
62,62.0,12157.0,2.0,0_1,3801_0,365
63,63.0,10015.0,2.0,0_1,3821_0,376
64,64.0,13781.0,2.0,0_1,3901_0,383
65,65.0,12944.0,2.0,0_1,3931_0,397
66,66.0,13568.0,2.0,0_1,3991_0,409
67,67.0,13203.0,2.0,0_1,4031_0,421
68,68.0,13686.0,2.0,0_1,4081_0,437
69,69.0,13439.0,2.0,0_1,4011_0,443
70,70.0,13275.0,2.0,0_1,3971_0,441
71,71.0,13879.0,2.0,0_1,4121_0,447
72,72.0,15463.0,2.0,0_1,4281_0,440
73,73.0,10788.0,2.0,0_1,4301_0,450
74,74.0,14187.0,2.0,0_1,4301_0,446
75,75.0,16260.0,2.0,0_1,4421_0,469
76,76.0,17651.0,2.0,0_1,4621_0,485
77,77.0,16800.0,2.0,0_1,4671_0,473
78,78.0,13422.0,2.0,0_1,4661_0,488
79,79.0,13605.0,2.0,0_1,4731_0,506
80,80.0,15993.0,2.0,0_1,4831_0,507
81,81.0,12985.0,2.0,0_1,4911_0,514
82,82.0,18734.0,2.0,0_1,4981_0,520
83,83.0,13230.0,2.0,0_1,4991_0,542
84,84.0,17960.0,2.0,0_1,5121_0,528
85,85.0,15437.0,2.0,0_1,5191_0,519
86,86.0,15622.0,2.0,0_1,5261_0,518
87,87.0,16774.0,2.0,0_1,5181_0,518
88,88.0,18370.0,2.0,0_1,5091_0,541
89,89.0,18755.0,2.0,0_1,5241_0,548
90,90.0,18639.0,2.0,0_1,5241_0,560
91,91.0,18078.0,2.0,0_1,5161_0,565
92,92.0,15460.0,2.0,0_1,5151_0,574
93,93.0,17735.0,2.0,0_1,5141_0,573
94,94.0,16695.0,2.0,0_1,5131_0,569
95,95.0,16543.0,2.0,0_1,5171_0,581
96,96.0,18801.0,2.0,0_1,5231_0,583
97,97.0,18810.0,2.0,0_1,5391_0,590
98,98.0,18962.0,2.0,0_1,5501_0,596
99,99.0,16128.0,2.0,0_1,5561_0,597
100,100.0,17316.0,2.0,0_1,5531_0,598
101,101.0,17570.0,2.0,0_1,5511_0,592
102,102.0,16428.0,2.0,0_1,5501_0,604
103,103.0,16724.0,2.0,0_1,5511_0,599
104,104.0,18502.0,2.0,0_1,5841_0,618
105,105.0,21621.0,2.0,0_1,5941_0,634
106,106.0,17437.0,2.0,0_1,5951_0,638
107,107.0,21436.0,2.0,0_1,6291_0,642
108,108.0,21403.0,2.0,0_1,6361_0,648
109,109.0,21150.0,2.0,0_1,6351_0,643
110,110.0,22226.0,2.0,0_1,6421_0,661
111,111.0,22064.0,2.0,0_1,6521_0,658
112,112.0,20599.0,2.0,0_1,6551_0,673
113,113.0,20508.0,2.0,0_1,6501_0,685
114,114.0,20631.0,2.0,0_1,6531_0,710
115,115.0,23236.0,2.0,0_1,6611_0,712
116,116.0,21613.0,2.0,0_1,6801_0,724
117,117.0,21580.0,2.0,0_1,6781_0,722
118,118.0,23548.0,2.0,0_1,6841_0,747
119,119.0,19983.0,2.0,0_1,7121_0,740
120,120.0,24658.0,2.0,0_1,7201_0,739
121,121.0,21348.0,2.0,0_1,7161_0,740
122,122.0,21426.0,2.0,0_1,7101_0,747
123,123.0,23037.0,2.0,0_1,7311_0,749
124,124.0,19171.0,2.0,0_1,7401_0,756
125,125.0,22503.0,2.0,0_1,7531_0,765
126,126.0,24232.0,2.0,0_1,7791_0,770
127,127.0,26968.0,2.0,0_1,7971_0,762
128,128.0,23075.0,2.0,0_1,8041_0,770
129,129.0,23727.0,2.0,0_1,8131_0,773
130,130.0,23702.0,2.0,0_1,8391_0,770
131,131.0,26871.0,2.0,0_1,8461_0,779
132,132.0,27881.0,2.0,0_1,8501_0,807
133,133.0,30053.0,2.0,0_1,8631_0,813
134,134.0,24964.0,2.0,0_1,8511_0,823
135,135.0,26901.0,2.0,0_1,8501_0,834
136,136.0,28334.0,2.0,0_1,8601_0,847
137,137.0,25745.0,2.0,0_1,8411_0,858
138,138.0,27253.0,2.0,0_1,8451_0,869
139,139.0,28505.0,2.0,0_1,8491_0,877
140,140.0,29364.0,2.0,0_1,8391_0,879
141,141.0,24982.0,2.0,0_1,8311_0,873
142,142.0,23891.0,2.0,0_1,8331_0,878
143,143.0,26726.0,2.0,0_1,8491_0,886
144,144.0,24859.0,2.0,0_1,8721_0,887
145,145.0,26565.0,2.0,0_1,8701_0,891
146,146.0,26517.0,2.0,0_1,8801_0,875
147,147.0,24430.0,2.0,0_1,8981_0,875
148,148.0,23071.0,2.0,0_1,8931_0,863
149,149.0,23385.0,2.0,0_1,8941_0,876
150,150.0,29256.0,2.0,0_1,9081_0,873
151,151.0,32650.0,2.0,0_1,9201_0,870
152,152.0,23900.0,2.0,0_1,9171_0,885
153,153.0,26211.0,2.0,0_1,9251_0,893
154,154.0,28581.0,2.0,0_1,9241_0,881
155,155.0,26926.0,2.0,0_1,9431_0,876
156,156.0,30175.0,2.0,0_1,9481_0,883
157,157.0,32508.0,2.0,0_1,9411_0,894
158,158.0,25037.0,2.0,0_1,9351_0,895
159,159.0,25843.0,2.0,0_1,9421_0,925
160,160.0,28244.0,2.0,0_1,9661_0,951
161,161.0,33347.0,2.0,0_1,9871_0,957
162,162.0,34054.0,2.0,0_1,10011_0,980
163,163.0,32665.0,2.0,0_1,10121_0,1010
164,164.0,35029.0,2.0,0_1,10521_0,1023
165,165.0,36906.0,2.0,0_1,10721_0,1070
166,166.0,33476.0,2.0,0_1,10821_0,1086
167,167.0,28706.0,2.0,0_1,10641_0,1084
168,168.0,32983.0,2.0,0_1,10541_0,1118
169,169.0,28591.0,2.0,0_1,10581_0,1126
170,170.0,35944.0,2.0,0_1,11001_0,1125
171,171.0,34939.0,2.0,0_1,11521_0,1128
172,172.0,35138.0,2.0,0_1,11711_0,1121
173,173.0,34418.0,2.0,0_1,11671_0,1135
174,174.0,32318.0,2.0,0_1,11741_0,1141
175,175.0,33184.0,2.0,0_1,11831_0,1146
176,176.0,36342.0,2.0,0_1,11811_0,1165
177,177.0,36421.0,2.0,0_1,11731_0,1168
178,178.0,30763.0,2.0,0_1,11791_0,1196
179,179.0,36016.0,2.0,0_1,11481_0,1193
180,180.0,31181.0,2.0,0_1,11781_0,1207
181,181.0,42121.0,2.0,0_1,11931_0,1212
182,182.0,32473.0,2.0,0_1,11631_0,1217
183,183.0,35730.0,2.0,0_1,11731_0,1210
184,184.0,41015.0,2.0,0_1,12041_0,1240
185,185.0,41282.0,2.0,0_1,12381_0,1251
186,186.0,38837.0,2.0,0_1,12571_0,1275
187,187.0,40968.0,2.0,0_1,12621_0,1278
188,188.0,40809.0,2.0,0_1,12801_0,1298
189,189.0,39334.0,2.0,0_1,12531_0,1310
190,190.0,33658.0,2.0,0_1,12271_0,1350
191,191.0,35707.0,2.0,0_1,12351_0,1339
192,192.0,29851.0,2.0,0_1,12211_0,1344
193,193.0,32728.0,2.0,0_1,11901_0,1321
194,194.0,38436.0,2.0,0_1,11961_0,1329
195,195.0,37789.0,2.0,0_1,11951_0,1354
196,196.0,35159.0,2.0,0_1,11851_0,1341
197,197.0,37404.0,2.0,0_1,12061_0,1307
198,198.0,36440.0,2.0,0_1,12161_0,1280
199,199.0,31621.0,2.0,0_1,12371_0,1283
200,200.0,37742.0,2.0,0_1,12391_0,1291
201,201.0,41813.0,2.0,0_1,12271_0,1271
202,202.0,31422.0,2.0,0_1,12341_0,1239
203,203.0,41487.0,2.0,0_1,12241_0,1217
204,204.0,33725.0,2.0,0_1,12231_0,1228
205,205.0,33076.0,2.0,0_1,12341_0,1219
206,206.0,36343.0,2.0,0_1,12631_0,1213
207,207.0,33848.0,2.0,0_1,12561_0,1187
208,208.0,35197.0,2.0,0_1,12381_0,1186
209,209.0,34423.0,2.0,0_1,12371_0,1209
210,210.0,38108.0,2.0,0_1,12501_0,1192
211,211.0,35612.0,2.0,0_1,12561_0,1196
212,212.0,40234.0,2.0,0_1,12521_0,1205
213,213.0,37124.0,2.0,0_1,12531_0,1193
214,214.0,36622.0,2.0,0_1,12691_0,1194
215,215.0,35167.0,2.0,0_1,12731_0,1198
216,216.0,38141.0,2.0,0_1,12591_0,1182
217,217.0,34166.0,2.0,0_1,12481_0,1150
218,218.0,33405.0,2.0,0_1,12421_0,1176
219,219.0,42203.0,2.0,0_1,12831_0,1224
220,220.0,39826.0,2.0,0_1,13501_0,1274
221,221.0,43680.0,2.0,0_1,13571_0,1300
222,222.0,43674.0,2.0,0_1,13921_0,1326
223,223.0,37664.0,2.0,0_1,13631_0,1323
224,224.0,37041.0,2.0,0_1,13931_0,1340
225,225.0,46178.0,2.0,0_1,14011_0,1357
226,226.0,41352.0,2.0,0_1,14091_0,1375
227,227.0,45982.0,2.0,0_1,14021_0,1407
228,228.0,44555.0,2.0,0_1,13901_0,1442
229,229.0,41177.0,2.0,0_1,13951_0,1443
230,230.0,44456.0,2.0,0_1,13951_0,1448
231,231.0,41831.0,2.0,0_1,14381_0,1468
232,232.0,43889.0,2.0,0_1,14381_0,1477
233,233.0,40435.0,2.0,0_1,14571_0,1466
234,234.0,39420.0,2.0,0_1,14381_0,1479
235,235.0,38553.0,2.0,0_1,14151_0,1450
236,236.0,40527.0,2.0,0_1,14021_0,1461
237,237.0,41454.0,2.0,0_1,13851_0,1472
238,238.0,40249.0,2.0,0_1,14041_0,1473
239,239.0,44958.0,2.0,0_1,14251_0,1475
240,240.0,39489.0,2.0,0_1,14291_0,1470
241,241.0,43003.0,2.0,0_1,14261_0,1431
242,242.0,40546.0,2.0,0_1,14161_0,1445
243,243.0,40486.0,2.0,0_1,14121_0,1437
244,244.0,37609.0,2.0,0_1,14231_0,1428
245,245.0,45727.0,2.0,0_1,14531_0,1434
246,246.0,48669.0,2.0,0_1,14501_0,1435
247,247.0,47710.0,2.0,0_1,14521_0,1432
248,248.0,42809.0,2.0,0_1,14871_0,1469
249,249.0,45942.0,2.0,0_1,14831_0,1479
250,250.0,41829.0,2.0,0_1,14861_0,1470
251,251.0,45263.0,2.0,0_1,14881_0,1463
252,252.0,47541.0,2.0,0_1,15121_0,1516
253,253.0,43464.0,2.0,0_1,15511_0,1494
254,254.0,42643.0,2.0,0_1,15731_0,1506
255,255.0,46597.0,2.0,0_1,15601_0,1495
256,256.0,42718.0,2.0,0_1,15951_0,1497
257,257.0,47057.0,2.0,0_1,16201_0,1564
258,258.0,54745.0,2.0,0_1,16351_0,1560
259,259.0,47936.0,2.0,0_1,16281_0,1559
260,260.0,37204.0,2.0,0_1,16121_0,1565
261,261.0,50272.0,2.0,0_1,16091_0,1588
262,262.0,48787.0,2.0,0_1,16171_0,1617
263,263.0,54802.0,2.0,0_1,16271_0,1614
264,264.0,49592.0,2.0,0_1,16211_0,1596
265,265.0,44002.0,2.0,0_1,16241_0,1609
266,266.0,45871.0,2.0,0_1,16241_0,1614
267,267.0,45454.0,2.0,0_1,16531_0,1617
268,268.0,50010.0,2.0,0_1,16701_0,1632
269,269.0,56688.0,2.0,0_1,16741_0,1652
270,270.0,47986.0,2.0,0_1,16791_0,1657
271,271.0,47249.0,2.0,0_1,16591_0,1617
272,272.0,47016.0,2.0,0_1,16781_0,1623
273,273.0,50097.0,2.0,0_1,16781_0,1643
274,274.0,49086.0,2.0,0_1,16581_0,1640
275,275.0,45952.0,2.0,0_1,16511_0,1628
276,276.0,52512.0,2.0,0_1,16821_0,1656
277,277.0,56574.0,2.0,0_1,17041_0,1654
278,278.0,54822.0,2.0,0_1,17311_0,1663
279,279.0,56680.0,2.0,0_1,17261_0,1682
280,280.0,57616.0,2.0,0_1,17611_0,1724
281,281.0,54238.0,2.0,0_1,18191_0,1750
282,282.0,56371.0,2.0,0_1,18541_0,1804
283,283.0,53345.0,2.0,0_1,18781_0,1806
284,284.0,50443.0,2.0,0_1,18581_0,1842
285,285.0,60174.0,2.0,0_1,18721_0,1874
286,286.0,59302.0,2.0,0_1,18831_0,1857
287,287.0,60664.0,2.0,0_1,18521_0,1882
288,288.0,43567.0,2.0,0_1,18751_0,1891
289,289.0,56891.0,2.0,0_1,18931_0,1927
290,290.0,56838.0,2.0,0_1,19161_0,1939
291,291.0,61603.0,2.0,0_1,19181_0,1977
292,292.0,59370.0,2.0,0_1,18991_0,2012
293,293.0,58117.0,2.0,0_1,18911_0,2031
294,294.0,62493.0,2.0,0_1,19021_0,2039
295,295.0,52434.0,2.0,0_1,19241_0,2030
296,296.0,56442.0,2.0,0_1,18991_0,2003
297,297.0,49142.0,2.0,0_1,19161_0,1964
298,298.0,52634.0,2.0,0_1,19431_0,1962
299,299.0,59134.0,2.0,0_1,19281_0,1924
300,300.0,60849.0,2.0,0_1,19001_0,1914
301,301.0,55577.0,2.0,0_1,19261_0,1905
302,302.0,57806.0,2.0,0_1,19431_0,1892
303,303.0,50879.0,2.0,0_1,19431_0,1932
304,304.0,61869.0,2.0,0_1,19231_0,1967
305,305.0,55878.0,2.0,0_1,19331_0,1957
306,306.0,52540.0,2.0,0_1,19641_0,1976
307,307.0,54793.0,2.0,0_1,19511_0,1884
308,308.0,40229.0,2.0,0_1,19271_0,1859
309,309.0,60269.0,2.0,0_1,19201_0,1847
310,310.0,64421.0,2.0,0_1,19081_0,1823
311,311.0,54527.0,2.0,0_1,18871_0,1808
312,312.0,58005.0,2.0,0_1,19101_0,1868
313,313.0,63413.0,2.0,0_1,19651_0,1965
314,314.0,65424.0,2.0,0_1,19761_0,1992
315,315.0,56606.0,2.0,0_1,19661_0,2008
316,316.0,62057.0,2.0,0_1,19571_0,1986
317,317.0,55959.0,2.0,0_1,19811_0,2009
318,318.0,57511.0,2.0,0_1,20371_0,2047
319,319.0,64735.0,2.0,0_1,20571_0,2077
320,320.0,61508.0,2.0,0_1,20561_0,2063
321,321.0,57959.0,2.0,0_1,20431_0,2061
322,322.0,62909.0,2.0,0_1,20421_0,2027
323,323.0,55428.0,2.0,0_1,19871_0,1997
324,324.0,58360.0,2.0,0_1,20241_0,1991
325,325.0,57874.0,2.0,0_1,20191_0,2008
326,326.0,56420.0,2.0,0_1,20491_0,2033
327,327.0,60284.0,2.0,0_1,20571_0,2054
328,328.0,60517.0,2.0,0_1,20111_0,2002
329,329.0,58820.0,2.0,0_1,20041_0,1995
330,330.0,57672.0,2.0,0_1,19891_0,1990
331,331.0,58560.0,2.0,0_1,20151_0,2052
332,332.0,74066.0,2.0,0_1,20821_0,2092
333,333.0,64589.0,2.0,0_1,20511_0,2080
334,334.0,59421.0,2.0,0_1,20401_0,2092
335,335.0,56841.0,2.0,0_1,20781_0,2143
336,336.0,65224.0,2.0,0_1,21131_0,2122
337,337.0,62355.0,2.0,0_1,20791_0,2108
338,338.0,57026.0,2.0,0_1,20341_0,2030
339,339.0,41362.0,2.0,0_1,19561_0,1961
340,340.0,56739.0,2.0,0_1,19221_0,1905
341,341.0,57064.0,2.0,0_1,19181_0,1958
342,342.0,63490.0,2.0,0_1,19521_0,1976
343,343.0,66160.0,2.0,0_1,19641_0,1962
344,344.0,56745.0,2.0,0_1,20081_0,1995
345,345.0,65898.0,2.0,0_1,20131_0,2016
346,346.0,62116.0,2.0,0_1,20371_0,2039
347,347.0,59175.0,2.0,0_1,20211_0,2038
348,348.0,58097.0,2.0,0_1,20191_0,2037
349,349.0,67656.0,2.0,0_1,20101_0,2028
350,350.0,66942.0,2.0,0_1,20501_0,2099
351,351.0,62410.0,2.0,0_1,21311_0,2171
352,352.0,69703.0,2.0,0_1,22111_0,2205
353,353.0,64014.0,2.0,0_1,22161_0,2218
354,354.0,64461.0,2.0,0_1,22111_0,2253
355,355.0,69847.0,2.0,0_1,21771_0,2263
356,356.0,71059.0,2.0,0_1,22021_0,2233
357,357.0,68692.0,2.0,0_1,22251_0,2236
358,358.0,66117.0,2.0,0_1,22541_0,2255
359,359.0,67221.0,2.0,0_1,22221_0,2220
360,360.0,60028.0,2.0,0_1,21821_0,2195
361,361.0,65556.0,2.0,0_1,22001_0,2215
362,362.0,69016.0,2.0,0_1,22011_0,2210
363,363.0,61047.0,2.0,0_1,22131_0,2228
364,364.0,73769.0,2.0,0_1,22071_0,2201
365,365.0,66469.0,2.0,0_1,21821_0,2223
366,366.0,69167.0,2.0,0_1,22431_0,2257
367,367.0,73622.0,2.0,0_1,22371_0,2273
368,368.0,55987.0,2.0,0_1,22981_0,2326
369,369.0,71786.0,2.0,0_1,22821_0,2349
370,370.0,69902.0,2.0,0_1,22641_0,2377
371,371.0,75103.0,2.0,0_1,23011_0,2395
372,372.0,71573.0,2.0,0_1,22991_0,2403
373,373.0,64235.0,2.0,0_1,22691_0,2317
374,374.0,61077.0,2.0,0_1,21991_0,2261
375,375.0,60754.0,2.0,0_1,22111_0,2262
376,376.0,58764.0,2.0,0_1,22281_0,2305
377,377.0,75962.0,2.0,0_1,21861_0,2308
378,378.0,66149.0,2.0,0_1,22171_0,2297
379,379.0,74055.0,2.0,0_1,21981_0,2305
380,380.0,62628.0,2.0,0_1,22771_0,2345
381,381.0,67790.0,2.0,0_1,23221_0,2323
382,382.0,78217.0,2.0,0_1,22901_0,2337
383,383.0,70254.0,2.0,0_1,22911_0,2341
384,384.0,76209.0,2.0,0_1,23081_0,2409
385,385.0,80896.0,2.0,0_1,23421_0,2439
386,386.0,78742.0,2.0,0_1,23551_0,2442
387,387.0,67475.0,2.0,0_1,23331_0,2390
388,388.0,59300.0,2.0,0_1,23451_0,2365
389,389.0,69933.0,2.0,0_1,23431_0,2374
390,390.0,68964.0,2.0,0_1,24131_0,2420
391,391.0,75444.0,2.0,0_1,24231_0,2409
392,392.0,77979.0,2.0,0_1,24001_0,2386
393,393.0,77251.0,2.0,0_1,24271_0,2424
394,394.0,72650.0,2.0,0_1,24611_0,2428
395,395.0,69122.0,2.0,0_1,24751_0,2424
396,396.0,65742.0,2.0,0_1,24541_0,2409
397,397.0,67721.0,2.0,0_1,24511_0,2385
398,398.0,69697.0,2.0,0_1,24681_0,2440
399,399.0,74138.0,2.0,0_1,24591_0,2457
400,400.0,78304.0,2.0,0_1,24211_0,2430
401,401.0,65294.0,2.0,0_1,24051_0,2391
402,402.0,60330.0,2.0,0_1,24061_0,2420
403,403.0,70408.0,2.0,0_1,23991_0,2339
404,404.0,64718.0,2.0,0_1,23701_0,2343
405,405.0,65656.0,2.0,0_1,23101_0,2390
406,406.0,68237.0,2.0,0_1,22591_0,2352
407,407.0,70171.0,2.0,0_1,22651_0,2333
408,408.0,69673.0,2.0,0_1,22801_0,2298
409,409.0,63634.0,2.0,0_1,22681_0,2297
410,410.0,65687.0,2.0,0_1,22381_0,2250
411,411.0,62514.0,2.0,0_1,22081_0,2234
412,412.0,57909.0,2.0,0_1,21801_0,2212
413,413.0,60722.0,2.0,0_1,21561_0,2190
414,414.0,69245.0,2.0,0_1,21551_0,2178
415,415.0,62245.0,2.0,0_1,21261_0,2142
416,416.0,67569.0,2.0,0_1,21331_0,2150
417,417.0,65875.0,2.0,0_1,21741_0,2174
418,418.0,63226.0,2.0,0_1,21941_0,2156
419,419.0,64899.0,2.0,0_1,22261_0,2174
420,420.0,71399.0,2.0,0_1,22351_0,2192
421,421.0,58779.0,2.0,0_1,22201_0,2194
422,422.0,62780.0,2.0,0_1,21921_0,2137
423,423.0,65938.0,2.0,0_1,21351_0,2141
424,424.0,67694.0,2.0,0_1,20731_0,2145
425,425.0,61355.0,2.0,0_1,21091_0,2194
426,426.0,67098.0,2.0,0_1,20821_0,2135
427,427.0,55226.0,2.0,0_1,20561_0,2119
428,428.0,65377.0,2.0,0_1,20791_0,2091
429,429.0,66537.0,2.0,0_1,21501_0,2111
430,430.0,62448.0,2.0,0_1,21751_0,2132
431,431.0,56596.0,2.0,0_1,22051_0,2161
432,432.0,66802.0,2.0,0_1,21821_0,2130
433,433.0,61658.0,2.0,0_1,21841_0,2136
434,434.0,63754.0,2.0,0_1,21621_0,2138
435,435.0,67334.0,2.0,0_1,21741_0,2130
436,436.0,60398.0,2.0,0_1,21181_0,2123
437,437.0,57807.0,2.0,0_1,20831_0,2088
438,438.0,58768.0,2.0,0_1,20291_0,2092
439,439.0,65232.0,2.0,0_1,20661_0,2106
440,440.0,73971.0,2.0,0_1,20751_0,2077
441,441.0,60594.0,2.0,0_1,20861_0,2055
442,442.0,63673.0,2.0,0_1,21011_0,2068
443,443.0,72145.0,2.0,0_1,21101_0,2131
444,444.0,73558.0,2.0,0_1,21611_0,2202
445,445.0,73300.0,2.0,0_1,22191_0,2282
446,446.0,74132.0,2.0,0_1,21921_0,2304
447,447.0,64934.0,2.0,0_1,22261_0,2334
448,448.0,70589.0,2.0,0_1,22891_0,2371
449,449.0,70927.0,2.0,0_1,23601_0,2413
450,450.0,71169.0,2.0,0_1,23101_0,2329
451,451.0,56016.0,2.0,0_1,23251_0,2340
452,452.0,71131.0,2.0,0_1,23391_0,2390
453,453.0,71071.0,2.0,0_1,23291_0,2364
454,454.0,71425.0,2.0,0_1,23161_0,2310
455,455.0,63867.0,2.0,0_1,23321_0,2298
456,456.0,68963.0,2.0,0_1,23681_0,2375
457,457.0,86094.0,2.0,0_1,23451_0,2423
458,458.0,69393.0,2.0,0_1,23221_0,2395
459,459.0,69476.0,2.0,0_1,23351_0,2434
460,460.0,74904.0,2.0,0_1,23771_0,2479
461,461.0,72020.0,2.0,0_1,24031_0,2473
462,462.0,70273.0,2.0,0_1,24361_0,2461
463,463.0,69057.0,2.0,0_1,25001_0,2468
464,464.0,77119.0,2.0,0_1,24481_0,2446
465,465.0,69214.0,2.0,0_1,24051_0,2433
466,466.0,63370.0,2.0,0_1,24431_0,2449
467,467.0,75017.0,2.0,0_1,23871_0,2440
468,468.0,61548.0,2.0,0_1,23831_0,2406
469,469.0,75160.0,2.0,0_1,23601_0,2397
470,470.0,75033.0,2.0,0_1,23531_0,2395
471,471.0,69478.0,2.0,0_1,24331_0,2384
472,472.0,73734.0,2.0,0_1,24651_0,2459
473,473.0,75532.0,2.0,0_1,24641_0,2431
474,474.0,68700.0,2.0,0_1,24821_0,2416
475,475.0,72999.0,2.0,0_1,24851_0,2390
476,476.0,61144.0,2.0,0_1,24721_0,2387
477,477.0,66671.0,2.0,0_1,24291_0,2378
478,478.0,70696.0,2.0,0_1,23641_0,2335
479,479.0,66983.0,2.0,0_1,23181_0,2300
480,480.0,66280.0,2.0,0_1,23261_0,2280
481,481.0,67714.0,2.0,0_1,23151_0,2285
482,482.0,71656.0,2.0,0_1,22801_0,2294
483,483.0,63858.0,2.0,0_1,23151_0,2298
484,484.0,64342.0,2.0,0_1,23061_0,2330
485,485.0,74889.0,2.0,0_1,23291_0,2358
486,486.0,70056.0,2.0,0_1,23601_0,2418
487,487.0,74598.0,2.0,0_1,23481_0,2384
488,488.0,75154.0,2.0,0_1,23441_0,2401
489,489.0,64162.0,2.0,0_1,23561_0,2361
490,490.0,75964.0,2.0,0_1,23541_0,2327
491,491.0,73113.0,2.0,0_1,23711_0,2300
492,492.0,66706.0,2.0,0_1,23211_0,2297
493,493.0,65078.0,2.0,0_1,23091_0,2311
494,494.0,65151.0,2.0,0_1,23571_0,2348
495,495.0,72771.0,2.0,0_1,23821_0,2380
496,496.0,72047.0,2.0,0_1,24671_0,2471
497,497.0,78299.0,2.0,0_1,25201_0,2523
498,498.0,78089.0,2.0,0_1,25561_0,2586
499,499.0,84525.0,2.0,0_1,25571_0,2594
500,500.0,68529.0,2.0,0_1,25361_0,2604
501,501.0,73459.0,2.0,0_1,25141_0,2623
502,502.0,70587.0,2.0,0_1,25111_0,2633
503,503.0,76684.0,2.0,0_1,25031_0,2578
504,504.0,75894.0,2.0,0_1,25201_0,2583
505,505.0,75814.0,2.0,0_1,24531_0,2526
506,506.0,62588.0,2.0,0_1,24281_0,2446
507,507.0,57018.0,2.0,0_1,24301_0,2380
508,508.0,72156.0,2.0,0_1,24141_0,2371
509,509.0,63366.0,2.0,0_1,24421_0,2416
510,510.0,76223.0,2.0,0_1,25021_0,2438
511,511.0,79085.0,2.0,0_1,24601_0,2387
512,512.0,69847.0,2.0,0_1,24761_0,2341
513,513.0,68635.0,2.0,0_1,24591_0,2335
514,514.0,71004.0,2.0,0_1,24351_0,2323
515,515.0,76548.0,2.0,0_1,24381_0,2357
516,516.0,76749.0,2.0,0_1,24351_0,2384
517,517.0,68104.0,2.0,0_1,24391_0,2408
518,518.0,70085.0,2.0,0_1,24691_0,2415
519,519.0,82324.0,2.0,0_1,24911_0,2420
520,520.0,73198.0,2.0,0_1,25701_0,2482
521,521.0,76755.0,2.0,0_1,26341_0,2528
522,522.0,81822.0,2.0,0_1,25861_0,2528
523,523.0,70889.0,2.0,0_1,25611_0,2522
524,524.0,75530.0,2.0,0_1,25941_0,2598
525,525.0,77242.0,2.0,0_1,26051_0,2568
526,526.0,83343.0,2.0,0_1,26621_0,2621
527,527.0,69583.0,2.0,0_1,26691_0,2625
528,528.0,84777.0,2.0,0_1,26771_0,2670
529,529.0,77316.0,2.0,0_1,26571_0,2628
530,530.0,76383.0,2.0,0_1,26271_0,2615
531,531.0,81427.0,2.0,0_1,26211_0,2597
532,532.0,72545.0,2.0,0_1,26061_0,2563
533,533.0,67479.0,2.0,0_1,25761_0,2526
534,534.0,66636.0,2.0,0_1,24911_0,2463
535,535.0,70072.0,2.0,0_1,24671_0,2415
536,536.0,67576.0,2.0,0_1,24741_0,2400
537,537.0,77867.0,2.0,0_1,23941_0,2376
538,538.0,68264.0,2.0,0_1,23311_0,2337
539,539.0,63140.0,2.0,0_1,23581_0,2378
540,540.0,74572.0,2.0,0_1,24661_0,2462
541,541.0,85335.0,2.0,0_1,25761_0,2532
542,542.0,81294.0,2.0,0_1,26501_0,2598
543,543.0,83954.0,2.0,0_1,26791_0,2638
544,544.0,78638.0,2.0,0_1,27071_0,2687
545,545.0,81669.0,2.0,0_1,26961_0,2701
546,546.0,88471.0,2.0,0_1,27041_0,2714
547,547.0,87409.0,2.0,0_1,27101_0,2750
548,548.0,75455.0,2.0,0_1,26891_0,2767
549,549.0,71666.0,2.0,0_1,26431_0,2700
550,550.0,69752.0,2.0,0_1,25991_0,2665
551,551.0,71881.0,2.0,0_1,25961_0,2616
552,552.0,78924.0,2.0,0_1,26171_0,2608
553,553.0,76800.0,2.0,0_1,26171_0,2611
554,554.0,79800.0,2.0,0_1,26241_0,2629
555,555.0,79478.0,2.0,0_1,26391_0,2645
556,556.0,82009.0,2.0,0_1,25661_0,2599
557,557.0,72405.0,2.0,0_1,25191_0,2582
558,558.0,82530.0,2.0,0_1,25761_0,2573
559,559.0,78087.0,2.0,0_1,25781_0,2592
560,560.0,75737.0,2.0,0_1,26171_0,2635
561,561.0,86361.0,2.0,0_1,25821_0,2605
562,562.0,61039.0,2.0,0_1,26251_0,2617
563,563.0,72867.0,2.0,0_1,25821_0,2581
564,564.0,76021.0,2.0,0_1,26051_0,2550
565,565.0,78446.0,2.0,0_1,26081_0,2562
566,566.0,70307.0,2.0,0_1,26011_0,2589
567,567.0,70620.0,2.0,0_1,25531_0,2484
568,568.0,75505.0,2.0,0_1,25601_0,2523
569,569.0,83360.0,2.0,0_1,25791_0,2533
570,570.0,90805.0,2.0,0_1,26021_0,2599
571,571.0,84886.0,2.0,0_1,26261_0,2690
572,572.0,84762.0,2.0,0_1,26181_0,2699
573,573.0,73123.0,2.0,0_1,26381_0,2718
574,574.0,78771.0,2.0,0_1,26651_0,2662
575,575.0,87945.0,2.0,0_1,27051_0,2689
576,576.0,76031.0,2.0,0_1,27421_0,2704
577,577.0,79846.0,2.0,0_1,27141_0,2670
578,578.0,73454.0,2.0,0_1,26721_0,2658
579,579.0,75355.0,2.0,0_1,27271_0,2696
580,580.0,83343.0,2.0,0_1,27001_0,2717
581,581.0,71224.0,2.0,0_1,26231_0,2689
582,582.0,75686.0,2.0,0_1,25911_0,2647
583,583.0,76180.0,2.0,0_1,25371_0,2573
584,584.0,69183.0,2.0,0_1,25271_0,2613
585,585.0,78455.0,2.0,0_1,24481_0,2623
586,586.0,78518.0,2.0,0_1,24831_0,2692
587,587.0,93904.0,2.0,0_1,25851_0,2734
588,588.0,82925.0,2.0,0_1,26921_0,2743
589,589.0,85991.0,2.0,0_1,27781_0,2804
590,590.0,92474.0,2.0,0_1,28001_0,2775
591,591.0,84142.0,2.0,0_1,28221_0,2758
592,592.0,86807.0,2.0,0_1,27791_0,2793
593,593.0,68886.0,2.0,0_1,27891_0,2744
594,594.0,76540.0,2.0,0_1,28231_0,2679
595,595.0,86471.0,2.0,0_1,28471_0,2730
596,596.0,92898.0,2.0,0_1,28351_0,2680
597,597.0,75653.0,2.0,0_1,28091_0,2733
598,598.0,83164.0,2.0,0_1,28641_0,2753
599,599.0,93107.0,2.0,0_1,28911_0,2821
600,600.0,96575.0,2.0,0_1,29741_0,2904
601,601.0,95973.0,2.0,0_1,30181_0,2959
602,602.0,85416.0,2.0,0_1,30261_0,2916
603,603.0,81134.0,2.0,0_1,30241_0,2924
604,604.0,89950.0,2.0,0_1,29731_0,2880
605,605.0,91611.0,2.0,0_1,29651_0,2872
606,606.0,83335.0,2.0,0_1,29201_0,2864
607,607.0,72858.0,2.0,0_1,29601_0,2945
608,608.0,90758.0,2.0,0_1,29891_0,3048
609,609.0,101207.0,2.0,0_1,29591_0,3037
610,610.0,87365.0,2.0,0_1,28781_0,2976
611,611.0,65267.0,2.0,0_1,29101_0,2953
612,612.0,80711.0,2.0,0_1,29291_0,2875
613,613.0,80364.0,2.0,0_1,28741_0,2796
614,614.0,81819.0,2.0,0_1,28241_0,2856
615,615.0,82771.0,2.0,0_1,27281_0,2841
616,616.0,73094.0,2.0,0_1,26721_0,2781
617,617.0,76942.0,2.0,0_1,27261_0,2802
618,618.0,91545.0,2.0,0_1,27241_0,2768
619,619.0,78325.0,2.0,0_1,27181_0,2747
620,620.0,83125.0,2.0,0_1,27721_0,2764
621,621.0,89198.0,2.0,0_1,28211_0,2754
622,622.0,84288.0,2.0,0_1,28351_0,2763
623,623.0,88421.0,2.0,0_1,28351_0,2799
624,624.0,86283.0,2.0,0_1,28851_0,2799
625,625.0,84858.0,2.0,0_1,28871_0,2755
626,626.0,74198.0,2.0,0_1,29081_0,2794
627,627.0,77069.0,2.0,0_1,28631_0,2793
628,628.0,78762.0,2.0,0_1,28291_0,2811
629,629.0,83286.0,2.0,0_1,28301_0,2824
630,630.0,90395.0,2.0,0_1,27871_0,2758
631,631.0,75125.0,2.0,0_1,26931_0,2649
632,632.0,70813.0,2.0,0_1,26251_0,2609
633,633.0,72607.0,2.0,0_1,26291_0,2618
634,634.0,78484.0,2.0,0_1,26381_0,2630
635,635.0,84518.0,2.0,0_1,26391_0,2617
636,636.0,86539.0,2.0,0_1,26831_0,2632
637,637.0,75682.0,2.0,0_1,27071_0,2630
638,638.0,73582.0,2.0,0_1,27391_0,2643
639,639.0,81294.0,2.0,0_1,27731_0,2651
640,640.0,82024.0,2.0,0_1,27631_0,2640
641,641.0,74030.0,2.0,0_1,27321_0,2637
642,642.0,74857.0,2.0,0_1,27331_0,2669
643,643.0,91733.0,2.0,0_1,26871_0,2709
644,644.0,69371.0,2.0,0_1,26141_0,2636
645,645.0,70480.0,2.0,0_1,25881_0,2606
646,646.0,75841.0,2.0,0_1,25351_0,2555
647,647.0,73945.0,2.0,0_1,25261_0,2554
648,648.0,71954.0,2.0,0_1,25341_0,2471
649,649.0,74053.0,2.0,0_1,25221_0,2491
650,650.0,72271.0,2.0,0_1,25431_0,2515
651,651.0,77442.0,2.0,0_1,25691_0,2521
652,652.0,84930.0,2.0,0_1,26001_0,2562
653,653.0,88116.0,2.0,0_1,26341_0,2559
654,654.0,79462.0,2.0,0_1,26981_0,2620
655,655.0,97394.0,2.0,0_1,27481_0,2627
656,656.0,78349.0,2.0,0_1,28131_0,2700
657,657.0,86950.0,2.0,0_1,28871_0,2734
658,658.0,79749.0,2.0,0_1,29151_0,2780
659,659.0,84584.0,2.0,0_1,29341_0,2864
660,660.0,89733.0,2.0,0_1,29971_0,2914
661,661.0,91423.0,2.0,0_1,29681_0,2938
662,662.0,84448.0,2.0,0_1,29311_0,2879
663,663.0,80198.0,2.0,0_1,28441_0,2829
664,664.0,101954.0,2.0,0_1,27871_0,2786
665,665.0,82772.0,2.0,0_1,28951_0,2870
666,666.0,98225.0,2.0,0_1,29551_0,2913
667,667.0,80951.0,2.0,0_1,29291_0,2887
668,668.0,84606.0,2.0,0_1,29191_0,2887
669,669.0,94383.0,2.0,0_1,30351_0,2943
670,670.0,95832.0,2.0,0_1,30781_0,2982
671,671.0,92743.0,2.0,0_1,30091_0,2945
672,672.0,85143.0,2.0,0_1,29731_0,2959
673,673.0,86708.0,2.0,0_1,29881_0,2950
674,674.0,71178.0,2.0,0_1,29191_0,2964
675,675.0,76332.0,2.0,0_1,29771_0,2974
676,676.0,88144.0,2.0,0_1,29251_0,2950
677,677.0,79570.0,2.0,0_1,29241_0,2937
678,678.0,87613.0,2.0,0_1,29221_0,2933
679,679.0,93948.0,2.0,0_1,29721_0,2951
680,680.0,78207.0,2.0,0_1,29391_0,2816
681,681.0,71658.0,2.0,0_1,28631_0,2718
682,682.0,78901.0,2.0,0_1,27951_0,2690
683,683.0,86320.0,2.0,0_1,27821_0,2798
684,684.0,89959.0,2.0,0_1,27661_0,2797
685,685.0,84079.0,2.0,0_1,26761_0,2742
686,686.0,65498.0,2.0,0_1,26561_0,2755
687,687.0,81377.0,2.0,0_1,26521_0,2760
688,688.0,80516.0,2.0,0_1,26531_0,2775
689,689.0,91329.0,2.0,0_1,26801_0,2803
690,690.0,79974.0,2.0,0_1,26631_0,2788
691,691.0,76719.0,2.0,0_1,26611_0,2798
692,692.0,73538.0,2.0,0_1,26451_0,2682
693,693.0,62279.0,2.0,0_1,25821_0,2648
694,694.0,77894.0,2.0,0_1,25611_0,2615
695,695.0,83756.0,2.0,0_1,25061_0,2535
696,696.0,63514.0,2.0,0_1,25441_0,2572
697,697.0,84482.0,2.0,0_1,25401_0,2569
698,698.0,82713.0,2.0,0_1,25931_0,2617
699,699.0,80823.0,2.0,0_1,26211_0,2661
700,700.0,80542.0,2.0,0_1,26331_0,2688
701,701.0,75740.0,2.0,0_1,26161_0,2742
702,702.0,86680.0,2.0,0_1,26081_0,2721
703,703.0,74718.0,2.0,0_1,26181_0,2715
704,704.0,67563.0,2.0,0_1,26391_0,2734
705,705.0,86514.0,2.0,0_1,26631_0,2702
706,706.0,78481.0,2.0,0_1,27501_0,2711
707,707.0,97398.0,2.0,0_1,28211_0,2779
708,708.0,92423.0,2.0,0_1,28671_0,2802
709,709.0,83157.0,2.0,0_1,28231_0,2786
710,710.0,75879.0,2.0,0_1,28611_0,2740
711,711.0,84561.0,2.0,0_1,28961_0,2728
712,712.0,82925.0,2.0,0_1,29191_0,2757
713,713.0,86334.0,2.0,0_1,29091_0,2762
714,714.0,82716.0,2.0,0_1,28591_0,2789
715,715.0,85767.0,2.0,0_1,28581_0,2858
716,716.0,91954.0,2.0,0_1,28351_0,2873
717,717.0,80531.0,2.0,0_1,28051_0,2868
718,718.0,79686.0,2.0,0_1,28301_0,2818
719,719.0,80229.0,2.0,0_1,27551_0,2753
720,720.0,83825.0,2.0,0_1,27751_0,2818
721,721.0,93267.0,2.0,0_1,27431_0,2820
722,722.0,85398.0,2.0,0_1,27811_0,2837
723,723.0,89680.0,2.0,0_1,27771_0,2826
724,724.0,78312.0,2.0,0_1,27941_0,2870
725,725.0,91772.0,2.0,0_1,28161_0,2865
726,726.0,81502.0,2.0,0_1,28341_0,2878
727,727.0,87279.0,2.0,0_1,29011_0,2899
728,728.0,84141.0,2.0,0_1,28921_0,2885
729,729.0,78805.0,2.0,0_1,28611_0,2877
730,730.0,86551.0,2.0,0_1,28191_0,2850
731,731.0,89759.0,2.0,0_1,28301_0,2862
732,732.0,84254.0,2.0,0_1,28881_0,2877
733,733.0,81299.0,2.0,0_1,29411_0,2862
734,734.0,82711.0,2.0,0_1,29341_0,2770
735,735.0,70755.0,2.0,0_1,28531_0,2690
736,736.0,74055.0,2.0,0_1,28501_0,2694
737,737.0,87141.0,2.0,0_1,28121_0,2743
738,738.0,84076.0,2.0,0_1,27631_0,2766
739,739.0,83590.0,2.0,0_1,27691_0,2776
740,740.0,88608.0,2.0,0_1,28071_0,2794
741,741.0,79719.0,2.0,0_1,27921_0,2798
742,742.0,80337.0,2.0,0_1,27341_0,2774
743,743.0,81398.0,2.0,0_1,27601_0,2783
744,744.0,92700.0,2.0,0_1,27291_0,2755
745,745.0,70368.0,2.0,0_1,26711_0,2666
746,746.0,74635.0,2.0,0_1,27021_0,2642
747,747.0,77828.0,2.0,0_1,27151_0,2626
748,748.0,84569.0,2.0,0_1,27661_0,2694
749,749.0,84292.0,2.0,0_1,27731_0,2724
750,750.0,89365.0,2.0,0_1,27911_0,2759
751,751.0,83910.0,2.0,0_1,28331_0,2756
752,752.0,82866.0,2.0,0_1,28151_0,2771
753,753.0,84835.0,2.0,0_1,28371_0,2794
754,754.0,87652.0,2.0,0_1,28101_0,2842
755,755.0,84497.0,2.0,0_1,28191_0,2823
756,756.0,79103.0,2.0,0_1,27861_0,2793
757,757.0,90547.0,2.0,0_1,27991_0,2794
758,758.0,79828.0,2.0,0_1,28211_0,2765
759,759.0,84222.0,2.0,0_1,28271_0,2833
760,760.0,87119.0,2.0,0_1,28661_0,2847
761,761.0,93463.0,2.0,0_1,28931_0,2859
762,762.0,81474.0,2.0,0_1,29211_0,2866
763,763.0,91173.0,2.0,0_1,29151_0,2891
764,764.0,87282.0,2.0,0_1,29101_0,2921
765,765.0,86703.0,2.0,0_1,29091_0,2919
766,766.0,81173.0,2.0,0_1,29021_0,2941
767,767.0,90359.0,2.0,0_1,28351_0,2901
768,768.0,83569.0,2.0,0_1,28151_0,2897
769,769.0,93122.0,2.0,0_1,28091_0,2901
770,770.0,86793.0,2.0,0_1,28861_0,2917
771,771.0,90630.0,2.0,0_1,29311_0,2908
772,772.0,87988.0,2.0,0_1,29641_0,2879
773,773.0,86098.0,2.0,0_1,29481_0,2897
774,774.0,72238.0,2.0,0_1,29441_0,2903
775,775.0,87781.0,2.0,0_1,29431_0,2879
776,776.0,87582.0,2.0,0_1,29571_0,2863
777,777.0,83376.0,2.0,0_1,29561_0,2869
778,778.0,88546.0,2.0,0_1,29501_0,2887
779,779.0,80217.0,2.0,0_1,29851_0,2892
780,780.0,83003.0,2.0,0_1,29431_0,2899
781,781.0,83818.0,2.0,0_1,29261_0,2845
782,782.0,84978.0,2.0,0_1,29101_0,2836
783,783.0,81965.0,2.0,0_1,29141_0,2843
784,784.0,88144.0,2.0,0_1,28561_0,2789
785,785.0,82481.0,2.0,0_1,28081_0,2779
786,786.0,69047.0,2.0,0_1,28171_0,2765
787,787.0,84217.0,2.0,0_1,27981_0,2719
788,788.0,84419.0,2.0,0_1,27791_0,2660
789,789.0,86452.0,2.0,0_1,27001_0,2602
790,790.0,72550.0,2.0,0_1,27191_0,2645
791,791.0,81638.0,2.0,0_1,27181_0,2659
792,792.0,76876.0,2.0,0_1,27061_0,2678
793,793.0,82798.0,2.0,0_1,26891_0,2742
794,794.0,90754.0,2.0,0_1,26631_0,2758
795,795.0,82675.0,2.0,0_1,26801_0,2814
796,796.0,90151.0,2.0,0_1,26861_0,2830
797,797.0,81520.0,2.0,0_1,27891_0,2879
798,798.0,87649.0,2.0,0_1,28041_0,2833
799,799.0,71121.0,2.0,0_1,28081_0,2847
800,800.0,86715.0,2.0,0_1,27991_0,2900
801,801.0,88723.0,2.0,0_1,27611_0,2857
802,802.0,76398.0,2.0,0_1,27421_0,2878
803,803.0,83006.0,2.0,0_1,27311_0,2869
804,804.0,85543.0,2.0,0_1,27171_0,2867
805,805.0,90770.0,2.0,0_1,27661_0,2879
806,806.0,88642.0,2.0,0_1,27251_0,2876
807,807.0,73948.0,2.0,0_1,27501_0,2856
808,808.0,92006.0,2.0,0_1,27761_0,2889
809,809.0,93563.0,2.0,0_1,28251_0,2887
810,810.0,87267.0,2.0,0_1,27641_0,2890
811,811.0,80960.0,2.0,0_1,27361_0,2871
812,812.0,73277.0,2.0,0_1,27241_0,2786
813,813.0,75449.0,2.0,0_1,26871_0,2701
814,814.0,71312.0,2.0,0_1,27241_0,2688
815,815.0,71985.0,2.0,0_1,27711_0,2653
816,816.0,76908.0,2.0,0_1,27591_0,2635
817,817.0,77415.0,2.0,0_1,27711_0,2608
818,818.0,88665.0,2.0,0_1,27481_0,2636
819,819.0,89401.0,2.0,0_1,27701_0,2636
820,820.0,75764.0,2.0,0_1,27261_0,2637
821,821.0,76599.0,2.0,0_1,26841_0,2629
822,822.0,80922.0,2.0,0_1,27391_0,2667
823,823.0,82703.0,2.0,0_1,27351_0,2688
824,824.0,76487.0,2.0,0_1,26851_0,2660
825,825.0,82923.0,2.0,0_1,27191_0,2678
826,826.0,79196.0,2.0,0_1,27541_0,2688
827,827.0,75196.0,2.0,0_1,27541_0,2672
828,828.0,88631.0,2.0,0_1,27101_0,2652
829,829.0,78647.0,2.0,0_1,27321_0,2654
830,830.0,90844.0,2.0,0_1,27271_0,2623
831,831.0,82191.0,2.0,0_1,27641_0,2699
832,832.0,82133.0,2.0,0_1,27961_0,2716
833,833.0,71724.0,2.0,0_1,28041_0,2733
834,834.0,83699.0,2.0,0_1,26911_0,2711
835,835.0,77830.0,2.0,0_1,27601_0,2728
836,836.0,91119.0,2.0,0_1,27421_0,2715
837,837.0,85730.0,2.0,0_1,27401_0,2758
838,838.0,89757.0,2.0,0_1,27801_0,2831
839,839.0,90399.0,2.0,0_1,28191_0,2826
840,840.0,75091.0,2.0,0_1,28601_0,2855
841,841.0,92622.0,2.0,0_1,28911_0,2871
842,842.0,93129.0,2.0,0_1,29571_0,2885
843,843.0,90692.0,2.0,0_1,30011_0,2962
844,844.0,95505.0,2.0,0_1,30411_0,3003
845,845.0,91259.0,2.0,0_1,30221_0,2994
846,846.0,82574.0,2.0,0_1,30371_0,3065
847,847.0,97941.0,2.0,0_1,30431_0,3091
848,848.0,84657.0,2.0,0_1,30151_0,3030
849,849.0,74125.0,2.0,0_1,29761_0,2960
850,850.0,86578.0,2.0,0_1,29671_0,2907
851,851.0,82503.0,2.0,0_1,29041_0,2811
852,852.0,82855.0,2.0,0_1,28581_0,2785
853,853.0,77968.0,2.0,0_1,28151_0,2751
854,854.0,86234.0,2.0,0_1,27781_0,2728
855,855.0,91973.0,2.0,0_1,27661_0,2720
856,856.0,83602.0,2.0,0_1,27871_0,2757
857,857.0,94640.0,2.0,0_1,28411_0,2824
858,858.0,88897.0,2.0,0_1,28351_0,2874
859,859.0,86255.0,2.0,0_1,28471_0,2934
860,860.0,76767.0,2.0,0_1,28501_0,2933
861,861.0,70796.0,2.0,0_1,28421_0,2937
862,862.0,86339.0,2.0,0_1,28501_0,2944
863,863.0,81209.0,2.0,0_1,28491_0,2887
864,864.0,76742.0,2.0,0_1,27901_0,2854
865,865.0,84162.0,2.0,0_1,28241_0,2801
866,866.0,91591.0,2.0,0_1,28521_0,2808
867,867.0,86703.0,2.0,0_1,28711_0,2829
868,868.0,96379.0,2.0,0_1,28941_0,2884
869,869.0,83195.0,2.0,0_1,28941_0,2903
870,870.0,93892.0,2.0,0_1,28901_0,2914
871,871.0,88753.0,2.0,0_1,29151_0,2989
872,872.0,90846.0,2.0,0_1,29321_0,2999
873,873.0,96748.0,2.0,0_1,29491_0,3066
874,874.0,98426.0,2.0,0_1,29871_0,3041
875,875.0,91537.0,2.0,0_1,30161_0,3006
876,876.0,86454.0,2.0,0_1,30141_0,3053
877,877.0,100336.0,2.0,0_1,30641_0,3105
878,878.0,93816.0,2.0,0_1,30931_0,3141
879,879.0,93101.0,2.0,0_1,30711_0,3119
880,880.0,87779.0,2.0,0_1,30301_0,3086
881,881.0,77354.0,2.0,0_1,29821_0,3074
882,882.0,81485.0,2.0,0_1,29601_0,3049
883,883.0,73701.0,2.0,0_1,29101_0,2994
884,884.0,84559.0,2.0,0_1,29441_0,3001
885,885.0,90362.0,2.0,0_1,29461_0,3048
886,886.0,91509.0,2.0,0_1,28901_0,2964
887,887.0,71953.0,2.0,0_1,28741_0,2953
888,888.0,80001.0,2.0,0_1,28321_0,2913
889,889.0,85241.0,2.0,0_1,28181_0,2888
890,890.0,87431.0,2.0,0_1,27771_0,2827
891,891.0,90128.0,2.0,0_1,28101_0,2829
892,892.0,83990.0,2.0,0_1,28521_0,2893
893,893.0,94171.0,2.0,0_1,29001_0,2945
894,894.0,99268.0,2.0,0_1,29371_0,2955
895,895.0,89025.0,2.0,0_1,30001_0,2967
896,896.0,92662.0,2.0,0_1,29941_0,2952
897,897.0,90152.0,2.0,0_1,29921_0,2962
898,898.0,85442.0,2.0,0_1,30241_0,2941
899,899.0,97141.0,2.0,0_1,30501_0,2960
900,900.0,85600.0,2.0,0_1,30861_0,2978
901,901.0,85993.0,2.0,0_1,30381_0,2951
902,902.0,72481.0,2.0,0_1,30281_0,2885
903,903.0,77794.0,2.0,0_1,30041_0,2933
904,904.0,89311.0,2.0,0_1,30061_0,2925
905,905.0,94054.0,2.0,0_1,30061_0,2913
906,906.0,91512.0,2.0,0_1,30291_0,2931
907,907.0,92909.0,2.0,0_1,29511_0,2888
908,908.0,82899.0,2.0,0_1,28851_0,2804
909,909.0,82351.0,2.0,0_1,29191_0,2860
910,910.0,89052.0,2.0,0_1,29561_0,2843
911,911.0,83841.0,2.0,0_1,28811_0,2885
912,912.0,77168.0,2.0,0_1,28391_0,2814
913,913.0,59960.0,2.0,0_1,27711_0,2786
914,914.0,79835.0,2.0,0_1,27971_0,2752
915,915.0,89608.0,2.0,0_1,27651_0,2736
916,916.0,89948.0,2.0,0_1,27941_0,2739
917,917.0,90088.0,2.0,0_1,28141_0,2766
918,918.0,84036.0,2.0,0_1,28171_0,2745
919,919.0,76010.0,2.0,0_1,28181_0,2767
920,920.0,90713.0,2.0,0_1,28391_0,2771
921,921.0,79758.0,2.0,0_1,28181_0,2722
922,922.0,81620.0,2.0,0_1,27591_0,2685
923,923.0,75400.0,2.0,0_1,27811_0,2741
924,924.0,82784.0,2.0,0_1,28071_0,2772
925,925.0,87294.0,2.0,0_1,28371_0,2749
926,926.0,76765.0,2.0,0_1,28891_0,2759
927,927.0,87489.0,2.0,0_1,28611_0,2782
928,928.0,78753.0,2.0,0_1,28031_0,2823
929,929.0,83299.0,2.0,0_1,27951_0,2823
930,930.0,85343.0,2.0,0_1,27751_0,2803
931,931.0,84264.0,2.0,0_1,28161_0,2823
932,932.0,94290.0,2.0,0_1,29101_0,2828
933,933.0,89118.0,2.0,0_1,28691_0,2888
934,934.0,86225.0,2.0,0_1,28381_0,2893
935,935.0,87401.0,2.0,0_1,28111_0,2866
936,936.0,78566.0,2.0,0_1,28231_0,2826
937,937.0,71276.0,2.0,0_1,27771_0,2868
938,938.0,85538.0,2.0,0_1,27691_0,2863
939,939.0,87828.0,2.0,0_1,27631_0,2792
940,940.0,80022.0,2.0,0_1,27621_0,2820
941,941.0,82755.0,2.0,0_1,27661_0,2771
942,942.0,83739.0,2.0,0_1,28001_0,2780
943,943.0,89367.0,2.0,0_1,28501_0,2845
944,944.0,88252.0,2.0,0_1,28861_0,2861
945,945.0,89519.0,2.0,0_1,29491_0,2869
946,946.0,81210.0,2.0,0_1,29571_0,2843
947,947.0,78179.0,2.0,0_1,29361_0,2904
948,948.0,86418.0,2.0,0_1,29201_0,2855
949,949.0,85553.0,2.0,0_1,29321_0,2901
950,950.0,98425.0,2.0,0_1,29491_0,2946
951,951.0,96791.0,2.0,0_1,29641_0,2971
952,952.0,92299.0,2.0,0_1,29751_0,3005
953,953.0,88647.0,2.0,0_1,30131_0,3036
954,954.0,86096.0,2.0,0_1,29351_0,2982
955,955.0,79758.0,2.0,0_1,28981_0,2931
956,956.0,81659.0,2.0,0_1,29261_0,2974
957,957.0,88416.0,2.0,0_1,29211_0,3044
958,958.0,91152.0,2.0,0_1,29311_0,3018
959,959.0,80240.0,2.0,0_1,28951_0,3041
960,960.0,87219.0,2.0,0_1,28861_0,3051
961,961.0,92418.0,2.0,0_1,29021_0,3051
962,962.0,90882.0,2.0,0_1,29411_0,3035
963,963.0,93834.0,2.0,0_1,29341_0,3058
964,964.0,88793.0,2.0,0_1,29641_0,3062
965,965.0,92161.0,2.0,0_1,29901_0,3066
966,966.0,94638.0,2.0,0_1,29761_0,3066
967,967.0,78907.0,2.0,0_1,29661_0,3050
968,968.0,83429.0,2.0,0_1,29431_0,2967
969,969.0,87691.0,2.0,0_1,29201_0,2987
970,970.0,86139.0,2.0,0_1,29451_0,2994
971,971.0,89930.0,2.0,0_1,29741_0,2988
972,972.0,89982.0,2.0,0_1,29601_0,3005
973,973.0,80918.0,2.0,0_1,29041_0,2965
974,974.0,78005.0,2.0,0_1,28451_0,2898
975,975.0,75838.0,2.0,0_1,28691_0,2917
976,976.0,81896.0,2.0,0_1,29201_0,2921
977,977.0,87694.0,2.0,0_1,28901_0,2855
978,978.0,74105.0,2.0,0_1,28881_0,2795
979,979.0,86486.0,2.0,0_1,29111_0,2844
980,980.0,104917.0,2.0,0_1,29121_0,2948
981,981.0,97616.0,2.0,0_1,29691_0,3009
982,982.0,93872.0,2.0,0_1,29821_0,2958
983,983.0,84497.0,2.0,0_1,29941_0,2951
984,984.0,77552.0,2.0,0_1,29471_0,2914
985,985.0,82790.0,2.0,0_1,29251_0,2926
986,986.0,90410.0,2.0,0_1,28851_0,2885
987,987.0,84409.0,2.0,0_1,28751_0,2827
988,988.0,79174.0,2.0,0_1,28411_0,2857
989,989.0,91647.0,2.0,0_1,28741_0,2872
990,990.0,90649.0,2.0,0_1,29081_0,2888
991,991.0,97555.0,2.0,0_1,30091_0,2915
992,992.0,95730.0,2.0,0_1,30351_0,2944
993,993.0,91643.0,2.0,0_1,29871_0,2946
994,994.0,70864.0,2.0,0_1,30011_0,2957
995,995.0,89423.0,2.0,0_1,30171_0,2959
996,996.0,87987.0,2.0,0_1,29871_0,2910
997,997.0,78609.0,2.0,0_1,29941_0,2875
998,998.0,93458.0,2.0,0_1,29651_0,2814
999,999.0,81250.0,2.0,0_1,28671_0,2819
