Step,Rule,Popularity
0,0_1,82
0,1_0,89
1,0_1,96
1,1_0,114
2,0_1,87
2,1_0,103
3,0_1,87
3,1_0,98
4,0_1,90
4,1_0,95
5,0_1,85
5,1_0,86
6,0_1,86
6,1_0,85
7,0_1,90
7,1_0,85
8,0_1,89
8,1_0,84
9,0_1,92
9,1_0,84
10,0_1,98
10,1_0,83
11,0_1,97
11,1_0,82
12,0_1,103
12,1_0,84
13,0_1,100
13,1_0,89
14,0_1,112
14,1_0,93
15,0_1,115
15,1_0,99
16,0_1,127
16,1_0,105
17,0_1,139
17,1_0,121
18,0_1,141
18,1_0,126
19,0_1,143
19,1_0,139
20,0_1,142
20,1_0,145
21,0_1,142
21,1_0,144
22,0_1,150
22,1_0,148
23,0_1,164
23,1_0,158
24,0_1,172
24,1_0,169
25,0_1,165
25,1_0,164
26,0_1,164
26,1_0,172
27,0_1,169
27,1_0,169
28,0_1,176
28,1_0,179
29,0_1,180
29,1_0,180
30,0_1,185
30,1_0,187
31,0_1,192
31,1_0,191
32,0_1,199
32,1_0,200
33,0_1,206
33,1_0,215
34,0_1,213
34,1_0,218
35,0_1,230
35,1_0,230
36,0_1,232
36,1_0,238
37,0_1,233
37,1_0,249
38,0_1,238
38,1_0,254
39,0_1,244
39,1_0,255
40,0_1,263
40,1_0,257
41,0_1,265
41,1_0,261
42,0_1,262
42,1_0,265
43,0_1,275
43,1_0,271
44,0_1,288
44,1_0,271
45,0_1,296
45,1_0,279
46,0_1,313
46,1_0,284
47,0_1,317
47,1_0,288
48,0_1,319
48,1_0,301
49,0_1,329
49,1_0,312
50,0_1,339
50,1_0,317
51,0_1,353
51,1_0,311
52,0_1,344
52,1_0,316
53,0_1,344
53,1_0,317
54,0_1,340
54,1_0,326
55,0_1,347
55,1_0,337
56,0_1,356
56,1_0,340
57,0_1,359
57,1_0,340
58,0_1,362
58,1_0,344
59,0_1,381
59,1_0,349
60,0_1,393
60,1_0,365
61,0_1,405
61,1_0,377
62,0_1,419
62,1_0,392
63,0_1,418
63,1_0,403
64,0_1,432
64,1_0,405
65,0_1,441
65,1_0,413
66,0_1,453
66,1_0,419
67,0_1,433
67,1_0,418
68,0_1,424
68,1_0,416
69,0_1,430
69,1_0,418
70,0_1,430
70,1_0,413
71,0_1,438
71,1_0,413
72,0_1,447
72,1_0,425
73,0_1,455
73,1_0,432
74,0_1,466
74,1_0,433
75,0_1,473
75,1_0,446
76,0_1,479
76,1_0,455
77,0_1,488
77,1_0,458
78,0_1,500
78,1_0,475
79,0_1,512
79,1_0,495
80,0_1,526
80,1_0,493
81,0_1,523
81,1_0,516
82,0_1,519
82,1_0,516
83,0_1,526
83,1_0,518
84,0_1,532
84,1_0,516
85,0_1,542
85,1_0,520
86,0_1,545
86,1_0,516
87,0_1,546
87,1_0,519
88,0_1,552
88,1_0,525
89,0_1,559
89,1_0,527
90,0_1,553
90,1_0,537
91,0_1,545
91,1_0,544
92,0_1,550
92,1_0,540
93,0_1,566
93,1_0,556
94,0_1,562
94,1_0,554
95,0_1,571
95,1_0,554
96,0_1,586
96,1_0,571
97,0_1,593
97,1_0,584
98,0_1,603
98,1_0,592
99,0_1,604
99,1_0,619
100,0_1,620
100,1_0,617
101,0_1,640
101,1_0,625
102,0_1,640
102,1_0,630
103,0_1,648
103,1_0,630
104,0_1,648
104,1_0,624
105,0_1,654
105,1_0,625
106,0_1,642
106,1_0,634
107,0_1,658
107,1_0,669
108,0_1,644
108,1_0,672
109,0_1,655
109,1_0,660
110,0_1,655
110,1_0,654
111,0_1,665
111,1_0,659
112,0_1,658
112,1_0,660
113,0_1,662
113,1_0,655
114,0_1,656
114,1_0,647
115,0_1,656
115,1_0,639
116,0_1,653
116,1_0,642
117,0_1,674
117,1_0,643
118,0_1,699
118,1_0,657
119,0_1,716
119,1_0,679
120,0_1,734
120,1_0,715
121,0_1,747
121,1_0,737
122,0_1,743
122,1_0,743
123,0_1,756
123,1_0,741
124,0_1,754
124,1_0,762
125,0_1,779
125,1_0,777
126,0_1,788
126,1_0,789
127,0_1,800
127,1_0,776
128,0_1,795
128,1_0,770
129,0_1,789
129,1_0,800
130,0_1,802
130,1_0,801
131,0_1,807
131,1_0,793
132,0_1,808
132,1_0,796
133,0_1,829
133,1_0,807
134,0_1,821
134,1_0,812
135,0_1,819
135,1_0,811
136,0_1,836
136,1_0,814
137,0_1,842
137,1_0,834
138,0_1,827
138,1_0,848
139,0_1,852
139,1_0,859
140,0_1,858
140,1_0,862
141,0_1,865
141,1_0,870
142,0_1,848
142,1_0,883
143,0_1,852
143,1_0,866
144,0_1,862
144,1_0,849
145,0_1,869
145,1_0,847
146,0_1,899
146,1_0,863
147,0_1,902
147,1_0,879
148,0_1,907
148,1_0,891
149,0_1,902
149,1_0,891
150,0_1,911
150,1_0,883
151,0_1,925
151,1_0,899
152,0_1,934
152,1_0,888
153,0_1,943
153,1_0,911
154,0_1,972
154,1_0,949
155,0_1,957
155,1_0,958
156,0_1,986
156,1_0,970
157,0_1,997
157,1_0,977
158,0_1,1009
158,1_0,985
159,0_1,1022
159,1_0,995
160,0_1,1032
160,1_0,988
161,0_1,1036
161,1_0,981
162,0_1,1012
162,1_0,976
163,0_1,1012
163,1_0,987
164,0_1,1014
164,1_0,994
165,0_1,1010
165,1_0,992
166,0_1,1014
166,1_0,997
167,0_1,1024
167,1_0,1023
168,0_1,1029
168,1_0,1034
169,0_1,1041
169,1_0,1048
170,0_1,1055
170,1_0,1068
171,0_1,1071
171,1_0,1082
172,0_1,1079
172,1_0,1088
173,0_1,1109
173,1_0,1081
174,0_1,1087
174,1_0,1088
175,0_1,1070
175,1_0,1095
176,0_1,1079
176,1_0,1088
177,0_1,1082
177,1_0,1101
178,0_1,1107
178,1_0,1144
179,0_1,1131
179,1_0,1146
180,0_1,1135
180,1_0,1127
181,0_1,1135
181,1_0,1146
182,0_1,1147
182,1_0,1147
183,0_1,1144
183,1_0,1136
184,0_1,1168
184,1_0,1150
185,0_1,1181
185,1_0,1180
186,0_1,1202
186,1_0,1166
187,0_1,1225
187,1_0,1206
188,0_1,1226
188,1_0,1194
189,0_1,1219
189,1_0,1204
190,0_1,1222
190,1_0,1210
191,0_1,1199
191,1_0,1226
192,0_1,1206
192,1_0,1229
193,0_1,1226
193,1_0,1259
194,0_1,1238
194,1_0,1252
195,0_1,1234
195,1_0,1242
196,0_1,1269
196,1_0,1251
197,0_1,1285
197,1_0,1259
198,0_1,1310
198,1_0,1257
199,0_1,1311
199,1_0,1273
200,0_1,1317
200,1_0,1280
201,0_1,1344
201,1_0,1315
202,0_1,1354
202,1_0,1337
203,0_1,1351
203,1_0,1337
204,0_1,1348
204,1_0,1333
205,0_1,1361
205,1_0,1332
206,0_1,1338
206,1_0,1326
207,0_1,1308
207,1_0,1308
208,0_1,1316
208,1_0,1294
209,0_1,1311
209,1_0,1277
210,0_1,1323
210,1_0,1312
211,0_1,1324
211,1_0,1322
212,0_1,1348
212,1_0,1333
213,0_1,1340
213,1_0,1324
214,0_1,1357
214,1_0,1349
215,0_1,1377
215,1_0,1392
216,0_1,1368
216,1_0,1376
217,0_1,1363
217,1_0,1387
218,0_1,1351
218,1_0,1408
219,0_1,1364
219,1_0,1403
220,0_1,1366
220,1_0,1383
221,0_1,1368
221,1_0,1395
222,0_1,1363
222,1_0,1382
223,0_1,1344
223,1_0,1392
224,0_1,1322
224,1_0,1383
225,0_1,1334
225,1_0,1362
226,0_1,1304
226,1_0,1377
227,0_1,1304
227,1_0,1386
228,0_1,1323
228,1_0,1397
229,0_1,1336
229,1_0,1399
230,0_1,1343
230,1_0,1405
231,0_1,1347
231,1_0,1413
232,0_1,1337
232,1_0,1397
233,0_1,1334
233,1_0,1373
234,0_1,1348
234,1_0,1368
235,0_1,1334
235,1_0,1375
236,0_1,1346
236,1_0,1378
237,0_1,1326
237,1_0,1361
238,0_1,1314
238,1_0,1373
239,0_1,1332
239,1_0,1352
240,0_1,1342
240,1_0,1349
241,0_1,1357
241,1_0,1366
242,0_1,1361
242,1_0,1358
243,0_1,1351
243,1_0,1341
244,0_1,1351
244,1_0,1317
245,0_1,1336
245,1_0,1309
246,0_1,1341
246,1_0,1308
247,0_1,1322
247,1_0,1299
248,0_1,1308
248,1_0,1297
249,0_1,1298
249,1_0,1301
250,0_1,1338
250,1_0,1333
251,0_1,1379
251,1_0,1373
252,0_1,1417
252,1_0,1380
253,0_1,1406
253,1_0,1353
254,0_1,1405
254,1_0,1356
255,0_1,1403
255,1_0,1334
256,0_1,1404
256,1_0,1338
257,0_1,1376
257,1_0,1315
258,0_1,1364
258,1_0,1294
259,0_1,1370
259,1_0,1333
260,0_1,1352
260,1_0,1340
261,0_1,1347
261,1_0,1332
262,0_1,1333
262,1_0,1316
263,0_1,1339
263,1_0,1316
264,0_1,1323
264,1_0,1343
265,0_1,1329
265,1_0,1339
266,0_1,1354
266,1_0,1314
267,0_1,1349
267,1_0,1302
268,0_1,1338
268,1_0,1287
269,0_1,1337
269,1_0,1296
270,0_1,1330
270,1_0,1319
271,0_1,1374
271,1_0,1396
272,0_1,1361
272,1_0,1386
273,0_1,1346
273,1_0,1388
274,0_1,1336
274,1_0,1410
275,0_1,1310
275,1_0,1392
276,0_1,1336
276,1_0,1382
277,0_1,1317
277,1_0,1354
278,0_1,1293
278,1_0,1319
279,0_1,1289
279,1_0,1311
280,0_1,1297
280,1_0,1292
281,0_1,1278
281,1_0,1284
282,0_1,1283
282,1_0,1247
283,0_1,1301
283,1_0,1248
284,0_1,1298
284,1_0,1241
285,0_1,1299
285,1_0,1254
286,0_1,1304
286,1_0,1270
287,0_1,1350
287,1_0,1330
288,0_1,1356
288,1_0,1375
289,0_1,1355
289,1_0,1368
290,0_1,1345
290,1_0,1337
291,0_1,1344
291,1_0,1340
292,0_1,1334
292,1_0,1338
293,0_1,1305
293,1_0,1355
294,0_1,1301
294,1_0,1369
295,0_1,1308
295,1_0,1368
296,0_1,1285
296,1_0,1362
297,0_1,1280
297,1_0,1332
298,0_1,1273
298,1_0,1322
299,0_1,1294
299,1_0,1324
300,0_1,1271
300,1_0,1332
301,0_1,1286
301,1_0,1301
302,0_1,1320
302,1_0,1331
303,0_1,1313
303,1_0,1357
304,0_1,1325
304,1_0,1339
305,0_1,1301
305,1_0,1358
306,0_1,1322
306,1_0,1379
307,0_1,1314
307,1_0,1345
308,0_1,1325
308,1_0,1373
309,0_1,1318
309,1_0,1360
310,0_1,1325
310,1_0,1368
311,0_1,1356
311,1_0,1377
312,0_1,1359
312,1_0,1375
313,0_1,1343
313,1_0,1349
314,0_1,1335
314,1_0,1358
315,0_1,1340
315,1_0,1358
316,0_1,1337
316,1_0,1382
317,0_1,1339
317,1_0,1373
318,0_1,1330
318,1_0,1394
319,0_1,1356
319,1_0,1408
320,0_1,1321
320,1_0,1368
321,0_1,1309
321,1_0,1363
322,0_1,1344
322,1_0,1381
323,0_1,1342
323,1_0,1384
324,0_1,1340
324,1_0,1385
325,0_1,1364
325,1_0,1379
326,0_1,1326
326,1_0,1361
327,0_1,1317
327,1_0,1380
328,0_1,1332
328,1_0,1366
329,0_1,1307
329,1_0,1367
330,0_1,1320
330,1_0,1358
331,0_1,1302
331,1_0,1358
332,0_1,1324
332,1_0,1354
333,0_1,1350
333,1_0,1356
334,0_1,1324
334,1_0,1372
335,0_1,1317
335,1_0,1311
336,0_1,1325
336,1_0,1297
337,0_1,1322
337,1_0,1306
338,0_1,1342
338,1_0,1333
339,0_1,1336
339,1_0,1353
340,0_1,1354
340,1_0,1343
341,0_1,1318
341,1_0,1362
342,0_1,1302
342,1_0,1339
343,0_1,1291
343,1_0,1301
344,0_1,1314
344,1_0,1335
345,0_1,1366
345,1_0,1344
346,0_1,1363
346,1_0,1319
347,0_1,1377
347,1_0,1318
348,0_1,1341
348,1_0,1326
349,0_1,1360
349,1_0,1346
350,0_1,1379
350,1_0,1359
351,0_1,1327
351,1_0,1339
352,0_1,1343
352,1_0,1381
353,0_1,1345
353,1_0,1388
354,0_1,1348
354,1_0,1381
355,0_1,1343
355,1_0,1376
356,0_1,1361
356,1_0,1379
357,0_1,1376
357,1_0,1390
358,0_1,1382
358,1_0,1370
359,0_1,1393
359,1_0,1372
360,0_1,1393
360,1_0,1344
361,0_1,1389
361,1_0,1369
362,0_1,1382
362,1_0,1348
363,0_1,1388
363,1_0,1380
364,0_1,1372
364,1_0,1378
365,0_1,1378
365,1_0,1393
366,0_1,1387
366,1_0,1363
367,0_1,1394
367,1_0,1373
368,0_1,1411
368,1_0,1358
369,0_1,1413
369,1_0,1365
370,0_1,1406
370,1_0,1371
371,0_1,1412
371,1_0,1380
372,0_1,1406
372,1_0,1391
373,0_1,1403
373,1_0,1397
374,0_1,1396
374,1_0,1399
375,0_1,1403
375,1_0,1383
376,0_1,1392
376,1_0,1385
377,0_1,1387
377,1_0,1407
378,0_1,1388
378,1_0,1397
379,0_1,1387
379,1_0,1377
380,0_1,1395
380,1_0,1362
381,0_1,1395
381,1_0,1368
382,0_1,1391
382,1_0,1344
383,0_1,1358
383,1_0,1344
384,0_1,1374
384,1_0,1343
385,0_1,1401
385,1_0,1351
386,0_1,1360
386,1_0,1370
387,0_1,1368
387,1_0,1367
388,0_1,1363
388,1_0,1368
389,0_1,1380
389,1_0,1377
390,0_1,1365
390,1_0,1361
391,0_1,1368
391,1_0,1377
392,0_1,1387
392,1_0,1386
393,0_1,1392
393,1_0,1382
394,0_1,1417
394,1_0,1368
395,0_1,1414
395,1_0,1340
396,0_1,1399
396,1_0,1334
397,0_1,1429
397,1_0,1359
398,0_1,1396
398,1_0,1345
399,0_1,1421
399,1_0,1376
400,0_1,1421
400,1_0,1366
401,0_1,1410
401,1_0,1360
402,0_1,1407
402,1_0,1376
403,0_1,1425
403,1_0,1373
404,0_1,1422
404,1_0,1366
405,0_1,1428
405,1_0,1351
406,0_1,1408
406,1_0,1335
407,0_1,1425
407,1_0,1348
408,0_1,1404
408,1_0,1369
409,0_1,1367
409,1_0,1356
410,0_1,1379
410,1_0,1365
411,0_1,1389
411,1_0,1378
412,0_1,1366
412,1_0,1340
413,0_1,1366
413,1_0,1352
414,0_1,1390
414,1_0,1326
415,0_1,1407
415,1_0,1313
416,0_1,1396
416,1_0,1329
417,0_1,1393
417,1_0,1326
418,0_1,1395
418,1_0,1315
419,0_1,1385
419,1_0,1328
420,0_1,1394
420,1_0,1317
421,0_1,1343
421,1_0,1310
422,0_1,1313
422,1_0,1289
423,0_1,1283
423,1_0,1265
424,0_1,1257
424,1_0,1255
425,0_1,1295
425,1_0,1296
426,0_1,1294
426,1_0,1318
427,0_1,1321
427,1_0,1324
428,0_1,1338
428,1_0,1337
429,0_1,1339
429,1_0,1341
430,0_1,1345
430,1_0,1328
431,0_1,1305
431,1_0,1330
432,0_1,1289
432,1_0,1319
433,0_1,1269
433,1_0,1316
434,0_1,1280
434,1_0,1296
435,0_1,1267
435,1_0,1302
436,0_1,1304
436,1_0,1385
437,0_1,1312
437,1_0,1412
438,0_1,1312
438,1_0,1403
439,0_1,1331
439,1_0,1410
440,0_1,1321
440,1_0,1421
441,0_1,1330
441,1_0,1386
442,0_1,1334
442,1_0,1366
443,0_1,1310
443,1_0,1334
444,0_1,1297
444,1_0,1322
445,0_1,1286
445,1_0,1336
446,0_1,1297
446,1_0,1384
447,0_1,1322
447,1_0,1403
448,0_1,1304
448,1_0,1417
449,0_1,1292
449,1_0,1401
450,0_1,1257
450,1_0,1422
451,0_1,1264
451,1_0,1411
452,0_1,1273
452,1_0,1438
453,0_1,1292
453,1_0,1439
454,0_1,1295
454,1_0,1409
455,0_1,1298
455,1_0,1377
456,0_1,1310
456,1_0,1384
457,0_1,1308
457,1_0,1370
458,0_1,1314
458,1_0,1357
459,0_1,1324
459,1_0,1317
460,0_1,1340
460,1_0,1308
461,0_1,1336
461,1_0,1314
462,0_1,1353
462,1_0,1332
463,0_1,1329
463,1_0,1305
464,0_1,1311
464,1_0,1311
465,0_1,1300
465,1_0,1302
466,0_1,1320
466,1_0,1311
467,0_1,1348
467,1_0,1315
468,0_1,1369
468,1_0,1333
469,0_1,1382
469,1_0,1352
470,0_1,1390
470,1_0,1336
471,0_1,1424
471,1_0,1371
472,0_1,1413
472,1_0,1344
473,0_1,1415
473,1_0,1349
474,0_1,1413
474,1_0,1353
475,0_1,1399
475,1_0,1373
476,0_1,1395
476,1_0,1359
477,0_1,1383
477,1_0,1358
478,0_1,1379
478,1_0,1389
479,0_1,1342
479,1_0,1377
480,0_1,1360
480,1_0,1406
481,0_1,1365
481,1_0,1408
482,0_1,1370
482,1_0,1387
483,0_1,1370
483,1_0,1401
484,0_1,1377
484,1_0,1409
485,0_1,1357
485,1_0,1379
486,0_1,1358
486,1_0,1386
487,0_1,1360
487,1_0,1413
488,0_1,1349
488,1_0,1407
489,0_1,1336
489,1_0,1404
490,0_1,1346
490,1_0,1397
491,0_1,1348
491,1_0,1387
492,0_1,1356
492,1_0,1375
493,0_1,1352
493,1_0,1340
494,0_1,1347
494,1_0,1344
495,0_1,1359
495,1_0,1334
496,0_1,1327
496,1_0,1313
497,0_1,1314
497,1_0,1279
498,0_1,1352
498,1_0,1289
499,0_1,1370
499,1_0,1328
500,0_1,1369
500,1_0,1339
501,0_1,1368
501,1_0,1341
502,0_1,1335
502,1_0,1359
503,0_1,1335
503,1_0,1335
504,0_1,1344
504,1_0,1329
505,0_1,1333
505,1_0,1320
506,0_1,1333
506,1_0,1344
507,0_1,1343
507,1_0,1371
508,0_1,1352
508,1_0,1350
509,0_1,1367
509,1_0,1340
510,0_1,1381
510,1_0,1319
511,0_1,1384
511,1_0,1319
512,0_1,1373
512,1_0,1346
513,0_1,1378
513,1_0,1359
514,0_1,1360
514,1_0,1351
515,0_1,1358
515,1_0,1342
516,0_1,1367
516,1_0,1351
517,0_1,1357
517,1_0,1364
518,0_1,1347
518,1_0,1352
519,0_1,1356
519,1_0,1354
520,0_1,1343
520,1_0,1382
521,0_1,1339
521,1_0,1375
522,0_1,1342
522,1_0,1366
523,0_1,1367
523,1_0,1348
524,0_1,1380
524,1_0,1347
525,0_1,1387
525,1_0,1334
526,0_1,1399
526,1_0,1362
527,0_1,1387
527,1_0,1367
528,0_1,1384
528,1_0,1374
529,0_1,1366
529,1_0,1373
530,0_1,1362
530,1_0,1370
531,0_1,1387
531,1_0,1378
532,0_1,1392
532,1_0,1368
533,0_1,1394
533,1_0,1369
534,0_1,1384
534,1_0,1355
535,0_1,1382
535,1_0,1369
536,0_1,1353
536,1_0,1364
537,0_1,1362
537,1_0,1366
538,0_1,1363
538,1_0,1344
539,0_1,1362
539,1_0,1354
540,0_1,1379
540,1_0,1345
541,0_1,1373
541,1_0,1337
542,0_1,1386
542,1_0,1350
543,0_1,1396
543,1_0,1324
544,0_1,1409
544,1_0,1329
545,0_1,1402
545,1_0,1365
546,0_1,1381
546,1_0,1372
547,0_1,1381
547,1_0,1351
548,0_1,1401
548,1_0,1342
549,0_1,1398
549,1_0,1350
550,0_1,1381
550,1_0,1332
551,0_1,1387
551,1_0,1327
552,0_1,1380
552,1_0,1349
553,0_1,1377
553,1_0,1350
554,0_1,1395
554,1_0,1344
555,0_1,1401
555,1_0,1349
556,0_1,1397
556,1_0,1355
557,0_1,1372
557,1_0,1351
558,0_1,1387
558,1_0,1360
559,0_1,1394
559,1_0,1362
560,0_1,1388
560,1_0,1360
561,0_1,1378
561,1_0,1369
562,0_1,1357
562,1_0,1399
563,0_1,1383
563,1_0,1379
564,0_1,1401
564,1_0,1346
565,0_1,1395
565,1_0,1364
566,0_1,1369
566,1_0,1371
567,0_1,1401
567,1_0,1373
568,0_1,1386
568,1_0,1374
569,0_1,1414
569,1_0,1384
570,0_1,1406
570,1_0,1384
571,0_1,1417
571,1_0,1379
572,0_1,1414
572,1_0,1360
573,0_1,1419
573,1_0,1370
574,0_1,1414
574,1_0,1376
575,0_1,1416
575,1_0,1395
576,0_1,1424
576,1_0,1386
577,0_1,1410
577,1_0,1387
578,0_1,1410
578,1_0,1401
579,0_1,1400
579,1_0,1397
580,0_1,1410
580,1_0,1389
581,0_1,1416
581,1_0,1365
582,0_1,1410
582,1_0,1359
583,0_1,1429
583,1_0,1367
584,0_1,1432
584,1_0,1355
585,0_1,1440
585,1_0,1344
586,0_1,1467
586,1_0,1331
587,0_1,1446
587,1_0,1335
588,0_1,1429
588,1_0,1326
589,0_1,1392
589,1_0,1359
590,0_1,1400
590,1_0,1359
591,0_1,1391
591,1_0,1384
592,0_1,1362
592,1_0,1390
593,0_1,1349
593,1_0,1391
594,0_1,1335
594,1_0,1388
595,0_1,1344
595,1_0,1405
596,0_1,1339
596,1_0,1397
597,0_1,1356
597,1_0,1375
598,0_1,1360
598,1_0,1374
599,0_1,1330
599,1_0,1367
600,0_1,1340
600,1_0,1349
601,0_1,1372
601,1_0,1345
602,0_1,1357
602,1_0,1350
603,0_1,1352
603,1_0,1374
604,0_1,1334
604,1_0,1380
605,0_1,1346
605,1_0,1358
606,0_1,1332
606,1_0,1350
607,0_1,1355
607,1_0,1371
608,0_1,1354
608,1_0,1373
609,0_1,1352
609,1_0,1375
610,0_1,1347
610,1_0,1365
611,0_1,1364
611,1_0,1354
612,0_1,1364
612,1_0,1382
613,0_1,1343
613,1_0,1404
614,0_1,1348
614,1_0,1408
615,0_1,1360
615,1_0,1373
616,0_1,1364
616,1_0,1362
617,0_1,1356
617,1_0,1356
618,0_1,1354
618,1_0,1321
619,0_1,1375
619,1_0,1325
620,0_1,1374
620,1_0,1316
621,0_1,1374
621,1_0,1327
622,0_1,1366
622,1_0,1322
623,0_1,1380
623,1_0,1299
624,0_1,1392
624,1_0,1284
625,0_1,1394
625,1_0,1320
626,0_1,1402
626,1_0,1303
627,0_1,1383
627,1_0,1295
628,0_1,1388
628,1_0,1329
629,0_1,1384
629,1_0,1345
630,0_1,1390
630,1_0,1362
631,0_1,1381
631,1_0,1369
632,0_1,1376
632,1_0,1355
633,0_1,1380
633,1_0,1385
634,0_1,1345
634,1_0,1381
635,0_1,1389
635,1_0,1376
636,0_1,1394
636,1_0,1350
637,0_1,1384
637,1_0,1351
638,0_1,1405
638,1_0,1361
639,0_1,1422
639,1_0,1348
640,0_1,1411
640,1_0,1345
641,0_1,1400
641,1_0,1375
642,0_1,1416
642,1_0,1356
643,0_1,1425
643,1_0,1368
644,0_1,1441
644,1_0,1378
645,0_1,1428
645,1_0,1367
646,0_1,1431
646,1_0,1367
647,0_1,1411
647,1_0,1381
648,0_1,1415
648,1_0,1378
649,0_1,1405
649,1_0,1350
650,0_1,1424
650,1_0,1341
651,0_1,1413
651,1_0,1359
652,0_1,1388
652,1_0,1366
653,0_1,1391
653,1_0,1356
654,0_1,1386
654,1_0,1346
655,0_1,1356
655,1_0,1361
656,0_1,1364
656,1_0,1364
657,0_1,1369
657,1_0,1367
658,0_1,1354
658,1_0,1364
659,0_1,1369
659,1_0,1353
660,0_1,1403
660,1_0,1347
661,0_1,1385
661,1_0,1345
662,0_1,1377
662,1_0,1350
663,0_1,1395
663,1_0,1362
664,0_1,1384
664,1_0,1364
665,0_1,1371
665,1_0,1373
666,0_1,1372
666,1_0,1380
667,0_1,1360
667,1_0,1384
668,0_1,1345
668,1_0,1399
669,0_1,1349
669,1_0,1411
670,0_1,1335
670,1_0,1411
671,0_1,1330
671,1_0,1412
672,0_1,1333
672,1_0,1405
673,0_1,1354
673,1_0,1387
674,0_1,1381
674,1_0,1361
675,0_1,1377
675,1_0,1330
676,0_1,1358
676,1_0,1336
677,0_1,1380
677,1_0,1345
678,0_1,1369
678,1_0,1340
679,0_1,1357
679,1_0,1345
680,0_1,1342
680,1_0,1368
681,0_1,1343
681,1_0,1342
682,0_1,1337
682,1_0,1375
683,0_1,1316
683,1_0,1370
684,0_1,1321
684,1_0,1384
685,0_1,1336
685,1_0,1385
686,0_1,1291
686,1_0,1390
687,0_1,1282
687,1_0,1383
688,0_1,1315
688,1_0,1373
689,0_1,1309
689,1_0,1372
690,0_1,1345
690,1_0,1385
691,0_1,1331
691,1_0,1363
692,0_1,1366
692,1_0,1371
693,0_1,1354
693,1_0,1354
694,0_1,1347
694,1_0,1368
695,0_1,1364
695,1_0,1368
696,0_1,1367
696,1_0,1352
697,0_1,1372
697,1_0,1369
698,0_1,1360
698,1_0,1372
699,0_1,1386
699,1_0,1372
700,0_1,1389
700,1_0,1375
701,0_1,1358
701,1_0,1367
702,0_1,1349
702,1_0,1385
703,0_1,1344
703,1_0,1403
704,0_1,1315
704,1_0,1369
705,0_1,1309
705,1_0,1350
706,0_1,1361
706,1_0,1376
707,0_1,1349
707,1_0,1351
708,0_1,1356
708,1_0,1358
709,0_1,1368
709,1_0,1362
710,0_1,1359
710,1_0,1348
711,0_1,1358
711,1_0,1347
712,0_1,1330
712,1_0,1326
713,0_1,1341
713,1_0,1352
714,0_1,1333
714,1_0,1338
715,0_1,1325
715,1_0,1356
716,0_1,1316
716,1_0,1350
717,0_1,1339
717,1_0,1357
718,0_1,1363
718,1_0,1373
719,0_1,1337
719,1_0,1377
720,0_1,1339
720,1_0,1350
721,0_1,1346
721,1_0,1341
722,0_1,1343
722,1_0,1352
723,0_1,1332
723,1_0,1330
724,0_1,1348
724,1_0,1351
725,0_1,1355
725,1_0,1366
726,0_1,1365
726,1_0,1360
727,0_1,1372
727,1_0,1360
728,0_1,1380
728,1_0,1362
729,0_1,1395
729,1_0,1380
730,0_1,1400
730,1_0,1383
731,0_1,1395
731,1_0,1366
732,0_1,1401
732,1_0,1373
733,0_1,1412
733,1_0,1379
734,0_1,1391
734,1_0,1376
735,0_1,1401
735,1_0,1382
736,0_1,1410
736,1_0,1368
737,0_1,1378
737,1_0,1367
738,0_1,1374
738,1_0,1374
739,0_1,1377
739,1_0,1376
740,0_1,1387
740,1_0,1388
741,0_1,1390
741,1_0,1399
742,0_1,1383
742,1_0,1390
743,0_1,1414
743,1_0,1387
744,0_1,1403
744,1_0,1382
745,0_1,1405
745,1_0,1353
746,0_1,1404
746,1_0,1349
747,0_1,1396
747,1_0,1359
748,0_1,1390
748,1_0,1377
749,0_1,1381
749,1_0,1398
750,0_1,1364
750,1_0,1391
751,0_1,1368
751,1_0,1397
752,0_1,1378
752,1_0,1382
753,0_1,1366
753,1_0,1380
754,0_1,1375
754,1_0,1366
755,0_1,1371
755,1_0,1371
756,0_1,1380
756,1_0,1374
757,0_1,1348
757,1_0,1338
758,0_1,1360
758,1_0,1359
759,0_1,1361
759,1_0,1361
760,0_1,1363
760,1_0,1352
761,0_1,1349
761,1_0,1362
762,0_1,1369
762,1_0,1359
763,0_1,1339
763,1_0,1348
764,0_1,1342
764,1_0,1341
765,0_1,1356
765,1_0,1359
766,0_1,1354
766,1_0,1376
767,0_1,1365
767,1_0,1359
768,0_1,1370
768,1_0,1364
769,0_1,1380
769,1_0,1364
770,0_1,1363
770,1_0,1357
771,0_1,1367
771,1_0,1365
772,0_1,1377
772,1_0,1368
773,0_1,1394
773,1_0,1357
774,0_1,1404
774,1_0,1341
775,0_1,1411
775,1_0,1317
776,0_1,1382
776,1_0,1323
777,0_1,1359
777,1_0,1314
778,0_1,1395
778,1_0,1326
779,0_1,1391
779,1_0,1325
780,0_1,1401
780,1_0,1332
781,0_1,1381
781,1_0,1360
782,0_1,1384
782,1_0,1342
783,0_1,1369
783,1_0,1365
784,0_1,1399
784,1_0,1355
785,0_1,1380
785,1_0,1375
786,0_1,1361
786,1_0,1358
787,0_1,1366
787,1_0,1380
788,0_1,1362
788,1_0,1392
789,0_1,1367
789,1_0,1376
790,0_1,1404
790,1_0,1366
791,0_1,1420
791,1_0,1354
792,0_1,1408
792,1_0,1356
793,0_1,1390
793,1_0,1358
794,0_1,1384
794,1_0,1373
795,0_1,1384
795,1_0,1345
796,0_1,1374
796,1_0,1350
797,0_1,1376
797,1_0,1360
798,0_1,1377
798,1_0,1376
799,0_1,1368
799,1_0,1378
800,0_1,1373
800,1_0,1389
801,0_1,1349
801,1_0,1372
802,0_1,1361
802,1_0,1377
803,0_1,1347
803,1_0,1385
804,0_1,1358
804,1_0,1380
805,0_1,1360
805,1_0,1371
806,0_1,1358
806,1_0,1383
807,0_1,1354
807,1_0,1373
808,0_1,1372
808,1_0,1375
809,0_1,1350
809,1_0,1372
810,0_1,1360
810,1_0,1359
811,0_1,1353
811,1_0,1376
812,0_1,1357
812,1_0,1361
813,0_1,1367
813,1_0,1366
814,0_1,1360
814,1_0,1388
815,0_1,1360
815,1_0,1402
816,0_1,1356
816,1_0,1367
817,0_1,1368
817,1_0,1395
818,0_1,1370
818,1_0,1375
819,0_1,1377
819,1_0,1373
820,0_1,1374
820,1_0,1367
821,0_1,1378
821,1_0,1388
822,0_1,1367
822,1_0,1398
823,0_1,1366
823,1_0,1388
824,0_1,1378
824,1_0,1402
825,0_1,1398
825,1_0,1401
826,0_1,1364
826,1_0,1389
827,0_1,1371
827,1_0,1407
828,0_1,1372
828,1_0,1396
829,0_1,1360
829,1_0,1382
830,0_1,1352
830,1_0,1405
831,0_1,1362
831,1_0,1410
832,0_1,1361
832,1_0,1388
833,0_1,1359
833,1_0,1371
834,0_1,1341
834,1_0,1381
835,0_1,1340
835,1_0,1375
836,0_1,1328
836,1_0,1364
837,0_1,1305
837,1_0,1343
838,0_1,1316
838,1_0,1335
839,0_1,1319
839,1_0,1313
840,0_1,1299
840,1_0,1290
841,0_1,1366
841,1_0,1346
842,0_1,1348
842,1_0,1365
843,0_1,1332
843,1_0,1352
844,0_1,1334
844,1_0,1349
845,0_1,1324
845,1_0,1348
846,0_1,1319
846,1_0,1342
847,0_1,1319
847,1_0,1353
848,0_1,1312
848,1_0,1364
849,0_1,1337
849,1_0,1344
850,0_1,1343
850,1_0,1343
851,0_1,1323
851,1_0,1361
852,0_1,1304
852,1_0,1370
853,0_1,1334
853,1_0,1360
854,0_1,1347
854,1_0,1351
855,0_1,1354
855,1_0,1350
856,0_1,1351
856,1_0,1360
857,0_1,1359
857,1_0,1367
858,0_1,1338
858,1_0,1375
859,0_1,1358
859,1_0,1375
860,0_1,1358
860,1_0,1389
861,0_1,1355
861,1_0,1393
862,0_1,1354
862,1_0,1390
863,0_1,1358
863,1_0,1377
864,0_1,1364
864,1_0,1401
865,0_1,1330
865,1_0,1418
866,0_1,1321
866,1_0,1395
867,0_1,1339
867,1_0,1409
868,0_1,1343
868,1_0,1422
869,0_1,1357
869,1_0,1420
870,0_1,1356
870,1_0,1407
871,0_1,1354
871,1_0,1406
872,0_1,1371
872,1_0,1384
873,0_1,1389
873,1_0,1384
874,0_1,1397
874,1_0,1372
875,0_1,1393
875,1_0,1358
876,0_1,1388
876,1_0,1362
877,0_1,1404
877,1_0,1360
878,0_1,1410
878,1_0,1338
879,0_1,1428
879,1_0,1320
880,0_1,1419
880,1_0,1331
881,0_1,1418
881,1_0,1330
882,0_1,1414
882,1_0,1355
883,0_1,1412
883,1_0,1340
884,0_1,1413
884,1_0,1325
885,0_1,1439
885,1_0,1336
886,0_1,1434
886,1_0,1336
887,0_1,1442
887,1_0,1329
888,0_1,1422
888,1_0,1316
889,0_1,1429
889,1_0,1318
890,0_1,1454
890,1_0,1314
891,0_1,1441
891,1_0,1305
892,0_1,1426
892,1_0,1309
893,0_1,1389
893,1_0,1325
894,0_1,1412
894,1_0,1330
895,0_1,1417
895,1_0,1333
896,0_1,1410
896,1_0,1337
897,0_1,1395
897,1_0,1339
898,0_1,1370
898,1_0,1343
899,0_1,1396
899,1_0,1312
900,0_1,1382
900,1_0,1316
901,0_1,1348
901,1_0,1300
902,0_1,1331
902,1_0,1304
903,0_1,1319
903,1_0,1355
904,0_1,1311
904,1_0,1367
905,0_1,1299
905,1_0,1364
906,0_1,1317
906,1_0,1349
907,0_1,1304
907,1_0,1330
908,0_1,1309
908,1_0,1305
909,0_1,1362
909,1_0,1296
910,0_1,1378
910,1_0,1288
911,0_1,1363
911,1_0,1282
912,0_1,1370
912,1_0,1311
913,0_1,1365
913,1_0,1334
914,0_1,1352
914,1_0,1338
915,0_1,1361
915,1_0,1328
916,0_1,1340
916,1_0,1321
917,0_1,1366
917,1_0,1364
918,0_1,1339
918,1_0,1360
919,0_1,1323
919,1_0,1392
920,0_1,1310
920,1_0,1386
921,0_1,1338
921,1_0,1386
922,0_1,1345
922,1_0,1395
923,0_1,1354
923,1_0,1387
924,0_1,1353
924,1_0,1376
925,0_1,1327
925,1_0,1350
926,0_1,1369
926,1_0,1347
927,0_1,1362
927,1_0,1339
928,0_1,1314
928,1_0,1333
929,0_1,1326
929,1_0,1381
930,0_1,1323
930,1_0,1372
931,0_1,1334
931,1_0,1381
932,0_1,1335
932,1_0,1367
933,0_1,1339
933,1_0,1350
934,0_1,1354
934,1_0,1363
935,0_1,1379
935,1_0,1330
936,0_1,1371
936,1_0,1362
937,0_1,1364
937,1_0,1353
938,0_1,1349
938,1_0,1349
939,0_1,1346
939,1_0,1351
940,0_1,1341
940,1_0,1349
941,0_1,1332
941,1_0,1321
942,0_1,1353
942,1_0,1321
943,0_1,1359
943,1_0,1329
944,0_1,1355
944,1_0,1315
945,0_1,1343
945,1_0,1324
946,0_1,1356
946,1_0,1335
947,0_1,1333
947,1_0,1310
948,0_1,1344
948,1_0,1292
949,0_1,1334
949,1_0,1283
950,0_1,1343
950,1_0,1294
951,0_1,1332
951,1_0,1308
952,0_1,1327
952,1_0,1312
953,0_1,1338
953,1_0,1325
954,0_1,1330
954,1_0,1319
955,0_1,1343
955,1_0,1311
956,0_1,1340
956,1_0,1311
957,0_1,1323
957,1_0,1320
958,0_1,1314
958,1_0,1322
959,0_1,1331
959,1_0,1321
960,0_1,1338
960,1_0,1315
961,0_1,1357
961,1_0,1298
962,0_1,1331
962,1_0,1296
963,0_1,1337
963,1_0,1339
964,0_1,1331
964,1_0,1364
965,0_1,1342
965,1_0,1362
966,0_1,1323
966,1_0,1357
967,0_1,1326
967,1_0,1331
968,0_1,1351
968,1_0,1354
969,0_1,1359
969,1_0,1313
970,0_1,1372
970,1_0,1316
971,0_1,1374
971,1_0,1345
972,0_1,1353
972,1_0,1333
973,0_1,1340
973,1_0,1379
974,0_1,1350
974,1_0,1390
975,0_1,1356
975,1_0,1368
976,0_1,1352
976,1_0,1353
977,0_1,1373
977,1_0,1346
978,0_1,1387
978,1_0,1340
979,0_1,1376
979,1_0,1370
980,0_1,1343
980,1_0,1364
981,0_1,1361
981,1_0,1374
982,0_1,1362
982,1_0,1365
983,0_1,1393
983,1_0,1357
984,0_1,1375
984,1_0,1345
985,0_1,1371
985,1_0,1380
986,0_1,1359
986,1_0,1386
987,0_1,1354
987,1_0,1384
988,0_1,1339
988,1_0,1367
989,0_1,1351
989,1_0,1353
990,0_1,1360
990,1_0,1329
991,0_1,1372
991,1_0,1341
992,0_1,1358
992,1_0,1369
993,0_1,1358
993,1_0,1381
994,0_1,1351
994,1_0,1362
995,0_1,1344
995,1_0,1341
996,0_1,1388
996,1_0,1328
997,0_1,1385
997,1_0,1309
998,0_1,1400
998,1_0,1333
999,0_1,1384
999,1_0,1327
1000,0_1,1383
1000,1_0,1315
1001,0_1,1383
1001,1_0,1320
1002,0_1,1394
1002,1_0,1327
1003,0_1,1338
1003,1_0,1305
1004,0_1,1307
1004,1_0,1273
1005,0_1,1306
1005,1_0,1276
1006,0_1,1317
1006,1_0,1300
1007,0_1,1321
1007,1_0,1297
1008,0_1,1347
1008,1_0,1294
1009,0_1,1354
1009,1_0,1282
1010,0_1,1332
1010,1_0,1328
1011,0_1,1330
1011,1_0,1356
1012,0_1,1335
1012,1_0,1338
1013,0_1,1345
1013,1_0,1349
1014,0_1,1316
1014,1_0,1345
1015,0_1,1354
1015,1_0,1313
1016,0_1,1363
1016,1_0,1345
1017,0_1,1333
1017,1_0,1335
1018,0_1,1367
1018,1_0,1337
1019,0_1,1366
1019,1_0,1315
1020,0_1,1395
1020,1_0,1346
1021,0_1,1371
1021,1_0,1334
1022,0_1,1361
1022,1_0,1333
1023,0_1,1357
1023,1_0,1332
1024,0_1,1372
1024,1_0,1325
1025,0_1,1355
1025,1_0,1329
1026,0_1,1371
1026,1_0,1322
1027,0_1,1357
1027,1_0,1341
1028,0_1,1347
1028,1_0,1351
1029,0_1,1341
1029,1_0,1309
1030,0_1,1338
1030,1_0,1319
1031,0_1,1344
1031,1_0,1351
1032,0_1,1342
1032,1_0,1347
1033,0_1,1340
1033,1_0,1365
1034,0_1,1354
1034,1_0,1385
1035,0_1,1351
1035,1_0,1354
1036,0_1,1356
1036,1_0,1376
1037,0_1,1357
1037,1_0,1340
1038,0_1,1362
1038,1_0,1353
1039,0_1,1335
1039,1_0,1376
1040,0_1,1340
1040,1_0,1380
1041,0_1,1343
1041,1_0,1378
1042,0_1,1329
1042,1_0,1378
1043,0_1,1348
1043,1_0,1368
1044,0_1,1348
1044,1_0,1371
1045,0_1,1351
1045,1_0,1373
1046,0_1,1353
1046,1_0,1369
1047,0_1,1334
1047,1_0,1383
1048,0_1,1349
1048,1_0,1410
1049,0_1,1349
1049,1_0,1361
1050,0_1,1384
1050,1_0,1373
1051,0_1,1384
1051,1_0,1374
1052,0_1,1380
1052,1_0,1340
1053,0_1,1403
1053,1_0,1343
1054,0_1,1388
1054,1_0,1343
1055,0_1,1395
1055,1_0,1343
1056,0_1,1385
1056,1_0,1346
1057,0_1,1405
1057,1_0,1343
1058,0_1,1412
1058,1_0,1341
1059,0_1,1419
1059,1_0,1331
1060,0_1,1396
1060,1_0,1343
1061,0_1,1392
1061,1_0,1390
1062,0_1,1376
1062,1_0,1364
1063,0_1,1377
1063,1_0,1356
1064,0_1,1373
1064,1_0,1377
1065,0_1,1366
1065,1_0,1384
1066,0_1,1370
1066,1_0,1396
1067,0_1,1382
1067,1_0,1396
1068,0_1,1359
1068,1_0,1392
1069,0_1,1383
1069,1_0,1359
1070,0_1,1378
1070,1_0,1356
1071,0_1,1354
1071,1_0,1366
1072,0_1,1342
1072,1_0,1376
1073,0_1,1359
1073,1_0,1369
1074,0_1,1369
1074,1_0,1356
1075,0_1,1379
1075,1_0,1348
1076,0_1,1403
1076,1_0,1355
1077,0_1,1361
1077,1_0,1350
1078,0_1,1350
1078,1_0,1369
1079,0_1,1354
1079,1_0,1385
1080,0_1,1350
1080,1_0,1400
1081,0_1,1359
1081,1_0,1401
1082,0_1,1355
1082,1_0,1392
1083,0_1,1361
1083,1_0,1405
1084,0_1,1344
1084,1_0,1385
1085,0_1,1347
1085,1_0,1408
1086,0_1,1362
1086,1_0,1373
1087,0_1,1379
1087,1_0,1376
1088,0_1,1394
1088,1_0,1376
1089,0_1,1398
1089,1_0,1401
1090,0_1,1383
1090,1_0,1390
1091,0_1,1388
1091,1_0,1390
1092,0_1,1367
1092,1_0,1408
1093,0_1,1363
1093,1_0,1416
1094,0_1,1376
1094,1_0,1381
1095,0_1,1360
1095,1_0,1385
1096,0_1,1390
1096,1_0,1386
1097,0_1,1392
1097,1_0,1373
1098,0_1,1395
1098,1_0,1375
1099,0_1,1395
1099,1_0,1360
1100,0_1,1387
1100,1_0,1388
1101,0_1,1389
1101,1_0,1372
1102,0_1,1393
1102,1_0,1371
1103,0_1,1381
1103,1_0,1380
1104,0_1,1386
1104,1_0,1356
1105,0_1,1404
1105,1_0,1370
1106,0_1,1386
1106,1_0,1360
1107,0_1,1403
1107,1_0,1338
1108,0_1,1390
1108,1_0,1350
1109,0_1,1392
1109,1_0,1372
1110,0_1,1390
1110,1_0,1382
1111,0_1,1363
1111,1_0,1394
1112,0_1,1377
1112,1_0,1381
1113,0_1,1410
1113,1_0,1388
1114,0_1,1393
1114,1_0,1362
1115,0_1,1399
1115,1_0,1357
1116,0_1,1373
1116,1_0,1369
1117,0_1,1385
1117,1_0,1392
1118,0_1,1381
1118,1_0,1369
1119,0_1,1369
1119,1_0,1383
1120,0_1,1374
1120,1_0,1386
1121,0_1,1363
1121,1_0,1409
1122,0_1,1361
1122,1_0,1410
1123,0_1,1383
1123,1_0,1398
1124,0_1,1358
1124,1_0,1410
1125,0_1,1363
1125,1_0,1392
1126,0_1,1351
1126,1_0,1414
1127,0_1,1370
1127,1_0,1428
1128,0_1,1353
1128,1_0,1402
1129,0_1,1380
1129,1_0,1397
1130,0_1,1388
1130,1_0,1398
1131,0_1,1385
1131,1_0,1393
1132,0_1,1392
1132,1_0,1385
1133,0_1,1391
1133,1_0,1394
1134,0_1,1395
1134,1_0,1394
1135,0_1,1394
1135,1_0,1406
1136,0_1,1395
1136,1_0,1393
1137,0_1,1393
1137,1_0,1383
1138,0_1,1404
1138,1_0,1375
1139,0_1,1398
1139,1_0,1376
1140,0_1,1416
1140,1_0,1376
1141,0_1,1429
1141,1_0,1372
1142,0_1,1425
1142,1_0,1368
1143,0_1,1413
1143,1_0,1379
1144,0_1,1389
1144,1_0,1381
1145,0_1,1398
1145,1_0,1384
1146,0_1,1405
1146,1_0,1386
1147,0_1,1415
1147,1_0,1376
1148,0_1,1396
1148,1_0,1386
1149,0_1,1376
1149,1_0,1384
1150,0_1,1382
1150,1_0,1408
1151,0_1,1383
1151,1_0,1394
1152,0_1,1404
1152,1_0,1418
1153,0_1,1390
1153,1_0,1389
1154,0_1,1391
1154,1_0,1404
1155,0_1,1392
1155,1_0,1397
1156,0_1,1392
1156,1_0,1386
1157,0_1,1413
1157,1_0,1390
1158,0_1,1415
1158,1_0,1388
1159,0_1,1412
1159,1_0,1389
1160,0_1,1421
1160,1_0,1370
1161,0_1,1434
1161,1_0,1395
1162,0_1,1431
1162,1_0,1394
1163,0_1,1427
1163,1_0,1372
1164,0_1,1434
1164,1_0,1396
1165,0_1,1402
1165,1_0,1380
1166,0_1,1409
1166,1_0,1384
1167,0_1,1412
1167,1_0,1394
1168,0_1,1399
1168,1_0,1396
1169,0_1,1382
1169,1_0,1412
1170,0_1,1369
1170,1_0,1399
1171,0_1,1360
1171,1_0,1387
1172,0_1,1382
1172,1_0,1389
1173,0_1,1390
1173,1_0,1406
1174,0_1,1408
1174,1_0,1402
1175,0_1,1386
1175,1_0,1396
1176,0_1,1380
1176,1_0,1408
1177,0_1,1384
1177,1_0,1391
1178,0_1,1401
1178,1_0,1385
1179,0_1,1386
1179,1_0,1383
1180,0_1,1384
1180,1_0,1428
1181,0_1,1410
1181,1_0,1425
1182,0_1,1384
1182,1_0,1414
1183,0_1,1358
1183,1_0,1443
1184,0_1,1362
1184,1_0,1427
1185,0_1,1368
1185,1_0,1405
1186,0_1,1352
1186,1_0,1399
1187,0_1,1370
1187,1_0,1394
1188,0_1,1376
1188,1_0,1378
1189,0_1,1361
1189,1_0,1376
1190,0_1,1364
1190,1_0,1400
1191,0_1,1344
1191,1_0,1391
1192,0_1,1367
1192,1_0,1408
1193,0_1,1366
1193,1_0,1394
1194,0_1,1394
1194,1_0,1406
1195,0_1,1374
1195,1_0,1413
1196,0_1,1370
1196,1_0,1418
1197,0_1,1364
1197,1_0,1426
1198,0_1,1366
1198,1_0,1404
1199,0_1,1361
1199,1_0,1426
1200,0_1,1362
1200,1_0,1414
1201,0_1,1388
1201,1_0,1417
1202,0_1,1383
1202,1_0,1401
1203,0_1,1367
1203,1_0,1410
1204,0_1,1379
1204,1_0,1403
1205,0_1,1392
1205,1_0,1394
1206,0_1,1359
1206,1_0,1393
1207,0_1,1385
1207,1_0,1416
1208,0_1,1362
1208,1_0,1410
1209,0_1,1363
1209,1_0,1409
1210,0_1,1352
1210,1_0,1423
1211,0_1,1347
1211,1_0,1385
1212,0_1,1356
1212,1_0,1390
1213,0_1,1341
1213,1_0,1392
1214,0_1,1354
1214,1_0,1398
1215,0_1,1349
1215,1_0,1389
1216,0_1,1350
1216,1_0,1379
1217,0_1,1344
1217,1_0,1372
1218,0_1,1331
1218,1_0,1365
1219,0_1,1322
1219,1_0,1363
1220,0_1,1341
1220,1_0,1397
1221,0_1,1335
1221,1_0,1409
1222,0_1,1312
1222,1_0,1392
1223,0_1,1315
1223,1_0,1402
1224,0_1,1323
1224,1_0,1386
1225,0_1,1331
1225,1_0,1381
1226,0_1,1316
1226,1_0,1379
1227,0_1,1258
1227,1_0,1381
1228,0_1,1297
1228,1_0,1380
1229,0_1,1295
1229,1_0,1365
1230,0_1,1288
1230,1_0,1370
1231,0_1,1288
1231,1_0,1366
1232,0_1,1309
1232,1_0,1347
1233,0_1,1327
1233,1_0,1348
1234,0_1,1323
1234,1_0,1356
1235,0_1,1354
1235,1_0,1334
1236,0_1,1346
1236,1_0,1309
1237,0_1,1341
1237,1_0,1305
1238,0_1,1330
1238,1_0,1303
1239,0_1,1310
1239,1_0,1314
1240,0_1,1326
1240,1_0,1318
1241,0_1,1348
1241,1_0,1329
1242,0_1,1358
1242,1_0,1331
1243,0_1,1344
1243,1_0,1333
1244,0_1,1365
1244,1_0,1333
1245,0_1,1318
1245,1_0,1313
1246,0_1,1333
1246,1_0,1380
1247,0_1,1300
1247,1_0,1354
1248,0_1,1302
1248,1_0,1376
1249,0_1,1273
1249,1_0,1369
1250,0_1,1269
1250,1_0,1361
1251,0_1,1282
1251,1_0,1365
1252,0_1,1346
1252,1_0,1314
1253,0_1,1369
1253,1_0,1301
1254,0_1,1371
1254,1_0,1299
1255,0_1,1375
1255,1_0,1321
1256,0_1,1370
1256,1_0,1306
1257,0_1,1386
1257,1_0,1303
1258,0_1,1355
1258,1_0,1291
1259,0_1,1377
1259,1_0,1320
1260,0_1,1374
1260,1_0,1307
1261,0_1,1355
1261,1_0,1324
1262,0_1,1358
1262,1_0,1335
1263,0_1,1339
1263,1_0,1334
1264,0_1,1362
1264,1_0,1333
1265,0_1,1355
1265,1_0,1333
1266,0_1,1354
1266,1_0,1360
1267,0_1,1358
1267,1_0,1341
1268,0_1,1362
1268,1_0,1347
1269,0_1,1344
1269,1_0,1327
1270,0_1,1349
1270,1_0,1327
1271,0_1,1369
1271,1_0,1318
1272,0_1,1373
1272,1_0,1346
1273,0_1,1375
1273,1_0,1315
1274,0_1,1353
1274,1_0,1324
1275,0_1,1373
1275,1_0,1347
1276,0_1,1380
1276,1_0,1312
1277,0_1,1393
1277,1_0,1330
1278,0_1,1363
1278,1_0,1354
1279,0_1,1365
1279,1_0,1355
1280,0_1,1370
1280,1_0,1353
1281,0_1,1358
1281,1_0,1353
1282,0_1,1377
1282,1_0,1368
1283,0_1,1348
1283,1_0,1352
1284,0_1,1394
1284,1_0,1359
1285,0_1,1356
1285,1_0,1361
1286,0_1,1388
1286,1_0,1361
1287,0_1,1374
1287,1_0,1338
1288,0_1,1371
1288,1_0,1334
1289,0_1,1344
1289,1_0,1365
1290,0_1,1321
1290,1_0,1331
1291,0_1,1334
1291,1_0,1372
1292,0_1,1333
1292,1_0,1374
1293,0_1,1334
1293,1_0,1382
1294,0_1,1353
1294,1_0,1384
1295,0_1,1354
1295,1_0,1365
1296,0_1,1343
1296,1_0,1341
1297,0_1,1367
1297,1_0,1356
1298,0_1,1357
1298,1_0,1325
1299,0_1,1357
1299,1_0,1365
1300,0_1,1353
1300,1_0,1356
1301,0_1,1364
1301,1_0,1378
1302,0_1,1361
1302,1_0,1363
1303,0_1,1357
1303,1_0,1336
1304,0_1,1404
1304,1_0,1339
1305,0_1,1396
1305,1_0,1293
1306,0_1,1404
1306,1_0,1304
1307,0_1,1410
1307,1_0,1278
1308,0_1,1417
1308,1_0,1282
1309,0_1,1399
1309,1_0,1312
1310,0_1,1376
1310,1_0,1282
1311,0_1,1393
1311,1_0,1305
1312,0_1,1388
1312,1_0,1295
1313,0_1,1378
1313,1_0,1299
1314,0_1,1363
1314,1_0,1308
1315,0_1,1371
1315,1_0,1333
1316,0_1,1356
1316,1_0,1359
1317,0_1,1333
1317,1_0,1370
1318,0_1,1319
1318,1_0,1378
1319,0_1,1299
1319,1_0,1373
1320,0_1,1312
1320,1_0,1364
1321,0_1,1326
1321,1_0,1345
1322,0_1,1342
1322,1_0,1343
1323,0_1,1344
1323,1_0,1337
1324,0_1,1378
1324,1_0,1358
1325,0_1,1358
1325,1_0,1339
1326,0_1,1354
1326,1_0,1353
1327,0_1,1369
1327,1_0,1380
1328,0_1,1356
1328,1_0,1391
1329,0_1,1374
1329,1_0,1404
1330,0_1,1381
1330,1_0,1371
1331,0_1,1397
1331,1_0,1349
1332,0_1,1395
1332,1_0,1367
1333,0_1,1390
1333,1_0,1369
1334,0_1,1377
1334,1_0,1403
1335,0_1,1385
1335,1_0,1378
1336,0_1,1370
1336,1_0,1388
1337,0_1,1380
1337,1_0,1371
1338,0_1,1366
1338,1_0,1396
1339,0_1,1352
1339,1_0,1369
1340,0_1,1351
1340,1_0,1374
1341,0_1,1328
1341,1_0,1362
1342,0_1,1330
1342,1_0,1354
1343,0_1,1331
1343,1_0,1337
1344,0_1,1330
1344,1_0,1338
1345,0_1,1344
1345,1_0,1348
1346,0_1,1323
1346,1_0,1369
1347,0_1,1322
1347,1_0,1353
1348,0_1,1350
1348,1_0,1349
1349,0_1,1374
1349,1_0,1338
1350,0_1,1387
1350,1_0,1317
1351,0_1,1382
1351,1_0,1363
1352,0_1,1360
1352,1_0,1346
1353,0_1,1369
1353,1_0,1368
1354,0_1,1364
1354,1_0,1386
1355,0_1,1351
1355,1_0,1401
1356,0_1,1366
1356,1_0,1375
1357,0_1,1383
1357,1_0,1392
1358,0_1,1386
1358,1_0,1399
1359,0_1,1391
1359,1_0,1395
1360,0_1,1367
1360,1_0,1367
1361,0_1,1374
1361,1_0,1383
1362,0_1,1362
1362,1_0,1363
1363,0_1,1367
1363,1_0,1359
1364,0_1,1378
1364,1_0,1370
1365,0_1,1384
1365,1_0,1375
1366,0_1,1385
1366,1_0,1373
1367,0_1,1371
1367,1_0,1358
1368,0_1,1360
1368,1_0,1364
1369,0_1,1391
1369,1_0,1394
1370,0_1,1394
1370,1_0,1381
1371,0_1,1405
1371,1_0,1350
1372,0_1,1426
1372,1_0,1368
1373,0_1,1424
1373,1_0,1342
1374,0_1,1442
1374,1_0,1333
1375,0_1,1420
1375,1_0,1327
1376,0_1,1411
1376,1_0,1364
1377,0_1,1417
1377,1_0,1366
1378,0_1,1420
1378,1_0,1387
1379,0_1,1451
1379,1_0,1394
1380,0_1,1432
1380,1_0,1362
1381,0_1,1438
1381,1_0,1352
1382,0_1,1439
1382,1_0,1372
1383,0_1,1443
1383,1_0,1377
1384,0_1,1426
1384,1_0,1370
1385,0_1,1425
1385,1_0,1419
1386,0_1,1422
1386,1_0,1412
1387,0_1,1392
1387,1_0,1425
1388,0_1,1384
1388,1_0,1435
1389,0_1,1385
1389,1_0,1440
1390,0_1,1373
1390,1_0,1426
1391,0_1,1400
1391,1_0,1402
1392,0_1,1426
1392,1_0,1394
1393,0_1,1397
1393,1_0,1388
1394,0_1,1402
1394,1_0,1400
1395,0_1,1387
1395,1_0,1389
1396,0_1,1400
1396,1_0,1416
1397,0_1,1380
1397,1_0,1393
1398,0_1,1385
1398,1_0,1437
1399,0_1,1387
1399,1_0,1422
1400,0_1,1359
1400,1_0,1425
1401,0_1,1384
1401,1_0,1434
1402,0_1,1374
1402,1_0,1427
1403,0_1,1362
1403,1_0,1429
1404,0_1,1360
1404,1_0,1411
1405,0_1,1373
1405,1_0,1384
1406,0_1,1384
1406,1_0,1387
1407,0_1,1382
1407,1_0,1374
1408,0_1,1366
1408,1_0,1382
1409,0_1,1391
1409,1_0,1371
1410,0_1,1369
1410,1_0,1362
1411,0_1,1375
1411,1_0,1369
1412,0_1,1364
1412,1_0,1392
1413,0_1,1358
1413,1_0,1380
1414,0_1,1359
1414,1_0,1387
1415,0_1,1389
1415,1_0,1370
1416,0_1,1378
1416,1_0,1394
1417,0_1,1386
1417,1_0,1385
1418,0_1,1344
1418,1_0,1375
1419,0_1,1380
1419,1_0,1371
1420,0_1,1384
1420,1_0,1367
1421,0_1,1384
1421,1_0,1340
1422,0_1,1384
1422,1_0,1383
1423,0_1,1364
1423,1_0,1387
1424,0_1,1347
1424,1_0,1386
1425,0_1,1372
1425,1_0,1398
1426,0_1,1357
1426,1_0,1407
1427,0_1,1365
1427,1_0,1397
1428,0_1,1366
1428,1_0,1379
1429,0_1,1389
1429,1_0,1397
1430,0_1,1362
1430,1_0,1382
1431,0_1,1362
1431,1_0,1396
1432,0_1,1346
1432,1_0,1395
1433,0_1,1363
1433,1_0,1396
1434,0_1,1331
1434,1_0,1389
1435,0_1,1337
1435,1_0,1417
1436,0_1,1327
1436,1_0,1412
1437,0_1,1310
1437,1_0,1436
1438,0_1,1284
1438,1_0,1388
1439,0_1,1298
1439,1_0,1373
1440,0_1,1311
1440,1_0,1367
1441,0_1,1320
1441,1_0,1372
1442,0_1,1323
1442,1_0,1350
1443,0_1,1338
1443,1_0,1360
1444,0_1,1328
1444,1_0,1343
1445,0_1,1325
1445,1_0,1353
1446,0_1,1332
1446,1_0,1351
1447,0_1,1317
1447,1_0,1332
1448,0_1,1341
1448,1_0,1349
1449,0_1,1357
1449,1_0,1326
1450,0_1,1345
1450,1_0,1333
1451,0_1,1358
1451,1_0,1350
1452,0_1,1361
1452,1_0,1364
1453,0_1,1358
1453,1_0,1362
1454,0_1,1352
1454,1_0,1353
1455,0_1,1372
1455,1_0,1351
1456,0_1,1353
1456,1_0,1365
1457,0_1,1333
1457,1_0,1335
1458,0_1,1343
1458,1_0,1342
1459,0_1,1334
1459,1_0,1384
1460,0_1,1313
1460,1_0,1379
1461,0_1,1356
1461,1_0,1390
1462,0_1,1347
1462,1_0,1367
1463,0_1,1343
1463,1_0,1379
1464,0_1,1353
1464,1_0,1406
1465,0_1,1328
1465,1_0,1410
1466,0_1,1348
1466,1_0,1405
1467,0_1,1339
1467,1_0,1381
1468,0_1,1364
1468,1_0,1383
1469,0_1,1368
1469,1_0,1401
1470,0_1,1363
1470,1_0,1377
1471,0_1,1365
1471,1_0,1382
1472,0_1,1388
1472,1_0,1377
1473,0_1,1378
1473,1_0,1360
1474,0_1,1356
1474,1_0,1364
1475,0_1,1332
1475,1_0,1377
1476,0_1,1340
1476,1_0,1363
1477,0_1,1296
1477,1_0,1341
1478,0_1,1311
1478,1_0,1371
1479,0_1,1316
1479,1_0,1388
1480,0_1,1309
1480,1_0,1388
1481,0_1,1301
1481,1_0,1390
1482,0_1,1299
1482,1_0,1404
1483,0_1,1282
1483,1_0,1399
1484,0_1,1271
1484,1_0,1409
1485,0_1,1280
1485,1_0,1415
1486,0_1,1305
1486,1_0,1409
1487,0_1,1293
1487,1_0,1391
1488,0_1,1280
1488,1_0,1403
1489,0_1,1325
1489,1_0,1410
1490,0_1,1318
1490,1_0,1400
1491,0_1,1313
1491,1_0,1383
1492,0_1,1304
1492,1_0,1376
1493,0_1,1305
1493,1_0,1387
1494,0_1,1305
1494,1_0,1373
1495,0_1,1334
1495,1_0,1364
1496,0_1,1338
1496,1_0,1335
1497,0_1,1309
1497,1_0,1332
1498,0_1,1319
1498,1_0,1322
1499,0_1,1331
1499,1_0,1319
1500,0_1,1346
1500,1_0,1337
1501,0_1,1344
1501,1_0,1343
1502,0_1,1340
1502,1_0,1328
1503,0_1,1344
1503,1_0,1336
1504,0_1,1354
1504,1_0,1340
1505,0_1,1342
1505,1_0,1351
1506,0_1,1338
1506,1_0,1375
1507,0_1,1340
1507,1_0,1359
1508,0_1,1349
1508,1_0,1361
1509,0_1,1346
1509,1_0,1354
1510,0_1,1355
1510,1_0,1355
1511,0_1,1350
1511,1_0,1361
1512,0_1,1364
1512,1_0,1347
1513,0_1,1374
1513,1_0,1347
1514,0_1,1359
1514,1_0,1359
1515,0_1,1358
1515,1_0,1347
1516,0_1,1376
1516,1_0,1349
1517,0_1,1354
1517,1_0,1362
1518,0_1,1345
1518,1_0,1362
1519,0_1,1373
1519,1_0,1320
1520,0_1,1402
1520,1_0,1332
1521,0_1,1419
1521,1_0,1316
1522,0_1,1421
1522,1_0,1320
1523,0_1,1368
1523,1_0,1322
1524,0_1,1409
1524,1_0,1318
1525,0_1,1389
1525,1_0,1347
1526,0_1,1375
1526,1_0,1373
1527,0_1,1368
1527,1_0,1378
1528,0_1,1376
1528,1_0,1342
1529,0_1,1398
1529,1_0,1365
1530,0_1,1395
1530,1_0,1329
1531,0_1,1411
1531,1_0,1326
1532,0_1,1413
1532,1_0,1321
1533,0_1,1408
1533,1_0,1327
1534,0_1,1408
1534,1_0,1315
1535,0_1,1417
1535,1_0,1311
1536,0_1,1392
1536,1_0,1318
1537,0_1,1394
1537,1_0,1326
1538,0_1,1403
1538,1_0,1302
1539,0_1,1425
1539,1_0,1318
1540,0_1,1401
1540,1_0,1327
1541,0_1,1387
1541,1_0,1331
1542,0_1,1392
1542,1_0,1351
1543,0_1,1381
1543,1_0,1369
1544,0_1,1391
1544,1_0,1344
1545,0_1,1386
1545,1_0,1353
1546,0_1,1383
1546,1_0,1363
1547,0_1,1383
1547,1_0,1349
1548,0_1,1425
1548,1_0,1349
1549,0_1,1406
1549,1_0,1343
1550,0_1,1414
1550,1_0,1346
1551,0_1,1404
1551,1_0,1330
1552,0_1,1421
1552,1_0,1327
1553,0_1,1412
1553,1_0,1322
1554,0_1,1415
1554,1_0,1349
1555,0_1,1420
1555,1_0,1323
1556,0_1,1412
1556,1_0,1351
1557,0_1,1427
1557,1_0,1362
1558,0_1,1406
1558,1_0,1349
1559,0_1,1392
1559,1_0,1336
1560,0_1,1392
1560,1_0,1333
1561,0_1,1415
1561,1_0,1317
1562,0_1,1416
1562,1_0,1304
1563,0_1,1421
1563,1_0,1330
1564,0_1,1449
1564,1_0,1320
1565,0_1,1417
1565,1_0,1304
1566,0_1,1416
1566,1_0,1342
1567,0_1,1382
1567,1_0,1336
1568,0_1,1383
1568,1_0,1370
1569,0_1,1351
1569,1_0,1359
1570,0_1,1361
1570,1_0,1393
1571,0_1,1344
1571,1_0,1375
1572,0_1,1367
1572,1_0,1377
1573,0_1,1352
1573,1_0,1405
1574,0_1,1345
1574,1_0,1364
1575,0_1,1348
1575,1_0,1376
1576,0_1,1358
1576,1_0,1388
1577,0_1,1369
1577,1_0,1391
1578,0_1,1359
1578,1_0,1378
1579,0_1,1375
1579,1_0,1369
1580,0_1,1388
1580,1_0,1380
1581,0_1,1391
1581,1_0,1359
1582,0_1,1398
1582,1_0,1350
1583,0_1,1398
1583,1_0,1324
1584,0_1,1390
1584,1_0,1353
1585,0_1,1387
1585,1_0,1342
1586,0_1,1406
1586,1_0,1356
1587,0_1,1415
1587,1_0,1361
1588,0_1,1405
1588,1_0,1344
1589,0_1,1404
1589,1_0,1330
1590,0_1,1398
1590,1_0,1360
1591,0_1,1399
1591,1_0,1354
1592,0_1,1405
1592,1_0,1341
1593,0_1,1422
1593,1_0,1343
1594,0_1,1404
1594,1_0,1363
1595,0_1,1375
1595,1_0,1383
1596,0_1,1343
1596,1_0,1385
1597,0_1,1342
1597,1_0,1390
1598,0_1,1384
1598,1_0,1400
1599,0_1,1404
1599,1_0,1394
1600,0_1,1376
1600,1_0,1381
1601,0_1,1386
1601,1_0,1381
1602,0_1,1392
1602,1_0,1401
1603,0_1,1371
1603,1_0,1387
1604,0_1,1395
1604,1_0,1377
1605,0_1,1372
1605,1_0,1380
1606,0_1,1370
1606,1_0,1384
1607,0_1,1387
1607,1_0,1390
1608,0_1,1393
1608,1_0,1375
1609,0_1,1390
1609,1_0,1360
1610,0_1,1381
1610,1_0,1348
1611,0_1,1407
1611,1_0,1347
1612,0_1,1410
1612,1_0,1343
1613,0_1,1387
1613,1_0,1352
1614,0_1,1389
1614,1_0,1340
1615,0_1,1415
1615,1_0,1363
1616,0_1,1393
1616,1_0,1367
1617,0_1,1398
1617,1_0,1334
1618,0_1,1388
1618,1_0,1361
1619,0_1,1374
1619,1_0,1366
1620,0_1,1397
1620,1_0,1381
1621,0_1,1392
1621,1_0,1392
1622,0_1,1386
1622,1_0,1374
1623,0_1,1404
1623,1_0,1389
1624,0_1,1366
1624,1_0,1369
1625,0_1,1364
1625,1_0,1382
1626,0_1,1379
1626,1_0,1416
1627,0_1,1366
1627,1_0,1402
1628,0_1,1362
1628,1_0,1406
1629,0_1,1338
1629,1_0,1402
1630,0_1,1340
1630,1_0,1387
1631,0_1,1347
1631,1_0,1409
1632,0_1,1344
1632,1_0,1419
1633,0_1,1341
1633,1_0,1395
1634,0_1,1358
1634,1_0,1395
1635,0_1,1354
1635,1_0,1379
1636,0_1,1353
1636,1_0,1396
1637,0_1,1342
1637,1_0,1402
1638,0_1,1326
1638,1_0,1398
1639,0_1,1340
1639,1_0,1391
1640,0_1,1358
1640,1_0,1391
1641,0_1,1369
1641,1_0,1384
1642,0_1,1347
1642,1_0,1373
1643,0_1,1356
1643,1_0,1360
1644,0_1,1349
1644,1_0,1358
1645,0_1,1372
1645,1_0,1382
1646,0_1,1419
1646,1_0,1356
1647,0_1,1389
1647,1_0,1357
1648,0_1,1388
1648,1_0,1359
1649,0_1,1393
1649,1_0,1393
1650,0_1,1370
1650,1_0,1361
1651,0_1,1380
1651,1_0,1379
1652,0_1,1356
1652,1_0,1398
1653,0_1,1348
1653,1_0,1402
1654,0_1,1347
1654,1_0,1417
1655,0_1,1349
1655,1_0,1419
1656,0_1,1353
1656,1_0,1404
1657,0_1,1356
1657,1_0,1400
1658,0_1,1355
1658,1_0,1410
1659,0_1,1379
1659,1_0,1389
1660,0_1,1356
1660,1_0,1385
1661,0_1,1376
1661,1_0,1397
1662,0_1,1381
1662,1_0,1394
1663,0_1,1380
1663,1_0,1370
1664,0_1,1404
1664,1_0,1354
1665,0_1,1427
1665,1_0,1378
1666,0_1,1419
1666,1_0,1360
1667,0_1,1410
1667,1_0,1389
1668,0_1,1404
1668,1_0,1391
1669,0_1,1374
1669,1_0,1395
1670,0_1,1374
1670,1_0,1394
1671,0_1,1388
1671,1_0,1393
1672,0_1,1375
1672,1_0,1406
1673,0_1,1377
1673,1_0,1398
1674,0_1,1386
1674,1_0,1402
1675,0_1,1375
1675,1_0,1424
1676,0_1,1380
1676,1_0,1421
1677,0_1,1367
1677,1_0,1436
1678,0_1,1380
1678,1_0,1421
1679,0_1,1378
1679,1_0,1407
1680,0_1,1381
1680,1_0,1411
1681,0_1,1406
1681,1_0,1412
1682,0_1,1409
1682,1_0,1377
1683,0_1,1407
1683,1_0,1371
1684,0_1,1407
1684,1_0,1411
1685,0_1,1389
1685,1_0,1406
1686,0_1,1387
1686,1_0,1443
1687,0_1,1361
1687,1_0,1424
1688,0_1,1378
1688,1_0,1404
1689,0_1,1385
1689,1_0,1420
1690,0_1,1374
1690,1_0,1409
1691,0_1,1380
1691,1_0,1405
1692,0_1,1391
1692,1_0,1403
1693,0_1,1358
1693,1_0,1373
1694,0_1,1364
1694,1_0,1385
1695,0_1,1362
1695,1_0,1383
1696,0_1,1379
1696,1_0,1380
1697,0_1,1380
1697,1_0,1366
1698,0_1,1380
1698,1_0,1384
1699,0_1,1379
1699,1_0,1395
1700,0_1,1369
1700,1_0,1392
1701,0_1,1383
1701,1_0,1375
1702,0_1,1376
1702,1_0,1374
1703,0_1,1365
1703,1_0,1336
1704,0_1,1376
1704,1_0,1364
1705,0_1,1346
1705,1_0,1352
1706,0_1,1325
1706,1_0,1341
1707,0_1,1325
1707,1_0,1317
1708,0_1,1327
1708,1_0,1324
1709,0_1,1311
1709,1_0,1327
1710,0_1,1299
1710,1_0,1330
1711,0_1,1312
1711,1_0,1324
1712,0_1,1354
1712,1_0,1335
1713,0_1,1349
1713,1_0,1351
1714,0_1,1398
1714,1_0,1338
1715,0_1,1375
1715,1_0,1314
1716,0_1,1392
1716,1_0,1358
1717,0_1,1370
1717,1_0,1364
1718,0_1,1382
1718,1_0,1353
1719,0_1,1387
1719,1_0,1365
1720,0_1,1396
1720,1_0,1352
1721,0_1,1407
1721,1_0,1351
1722,0_1,1381
1722,1_0,1345
1723,0_1,1381
1723,1_0,1359
1724,0_1,1390
1724,1_0,1372
1725,0_1,1388
1725,1_0,1383
1726,0_1,1382
1726,1_0,1367
1727,0_1,1367
1727,1_0,1373
1728,0_1,1364
1728,1_0,1393
1729,0_1,1344
1729,1_0,1397
1730,0_1,1344
1730,1_0,1416
1731,0_1,1366
1731,1_0,1383
1732,0_1,1379
1732,1_0,1366
1733,0_1,1390
1733,1_0,1370
1734,0_1,1382
1734,1_0,1384
1735,0_1,1371
1735,1_0,1382
1736,0_1,1368
1736,1_0,1404
1737,0_1,1350
1737,1_0,1392
1738,0_1,1340
1738,1_0,1413
1739,0_1,1341
1739,1_0,1406
1740,0_1,1325
1740,1_0,1404
1741,0_1,1353
1741,1_0,1413
1742,0_1,1340
1742,1_0,1416
1743,0_1,1367
1743,1_0,1418
1744,0_1,1390
1744,1_0,1391
1745,0_1,1378
1745,1_0,1385
1746,0_1,1383
1746,1_0,1397
1747,0_1,1374
1747,1_0,1389
1748,0_1,1362
1748,1_0,1408
1749,0_1,1355
1749,1_0,1400
1750,0_1,1377
1750,1_0,1405
1751,0_1,1350
1751,1_0,1367
1752,0_1,1366
1752,1_0,1394
1753,0_1,1384
1753,1_0,1391
1754,0_1,1386
1754,1_0,1392
1755,0_1,1380
1755,1_0,1376
1756,0_1,1387
1756,1_0,1359
1757,0_1,1407
1757,1_0,1361
1758,0_1,1406
1758,1_0,1359
1759,0_1,1382
1759,1_0,1350
1760,0_1,1380
1760,1_0,1379
1761,0_1,1381
1761,1_0,1362
1762,0_1,1347
1762,1_0,1345
1763,0_1,1368
1763,1_0,1364
1764,0_1,1389
1764,1_0,1363
1765,0_1,1382
1765,1_0,1357
1766,0_1,1371
1766,1_0,1373
1767,0_1,1373
1767,1_0,1366
1768,0_1,1359
1768,1_0,1376
1769,0_1,1360
1769,1_0,1382
1770,0_1,1368
1770,1_0,1399
1771,0_1,1346
1771,1_0,1382
1772,0_1,1363
1772,1_0,1382
1773,0_1,1376
1773,1_0,1374
1774,0_1,1394
1774,1_0,1369
1775,0_1,1400
1775,1_0,1364
1776,0_1,1381
1776,1_0,1361
1777,0_1,1388
1777,1_0,1394
1778,0_1,1359
1778,1_0,1403
1779,0_1,1352
1779,1_0,1370
1780,0_1,1370
1780,1_0,1377
1781,0_1,1358
1781,1_0,1378
1782,0_1,1340
1782,1_0,1406
1783,0_1,1337
1783,1_0,1400
1784,0_1,1342
1784,1_0,1386
1785,0_1,1342
1785,1_0,1418
1786,0_1,1352
1786,1_0,1430
1787,0_1,1326
1787,1_0,1423
1788,0_1,1348
1788,1_0,1403
1789,0_1,1350
1789,1_0,1398
1790,0_1,1346
1790,1_0,1400
1791,0_1,1341
1791,1_0,1411
1792,0_1,1328
1792,1_0,1367
1793,0_1,1376
1793,1_0,1404
1794,0_1,1377
1794,1_0,1406
1795,0_1,1363
1795,1_0,1398
1796,0_1,1365
1796,1_0,1404
1797,0_1,1327
1797,1_0,1387
1798,0_1,1381
1798,1_0,1401
1799,0_1,1337
1799,1_0,1373
1800,0_1,1344
1800,1_0,1384
1801,0_1,1352
1801,1_0,1385
1802,0_1,1357
1802,1_0,1394
1803,0_1,1343
1803,1_0,1374
1804,0_1,1324
1804,1_0,1396
1805,0_1,1328
1805,1_0,1383
1806,0_1,1343
1806,1_0,1412
1807,0_1,1315
1807,1_0,1403
1808,0_1,1333
1808,1_0,1411
1809,0_1,1334
1809,1_0,1412
1810,0_1,1343
1810,1_0,1398
1811,0_1,1344
1811,1_0,1375
1812,0_1,1355
1812,1_0,1374
1813,0_1,1337
1813,1_0,1365
1814,0_1,1381
1814,1_0,1394
1815,0_1,1354
1815,1_0,1411
1816,0_1,1351
1816,1_0,1419
1817,0_1,1346
1817,1_0,1423
1818,0_1,1351
1818,1_0,1416
1819,0_1,1374
1819,1_0,1406
1820,0_1,1351
1820,1_0,1387
1821,0_1,1378
1821,1_0,1401
1822,0_1,1377
1822,1_0,1396
1823,0_1,1357
1823,1_0,1419
1824,0_1,1379
1824,1_0,1405
1825,0_1,1379
1825,1_0,1384
1826,0_1,1393
1826,1_0,1363
1827,0_1,1374
1827,1_0,1362
1828,0_1,1379
1828,1_0,1383
1829,0_1,1374
1829,1_0,1385
1830,0_1,1382
1830,1_0,1367
1831,0_1,1391
1831,1_0,1354
1832,0_1,1402
1832,1_0,1367
1833,0_1,1411
1833,1_0,1358
1834,0_1,1403
1834,1_0,1337
1835,0_1,1413
1835,1_0,1363
1836,0_1,1397
1836,1_0,1350
1837,0_1,1399
1837,1_0,1340
1838,0_1,1404
1838,1_0,1337
1839,0_1,1414
1839,1_0,1322
1840,0_1,1408
1840,1_0,1314
1841,0_1,1423
1841,1_0,1346
1842,0_1,1418
1842,1_0,1333
1843,0_1,1421
1843,1_0,1316
1844,0_1,1412
1844,1_0,1334
1845,0_1,1415
1845,1_0,1356
1846,0_1,1381
1846,1_0,1347
1847,0_1,1396
1847,1_0,1359
1848,0_1,1380
1848,1_0,1363
1849,0_1,1365
1849,1_0,1375
1850,0_1,1359
1850,1_0,1369
1851,0_1,1370
1851,1_0,1345
1852,0_1,1368
1852,1_0,1362
1853,0_1,1360
1853,1_0,1372
1854,0_1,1357
1854,1_0,1367
1855,0_1,1367
1855,1_0,1360
1856,0_1,1365
1856,1_0,1389
1857,0_1,1366
1857,1_0,1361
1858,0_1,1363
1858,1_0,1367
1859,0_1,1356
1859,1_0,1376
1860,0_1,1357
1860,1_0,1365
1861,0_1,1347
1861,1_0,1382
1862,0_1,1344
1862,1_0,1380
1863,0_1,1332
1863,1_0,1406
1864,0_1,1322
1864,1_0,1429
1865,0_1,1327
1865,1_0,1418
1866,0_1,1342
1866,1_0,1411
1867,0_1,1336
1867,1_0,1415
1868,0_1,1353
1868,1_0,1402
1869,0_1,1343
1869,1_0,1381
1870,0_1,1375
1870,1_0,1376
1871,0_1,1394
1871,1_0,1358
1872,0_1,1396
1872,1_0,1346
1873,0_1,1384
1873,1_0,1328
1874,0_1,1398
1874,1_0,1334
1875,0_1,1389
1875,1_0,1334
1876,0_1,1395
1876,1_0,1369
1877,0_1,1398
1877,1_0,1347
1878,0_1,1379
1878,1_0,1355
1879,0_1,1381
1879,1_0,1363
1880,0_1,1368
1880,1_0,1361
1881,0_1,1344
1881,1_0,1380
1882,0_1,1347
1882,1_0,1359
1883,0_1,1362
1883,1_0,1348
1884,0_1,1359
1884,1_0,1379
1885,0_1,1372
1885,1_0,1379
1886,0_1,1383
1886,1_0,1381
1887,0_1,1410
1887,1_0,1382
1888,0_1,1380
1888,1_0,1368
1889,0_1,1387
1889,1_0,1362
1890,0_1,1385
1890,1_0,1358
1891,0_1,1357
1891,1_0,1388
1892,0_1,1379
1892,1_0,1384
1893,0_1,1357
1893,1_0,1373
1894,0_1,1354
1894,1_0,1388
1895,0_1,1365
1895,1_0,1378
1896,0_1,1383
1896,1_0,1375
1897,0_1,1370
1897,1_0,1386
1898,0_1,1375
1898,1_0,1387
1899,0_1,1364
1899,1_0,1393
1900,0_1,1357
1900,1_0,1391
1901,0_1,1364
1901,1_0,1383
1902,0_1,1375
1902,1_0,1384
1903,0_1,1370
1903,1_0,1392
1904,0_1,1353
1904,1_0,1375
1905,0_1,1371
1905,1_0,1392
1906,0_1,1393
1906,1_0,1402
1907,0_1,1386
1907,1_0,1409
1908,0_1,1380
1908,1_0,1413
1909,0_1,1384
1909,1_0,1388
1910,0_1,1411
1910,1_0,1406
1911,0_1,1391
1911,1_0,1392
1912,0_1,1391
1912,1_0,1403
1913,0_1,1386
1913,1_0,1390
1914,0_1,1367
1914,1_0,1406
1915,0_1,1337
1915,1_0,1386
1916,0_1,1351
1916,1_0,1380
1917,0_1,1349
1917,1_0,1373
1918,0_1,1354
1918,1_0,1387
1919,0_1,1340
1919,1_0,1397
1920,0_1,1328
1920,1_0,1397
1921,0_1,1348
1921,1_0,1402
1922,0_1,1335
1922,1_0,1384
1923,0_1,1350
1923,1_0,1381
1924,0_1,1354
1924,1_0,1399
1925,0_1,1379
1925,1_0,1391
1926,0_1,1349
1926,1_0,1393
1927,0_1,1360
1927,1_0,1393
1928,0_1,1373
1928,1_0,1385
1929,0_1,1353
1929,1_0,1394
1930,0_1,1365
1930,1_0,1390
1931,0_1,1381
1931,1_0,1369
1932,0_1,1385
1932,1_0,1382
1933,0_1,1413
1933,1_0,1360
1934,0_1,1413
1934,1_0,1339
1935,0_1,1382
1935,1_0,1338
1936,0_1,1408
1936,1_0,1351
1937,0_1,1394
1937,1_0,1364
1938,0_1,1361
1938,1_0,1367
1939,0_1,1366
1939,1_0,1365
1940,0_1,1366
1940,1_0,1372
1941,0_1,1370
1941,1_0,1358
1942,0_1,1369
1942,1_0,1341
1943,0_1,1397
1943,1_0,1339
1944,0_1,1387
1944,1_0,1336
1945,0_1,1386
1945,1_0,1331
1946,0_1,1399
1946,1_0,1341
1947,0_1,1423
1947,1_0,1353
1948,0_1,1384
1948,1_0,1332
1949,0_1,1381
1949,1_0,1371
1950,0_1,1364
1950,1_0,1365
1951,0_1,1362
1951,1_0,1384
1952,0_1,1363
1952,1_0,1394
1953,0_1,1370
1953,1_0,1371
1954,0_1,1390
1954,1_0,1347
1955,0_1,1382
1955,1_0,1339
1956,0_1,1423
1956,1_0,1312
1957,0_1,1405
1957,1_0,1306
1958,0_1,1409
1958,1_0,1313
1959,0_1,1390
1959,1_0,1318
1960,0_1,1389
1960,1_0,1346
1961,0_1,1409
1961,1_0,1330
1962,0_1,1403
1962,1_0,1340
1963,0_1,1387
1963,1_0,1321
1964,0_1,1351
1964,1_0,1312
1965,0_1,1328
1965,1_0,1271
1966,0_1,1350
1966,1_0,1297
1967,0_1,1348
1967,1_0,1336
1968,0_1,1352
1968,1_0,1352
1969,0_1,1314
1969,1_0,1359
1970,0_1,1304
1970,1_0,1395
1971,0_1,1296
1971,1_0,1389
1972,0_1,1295
1972,1_0,1376
1973,0_1,1308
1973,1_0,1368
1974,0_1,1304
1974,1_0,1382
1975,0_1,1309
1975,1_0,1359
1976,0_1,1317
1976,1_0,1365
1977,0_1,1306
1977,1_0,1365
1978,0_1,1309
1978,1_0,1343
1979,0_1,1323
1979,1_0,1359
1980,0_1,1337
1980,1_0,1336
1981,0_1,1338
1981,1_0,1352
1982,0_1,1347
1982,1_0,1377
1983,0_1,1361
1983,1_0,1379
1984,0_1,1369
1984,1_0,1387
1985,0_1,1369
1985,1_0,1387
1986,0_1,1376
1986,1_0,1383
1987,0_1,1374
1987,1_0,1375
1988,0_1,1379
1988,1_0,1391
1989,0_1,1372
1989,1_0,1370
1990,0_1,1380
1990,1_0,1374
1991,0_1,1387
1991,1_0,1375
1992,0_1,1390
1992,1_0,1362
1993,0_1,1389
1993,1_0,1392
1994,0_1,1384
1994,1_0,1393
1995,0_1,1359
1995,1_0,1393
1996,0_1,1355
1996,1_0,1399
1997,0_1,1375
1997,1_0,1387
1998,0_1,1358
1998,1_0,1388
1999,0_1,1335
1999,1_0,1363
2000,0_1,1346
2000,1_0,1383
2001,0_1,1351
2001,1_0,1370
2002,0_1,1374
2002,1_0,1393
2003,0_1,1358
2003,1_0,1394
2004,0_1,1342
2004,1_0,1384
2005,0_1,1340
2005,1_0,1408
2006,0_1,1357
2006,1_0,1377
2007,0_1,1362
2007,1_0,1378
2008,0_1,1359
2008,1_0,1368
2009,0_1,1341
2009,1_0,1351
2010,0_1,1354
2010,1_0,1345
2011,0_1,1379
2011,1_0,1364
2012,0_1,1376
2012,1_0,1372
2013,0_1,1369
2013,1_0,1370
2014,0_1,1378
2014,1_0,1353
2015,0_1,1393
2015,1_0,1346
2016,0_1,1403
2016,1_0,1331
2017,0_1,1405
2017,1_0,1354
2018,0_1,1425
2018,1_0,1362
2019,0_1,1424
2019,1_0,1355
2020,0_1,1418
2020,1_0,1355
2021,0_1,1411
2021,1_0,1370
2022,0_1,1405
2022,1_0,1384
2023,0_1,1360
2023,1_0,1390
2024,0_1,1353
2024,1_0,1411
2025,0_1,1359
2025,1_0,1384
2026,0_1,1354
2026,1_0,1393
2027,0_1,1368
2027,1_0,1395
2028,0_1,1350
2028,1_0,1382
2029,0_1,1368
2029,1_0,1387
2030,0_1,1356
2030,1_0,1388
2031,0_1,1369
2031,1_0,1381
2032,0_1,1367
2032,1_0,1377
2033,0_1,1367
2033,1_0,1382
2034,0_1,1370
2034,1_0,1378
2035,0_1,1351
2035,1_0,1371
2036,0_1,1336
2036,1_0,1386
2037,0_1,1338
2037,1_0,1410
2038,0_1,1361
2038,1_0,1394
2039,0_1,1357
2039,1_0,1389
2040,0_1,1364
2040,1_0,1382
2041,0_1,1349
2041,1_0,1389
2042,0_1,1360
2042,1_0,1396
2043,0_1,1341
2043,1_0,1413
2044,0_1,1323
2044,1_0,1379
2045,0_1,1333
2045,1_0,1385
2046,0_1,1342
2046,1_0,1349
2047,0_1,1346
2047,1_0,1352
2048,0_1,1334
2048,1_0,1344
2049,0_1,1352
2049,1_0,1337
2050,0_1,1368
2050,1_0,1341
2051,0_1,1375
2051,1_0,1333
2052,0_1,1355
2052,1_0,1317
2053,0_1,1366
2053,1_0,1317
2054,0_1,1359
2054,1_0,1332
2055,0_1,1371
2055,1_0,1318
2056,0_1,1339
2056,1_0,1320
2057,0_1,1349
2057,1_0,1300
2058,0_1,1379
2058,1_0,1318
2059,0_1,1368
2059,1_0,1302
2060,0_1,1375
2060,1_0,1307
2061,0_1,1380
2061,1_0,1324
2062,0_1,1382
2062,1_0,1331
2063,0_1,1367
2063,1_0,1336
2064,0_1,1377
2064,1_0,1303
2065,0_1,1363
2065,1_0,1307
2066,0_1,1375
2066,1_0,1289
2067,0_1,1377
2067,1_0,1295
2068,0_1,1375
2068,1_0,1297
2069,0_1,1378
2069,1_0,1313
2070,0_1,1365
2070,1_0,1331
2071,0_1,1313
2071,1_0,1336
2072,0_1,1300
2072,1_0,1314
2073,0_1,1312
2073,1_0,1366
2074,0_1,1303
2074,1_0,1350
2075,0_1,1287
2075,1_0,1334
2076,0_1,1323
2076,1_0,1351
2077,0_1,1329
2077,1_0,1343
2078,0_1,1358
2078,1_0,1336
2079,0_1,1326
2079,1_0,1325
2080,0_1,1338
2080,1_0,1345
2081,0_1,1360
2081,1_0,1324
2082,0_1,1368
2082,1_0,1358
2083,0_1,1371
2083,1_0,1334
2084,0_1,1379
2084,1_0,1358
2085,0_1,1359
2085,1_0,1343
2086,0_1,1369
2086,1_0,1349
2087,0_1,1371
2087,1_0,1366
2088,0_1,1360
2088,1_0,1354
2089,0_1,1381
2089,1_0,1356
2090,0_1,1386
2090,1_0,1343
2091,0_1,1371
2091,1_0,1351
2092,0_1,1366
2092,1_0,1362
2093,0_1,1364
2093,1_0,1391
2094,0_1,1342
2094,1_0,1385
2095,0_1,1328
2095,1_0,1399
2096,0_1,1328
2096,1_0,1425
2097,0_1,1338
2097,1_0,1409
2098,0_1,1344
2098,1_0,1397
2099,0_1,1346
2099,1_0,1420
2100,0_1,1344
2100,1_0,1417
2101,0_1,1336
2101,1_0,1412
2102,0_1,1353
2102,1_0,1430
2103,0_1,1348
2103,1_0,1411
2104,0_1,1346
2104,1_0,1421
2105,0_1,1353
2105,1_0,1414
2106,0_1,1360
2106,1_0,1433
2107,0_1,1347
2107,1_0,1433
2108,0_1,1368
2108,1_0,1418
2109,0_1,1381
2109,1_0,1417
2110,0_1,1374
2110,1_0,1413
2111,0_1,1357
2111,1_0,1418
2112,0_1,1357
2112,1_0,1393
2113,0_1,1373
2113,1_0,1394
2114,0_1,1385
2114,1_0,1404
2115,0_1,1382
2115,1_0,1397
2116,0_1,1380
2116,1_0,1406
2117,0_1,1385
2117,1_0,1388
2118,0_1,1398
2118,1_0,1379
2119,0_1,1386
2119,1_0,1387
2120,0_1,1390
2120,1_0,1368
2121,0_1,1370
2121,1_0,1359
2122,0_1,1408
2122,1_0,1373
2123,0_1,1424
2123,1_0,1358
2124,0_1,1411
2124,1_0,1354
2125,0_1,1403
2125,1_0,1372
2126,0_1,1409
2126,1_0,1377
2127,0_1,1388
2127,1_0,1367
2128,0_1,1391
2128,1_0,1380
2129,0_1,1402
2129,1_0,1376
2130,0_1,1396
2130,1_0,1375
2131,0_1,1397
2131,1_0,1380
2132,0_1,1386
2132,1_0,1377
2133,0_1,1366
2133,1_0,1389
2134,0_1,1393
2134,1_0,1415
2135,0_1,1389
2135,1_0,1424
2136,0_1,1392
2136,1_0,1418
2137,0_1,1385
2137,1_0,1410
2138,0_1,1378
2138,1_0,1388
2139,0_1,1365
2139,1_0,1412
2140,0_1,1354
2140,1_0,1430
2141,0_1,1332
2141,1_0,1406
2142,0_1,1342
2142,1_0,1419
2143,0_1,1339
2143,1_0,1409
2144,0_1,1331
2144,1_0,1396
2145,0_1,1342
2145,1_0,1387
2146,0_1,1360
2146,1_0,1414
2147,0_1,1361
2147,1_0,1411
2148,0_1,1353
2148,1_0,1398
2149,0_1,1344
2149,1_0,1377
2150,0_1,1361
2150,1_0,1360
2151,0_1,1378
2151,1_0,1360
2152,0_1,1385
2152,1_0,1348
2153,0_1,1361
2153,1_0,1334
2154,0_1,1361
2154,1_0,1358
2155,0_1,1338
2155,1_0,1347
2156,0_1,1345
2156,1_0,1359
2157,0_1,1314
2157,1_0,1354
2158,0_1,1334
2158,1_0,1359
2159,0_1,1339
2159,1_0,1337
2160,0_1,1320
2160,1_0,1339
2161,0_1,1349
2161,1_0,1340
2162,0_1,1356
2162,1_0,1342
2163,0_1,1378
2163,1_0,1343
2164,0_1,1332
2164,1_0,1345
2165,0_1,1334
2165,1_0,1362
2166,0_1,1331
2166,1_0,1391
2167,0_1,1346
2167,1_0,1384
2168,0_1,1349
2168,1_0,1368
2169,0_1,1376
2169,1_0,1379
2170,0_1,1349
2170,1_0,1392
2171,0_1,1360
2171,1_0,1405
2172,0_1,1351
2172,1_0,1379
2173,0_1,1357
2173,1_0,1412
2174,0_1,1375
2174,1_0,1412
2175,0_1,1380
2175,1_0,1384
2176,0_1,1364
2176,1_0,1386
2177,0_1,1351
2177,1_0,1402
2178,0_1,1354
2178,1_0,1398
2179,0_1,1351
2179,1_0,1393
2180,0_1,1353
2180,1_0,1372
2181,0_1,1349
2181,1_0,1397
2182,0_1,1353
2182,1_0,1379
2183,0_1,1345
2183,1_0,1385
2184,0_1,1336
2184,1_0,1386
2185,0_1,1360
2185,1_0,1397
2186,0_1,1347
2186,1_0,1353
2187,0_1,1344
2187,1_0,1383
2188,0_1,1322
2188,1_0,1368
2189,0_1,1306
2189,1_0,1391
2190,0_1,1319
2190,1_0,1398
2191,0_1,1305
2191,1_0,1406
2192,0_1,1313
2192,1_0,1416
2193,0_1,1289
2193,1_0,1411
2194,0_1,1303
2194,1_0,1405
2195,0_1,1291
2195,1_0,1396
2196,0_1,1295
2196,1_0,1388
2197,0_1,1294
2197,1_0,1372
2198,0_1,1298
2198,1_0,1396
2199,0_1,1304
2199,1_0,1392
2200,0_1,1322
2200,1_0,1388
2201,0_1,1312
2201,1_0,1391
2202,0_1,1322
2202,1_0,1408
2203,0_1,1316
2203,1_0,1418
2204,0_1,1320
2204,1_0,1409
2205,0_1,1340
2205,1_0,1407
2206,0_1,1328
2206,1_0,1398
2207,0_1,1335
2207,1_0,1414
2208,0_1,1346
2208,1_0,1395
2209,0_1,1373
2209,1_0,1388
2210,0_1,1371
2210,1_0,1375
2211,0_1,1389
2211,1_0,1399
2212,0_1,1390
2212,1_0,1387
2213,0_1,1393
2213,1_0,1400
2214,0_1,1373
2214,1_0,1414
2215,0_1,1365
2215,1_0,1413
2216,0_1,1353
2216,1_0,1412
2217,0_1,1378
2217,1_0,1415
2218,0_1,1385
2218,1_0,1415
2219,0_1,1383
2219,1_0,1412
2220,0_1,1385
2220,1_0,1396
2221,0_1,1404
2221,1_0,1411
2222,0_1,1410
2222,1_0,1383
2223,0_1,1392
2223,1_0,1384
2224,0_1,1428
2224,1_0,1370
2225,0_1,1434
2225,1_0,1349
2226,0_1,1432
2226,1_0,1338
2227,0_1,1436
2227,1_0,1348
2228,0_1,1415
2228,1_0,1359
2229,0_1,1399
2229,1_0,1335
2230,0_1,1392
2230,1_0,1342
2231,0_1,1412
2231,1_0,1357
2232,0_1,1393
2232,1_0,1363
2233,0_1,1386
2233,1_0,1346
2234,0_1,1388
2234,1_0,1348
2235,0_1,1393
2235,1_0,1342
2236,0_1,1400
2236,1_0,1357
2237,0_1,1386
2237,1_0,1353
2238,0_1,1383
2238,1_0,1368
2239,0_1,1389
2239,1_0,1377
2240,0_1,1395
2240,1_0,1381
2241,0_1,1368
2241,1_0,1377
2242,0_1,1345
2242,1_0,1369
2243,0_1,1349
2243,1_0,1391
2244,0_1,1344
2244,1_0,1408
2245,0_1,1345
2245,1_0,1390
2246,0_1,1350
2246,1_0,1396
2247,0_1,1358
2247,1_0,1380
2248,0_1,1369
2248,1_0,1379
2249,0_1,1356
2249,1_0,1389
2250,0_1,1348
2250,1_0,1387
2251,0_1,1350
2251,1_0,1383
2252,0_1,1360
2252,1_0,1345
2253,0_1,1357
2253,1_0,1334
2254,0_1,1349
2254,1_0,1338
2255,0_1,1374
2255,1_0,1357
2256,0_1,1378
2256,1_0,1360
2257,0_1,1376
2257,1_0,1334
2258,0_1,1371
2258,1_0,1332
2259,0_1,1381
2259,1_0,1336
2260,0_1,1372
2260,1_0,1333
2261,0_1,1381
2261,1_0,1322
2262,0_1,1384
2262,1_0,1288
2263,0_1,1386
2263,1_0,1296
2264,0_1,1384
2264,1_0,1276
2265,0_1,1410
2265,1_0,1293
2266,0_1,1378
2266,1_0,1276
2267,0_1,1371
2267,1_0,1251
2268,0_1,1399
2268,1_0,1278
2269,0_1,1406
2269,1_0,1261
2270,0_1,1399
2270,1_0,1274
2271,0_1,1397
2271,1_0,1286
2272,0_1,1373
2272,1_0,1296
2273,0_1,1375
2273,1_0,1299
2274,0_1,1386
2274,1_0,1293
2275,0_1,1375
2275,1_0,1317
2276,0_1,1350
2276,1_0,1331
2277,0_1,1341
2277,1_0,1345
2278,0_1,1327
2278,1_0,1351
2279,0_1,1346
2279,1_0,1368
2280,0_1,1349
2280,1_0,1358
2281,0_1,1352
2281,1_0,1355
2282,0_1,1382
2282,1_0,1351
2283,0_1,1382
2283,1_0,1350
2284,0_1,1364
2284,1_0,1315
2285,0_1,1362
2285,1_0,1345
2286,0_1,1367
2286,1_0,1351
2287,0_1,1358
2287,1_0,1355
2288,0_1,1372
2288,1_0,1361
2289,0_1,1358
2289,1_0,1357
2290,0_1,1362
2290,1_0,1350
2291,0_1,1335
2291,1_0,1377
2292,0_1,1336
2292,1_0,1368
2293,0_1,1334
2293,1_0,1355
2294,0_1,1338
2294,1_0,1338
2295,0_1,1326
2295,1_0,1322
2296,0_1,1359
2296,1_0,1336
2297,0_1,1341
2297,1_0,1343
2298,0_1,1332
2298,1_0,1326
2299,0_1,1322
2299,1_0,1308
2300,0_1,1347
2300,1_0,1314
2301,0_1,1344
2301,1_0,1346
2302,0_1,1346
2302,1_0,1312
2303,0_1,1353
2303,1_0,1325
2304,0_1,1354
2304,1_0,1325
2305,0_1,1362
2305,1_0,1307
2306,0_1,1360
2306,1_0,1298
2307,0_1,1376
2307,1_0,1305
2308,0_1,1390
2308,1_0,1314
2309,0_1,1373
2309,1_0,1307
2310,0_1,1372
2310,1_0,1317
2311,0_1,1373
2311,1_0,1318
2312,0_1,1364
2312,1_0,1301
2313,0_1,1376
2313,1_0,1316
2314,0_1,1364
2314,1_0,1307
2315,0_1,1359
2315,1_0,1321
2316,0_1,1344
2316,1_0,1334
2317,0_1,1320
2317,1_0,1299
2318,0_1,1312
2318,1_0,1292
2319,0_1,1341
2319,1_0,1291
2320,0_1,1318
2320,1_0,1313
2321,0_1,1339
2321,1_0,1346
2322,0_1,1324
2322,1_0,1322
2323,0_1,1315
2323,1_0,1363
2324,0_1,1314
2324,1_0,1343
2325,0_1,1338
2325,1_0,1353
2326,0_1,1382
2326,1_0,1358
2327,0_1,1393
2327,1_0,1333
2328,0_1,1405
2328,1_0,1342
2329,0_1,1419
2329,1_0,1333
2330,0_1,1402
2330,1_0,1336
2331,0_1,1396
2331,1_0,1379
2332,0_1,1410
2332,1_0,1387
2333,0_1,1376
2333,1_0,1395
2334,0_1,1367
2334,1_0,1411
2335,0_1,1351
2335,1_0,1394
2336,0_1,1344
2336,1_0,1403
2337,0_1,1373
2337,1_0,1416
2338,0_1,1351
2338,1_0,1417
2339,0_1,1349
2339,1_0,1393
2340,0_1,1378
2340,1_0,1412
2341,0_1,1379
2341,1_0,1398
2342,0_1,1383
2342,1_0,1397
2343,0_1,1376
2343,1_0,1396
2344,0_1,1378
2344,1_0,1404
2345,0_1,1360
2345,1_0,1398
2346,0_1,1386
2346,1_0,1399
2347,0_1,1401
2347,1_0,1384
2348,0_1,1395
2348,1_0,1366
2349,0_1,1396
2349,1_0,1394
2350,0_1,1388
2350,1_0,1377
2351,0_1,1393
2351,1_0,1370
2352,0_1,1380
2352,1_0,1380
2353,0_1,1393
2353,1_0,1390
2354,0_1,1385
2354,1_0,1392
2355,0_1,1373
2355,1_0,1380
2356,0_1,1363
2356,1_0,1377
2357,0_1,1365
2357,1_0,1352
2358,0_1,1376
2358,1_0,1364
2359,0_1,1374
2359,1_0,1359
2360,0_1,1360
2360,1_0,1359
2361,0_1,1362
2361,1_0,1375
2362,0_1,1347
2362,1_0,1366
2363,0_1,1343
2363,1_0,1353
2364,0_1,1366
2364,1_0,1375
2365,0_1,1362
2365,1_0,1365
2366,0_1,1373
2366,1_0,1363
2367,0_1,1356
2367,1_0,1375
2368,0_1,1372
2368,1_0,1338
2369,0_1,1389
2369,1_0,1328
2370,0_1,1415
2370,1_0,1342
2371,0_1,1386
2371,1_0,1316
2372,0_1,1405
2372,1_0,1340
2373,0_1,1389
2373,1_0,1338
2374,0_1,1392
2374,1_0,1345
2375,0_1,1398
2375,1_0,1353
2376,0_1,1361
2376,1_0,1382
2377,0_1,1361
2377,1_0,1362
2378,0_1,1381
2378,1_0,1347
2379,0_1,1371
2379,1_0,1343
2380,0_1,1346
2380,1_0,1322
2381,0_1,1353
2381,1_0,1352
2382,0_1,1350
2382,1_0,1355
2383,0_1,1350
2383,1_0,1338
2384,0_1,1344
2384,1_0,1323
2385,0_1,1343
2385,1_0,1347
2386,0_1,1306
2386,1_0,1335
2387,0_1,1335
2387,1_0,1354
2388,0_1,1337
2388,1_0,1345
2389,0_1,1330
2389,1_0,1340
2390,0_1,1327
2390,1_0,1341
2391,0_1,1304
2391,1_0,1324
2392,0_1,1313
2392,1_0,1358
2393,0_1,1297
2393,1_0,1335
2394,0_1,1310
2394,1_0,1328
2395,0_1,1283
2395,1_0,1349
2396,0_1,1284
2396,1_0,1324
2397,0_1,1299
2397,1_0,1360
2398,0_1,1305
2398,1_0,1365
2399,0_1,1335
2399,1_0,1377
2400,0_1,1346
2400,1_0,1374
2401,0_1,1368
2401,1_0,1337
2402,0_1,1375
2402,1_0,1327
2403,0_1,1382
2403,1_0,1343
2404,0_1,1361
2404,1_0,1350
2405,0_1,1357
2405,1_0,1371
2406,0_1,1332
2406,1_0,1387
2407,0_1,1340
2407,1_0,1354
2408,0_1,1349
2408,1_0,1343
2409,0_1,1328
2409,1_0,1334
2410,0_1,1339
2410,1_0,1343
2411,0_1,1311
2411,1_0,1346
2412,0_1,1313
2412,1_0,1338
2413,0_1,1304
2413,1_0,1331
2414,0_1,1326
2414,1_0,1365
2415,0_1,1304
2415,1_0,1361
2416,0_1,1308
2416,1_0,1360
2417,0_1,1324
2417,1_0,1364
2418,0_1,1325
2418,1_0,1371
2419,0_1,1336
2419,1_0,1364
2420,0_1,1350
2420,1_0,1347
2421,0_1,1344
2421,1_0,1367
2422,0_1,1336
2422,1_0,1349
2423,0_1,1321
2423,1_0,1365
2424,0_1,1312
2424,1_0,1381
2425,0_1,1308
2425,1_0,1345
2426,0_1,1337
2426,1_0,1378
2427,0_1,1342
2427,1_0,1371
2428,0_1,1330
2428,1_0,1342
2429,0_1,1361
2429,1_0,1364
2430,0_1,1374
2430,1_0,1377
2431,0_1,1362
2431,1_0,1387
2432,0_1,1370
2432,1_0,1374
2433,0_1,1387
2433,1_0,1363
2434,0_1,1408
2434,1_0,1370
2435,0_1,1416
2435,1_0,1379
2436,0_1,1402
2436,1_0,1390
2437,0_1,1395
2437,1_0,1399
2438,0_1,1400
2438,1_0,1400
2439,0_1,1383
2439,1_0,1383
2440,0_1,1392
2440,1_0,1375
2441,0_1,1412
2441,1_0,1385
2442,0_1,1404
2442,1_0,1366
2443,0_1,1416
2443,1_0,1378
2444,0_1,1409
2444,1_0,1352
2445,0_1,1412
2445,1_0,1360
2446,0_1,1418
2446,1_0,1379
2447,0_1,1398
2447,1_0,1406
2448,0_1,1364
2448,1_0,1405
2449,0_1,1346
2449,1_0,1409
2450,0_1,1377
2450,1_0,1415
2451,0_1,1376
2451,1_0,1406
2452,0_1,1383
2452,1_0,1404
2453,0_1,1392
2453,1_0,1410
2454,0_1,1380
2454,1_0,1402
2455,0_1,1400
2455,1_0,1383
2456,0_1,1396
2456,1_0,1370
2457,0_1,1385
2457,1_0,1355
2458,0_1,1415
2458,1_0,1356
2459,0_1,1410
2459,1_0,1382
2460,0_1,1413
2460,1_0,1389
2461,0_1,1389
2461,1_0,1392
2462,0_1,1372
2462,1_0,1400
2463,0_1,1371
2463,1_0,1381
2464,0_1,1345
2464,1_0,1396
2465,0_1,1356
2465,1_0,1396
2466,0_1,1353
2466,1_0,1389
2467,0_1,1352
2467,1_0,1395
2468,0_1,1338
2468,1_0,1383
2469,0_1,1366
2469,1_0,1363
2470,0_1,1362
2470,1_0,1348
2471,0_1,1365
2471,1_0,1375
2472,0_1,1362
2472,1_0,1375
2473,0_1,1355
2473,1_0,1391
2474,0_1,1362
2474,1_0,1402
2475,0_1,1353
2475,1_0,1380
2476,0_1,1363
2476,1_0,1375
2477,0_1,1340
2477,1_0,1383
2478,0_1,1352
2478,1_0,1404
2479,0_1,1350
2479,1_0,1397
2480,0_1,1362
2480,1_0,1397
2481,0_1,1349
2481,1_0,1392
2482,0_1,1373
2482,1_0,1384
2483,0_1,1382
2483,1_0,1361
2484,0_1,1394
2484,1_0,1363
2485,0_1,1406
2485,1_0,1354
2486,0_1,1430
2486,1_0,1340
2487,0_1,1407
2487,1_0,1342
2488,0_1,1407
2488,1_0,1350
2489,0_1,1418
2489,1_0,1339
2490,0_1,1428
2490,1_0,1332
2491,0_1,1412
2491,1_0,1337
2492,0_1,1397
2492,1_0,1357
2493,0_1,1387
2493,1_0,1344
2494,0_1,1412
2494,1_0,1341
2495,0_1,1409
2495,1_0,1338
2496,0_1,1390
2496,1_0,1332
2497,0_1,1400
2497,1_0,1319
2498,0_1,1403
2498,1_0,1337
2499,0_1,1405
2499,1_0,1339
2500,0_1,1401
2500,1_0,1346
2501,0_1,1371
2501,1_0,1345
2502,0_1,1355
2502,1_0,1369
2503,0_1,1357
2503,1_0,1365
2504,0_1,1359
2504,1_0,1355
2505,0_1,1357
2505,1_0,1359
2506,0_1,1355
2506,1_0,1352
2507,0_1,1350
2507,1_0,1383
2508,0_1,1333
2508,1_0,1375
2509,0_1,1353
2509,1_0,1374
2510,0_1,1339
2510,1_0,1389
2511,0_1,1339
2511,1_0,1419
2512,0_1,1325
2512,1_0,1405
2513,0_1,1351
2513,1_0,1418
2514,0_1,1333
2514,1_0,1409
2515,0_1,1361
2515,1_0,1407
2516,0_1,1361
2516,1_0,1367
2517,0_1,1357
2517,1_0,1375
2518,0_1,1380
2518,1_0,1364
2519,0_1,1401
2519,1_0,1352
2520,0_1,1390
2520,1_0,1348
2521,0_1,1372
2521,1_0,1364
2522,0_1,1357
2522,1_0,1362
2523,0_1,1335
2523,1_0,1380
2524,0_1,1332
2524,1_0,1387
2525,0_1,1334
2525,1_0,1361
2526,0_1,1339
2526,1_0,1351
2527,0_1,1347
2527,1_0,1389
2528,0_1,1330
2528,1_0,1376
2529,0_1,1317
2529,1_0,1358
2530,0_1,1345
2530,1_0,1364
2531,0_1,1326
2531,1_0,1363
2532,0_1,1332
2532,1_0,1347
2533,0_1,1318
2533,1_0,1374
2534,0_1,1298
2534,1_0,1328
2535,0_1,1285
2535,1_0,1307
2536,0_1,1314
2536,1_0,1319
2537,0_1,1329
2537,1_0,1343
2538,0_1,1349
2538,1_0,1322
2539,0_1,1360
2539,1_0,1332
2540,0_1,1341
2540,1_0,1305
2541,0_1,1364
2541,1_0,1336
2542,0_1,1335
2542,1_0,1310
2543,0_1,1322
2543,1_0,1284
2544,0_1,1335
2544,1_0,1270
2545,0_1,1345
2545,1_0,1261
2546,0_1,1343
2546,1_0,1301
2547,0_1,1356
2547,1_0,1300
2548,0_1,1341
2548,1_0,1297
2549,0_1,1332
2549,1_0,1298
2550,0_1,1346
2550,1_0,1302
2551,0_1,1314
2551,1_0,1273
2552,0_1,1344
2552,1_0,1271
2553,0_1,1369
2553,1_0,1244
2554,0_1,1373
2554,1_0,1265
2555,0_1,1374
2555,1_0,1266
2556,0_1,1370
2556,1_0,1269
2557,0_1,1381
2557,1_0,1294
2558,0_1,1372
2558,1_0,1318
2559,0_1,1368
2559,1_0,1294
2560,0_1,1386
2560,1_0,1293
2561,0_1,1401
2561,1_0,1295
2562,0_1,1398
2562,1_0,1275
2563,0_1,1396
2563,1_0,1298
2564,0_1,1392
2564,1_0,1291
2565,0_1,1397
2565,1_0,1292
2566,0_1,1418
2566,1_0,1303
2567,0_1,1416
2567,1_0,1303
2568,0_1,1391
2568,1_0,1298
2569,0_1,1384
2569,1_0,1299
2570,0_1,1401
2570,1_0,1316
2571,0_1,1391
2571,1_0,1282
2572,0_1,1399
2572,1_0,1307
2573,0_1,1418
2573,1_0,1321
2574,0_1,1401
2574,1_0,1319
2575,0_1,1396
2575,1_0,1347
2576,0_1,1401
2576,1_0,1350
2577,0_1,1388
2577,1_0,1368
2578,0_1,1378
2578,1_0,1361
2579,0_1,1367
2579,1_0,1384
2580,0_1,1361
2580,1_0,1383
2581,0_1,1388
2581,1_0,1380
2582,0_1,1361
2582,1_0,1376
2583,0_1,1368
2583,1_0,1383
2584,0_1,1371
2584,1_0,1369
2585,0_1,1349
2585,1_0,1363
2586,0_1,1344
2586,1_0,1382
2587,0_1,1344
2587,1_0,1378
2588,0_1,1353
2588,1_0,1362
2589,0_1,1350
2589,1_0,1365
2590,0_1,1323
2590,1_0,1385
2591,0_1,1306
2591,1_0,1392
2592,0_1,1307
2592,1_0,1382
2593,0_1,1331
2593,1_0,1369
2594,0_1,1337
2594,1_0,1352
2595,0_1,1344
2595,1_0,1360
2596,0_1,1362
2596,1_0,1344
2597,0_1,1355
2597,1_0,1340
2598,0_1,1346
2598,1_0,1335
2599,0_1,1359
2599,1_0,1331
2600,0_1,1343
2600,1_0,1329
2601,0_1,1385
2601,1_0,1348
2602,0_1,1382
2602,1_0,1367
2603,0_1,1394
2603,1_0,1360
2604,0_1,1369
2604,1_0,1343
2605,0_1,1364
2605,1_0,1370
2606,0_1,1363
2606,1_0,1358
2607,0_1,1380
2607,1_0,1373
2608,0_1,1399
2608,1_0,1345
2609,0_1,1392
2609,1_0,1365
2610,0_1,1383
2610,1_0,1346
2611,0_1,1377
2611,1_0,1334
2612,0_1,1382
2612,1_0,1356
2613,0_1,1360
2613,1_0,1345
2614,0_1,1367
2614,1_0,1353
2615,0_1,1352
2615,1_0,1343
2616,0_1,1341
2616,1_0,1330
2617,0_1,1346
2617,1_0,1342
2618,0_1,1354
2618,1_0,1328
2619,0_1,1381
2619,1_0,1347
2620,0_1,1367
2620,1_0,1335
2621,0_1,1349
2621,1_0,1344
2622,0_1,1372
2622,1_0,1355
2623,0_1,1368
2623,1_0,1349
2624,0_1,1353
2624,1_0,1355
2625,0_1,1340
2625,1_0,1354
2626,0_1,1344
2626,1_0,1371
2627,0_1,1352
2627,1_0,1361
2628,0_1,1368
2628,1_0,1362
2629,0_1,1338
2629,1_0,1347
2630,0_1,1350
2630,1_0,1337
2631,0_1,1344
2631,1_0,1330
2632,0_1,1339
2632,1_0,1341
2633,0_1,1339
2633,1_0,1354
2634,0_1,1355
2634,1_0,1354
2635,0_1,1357
2635,1_0,1345
2636,0_1,1368
2636,1_0,1341
2637,0_1,1362
2637,1_0,1336
2638,0_1,1352
2638,1_0,1359
2639,0_1,1370
2639,1_0,1364
2640,0_1,1359
2640,1_0,1350
2641,0_1,1357
2641,1_0,1376
2642,0_1,1339
2642,1_0,1355
2643,0_1,1345
2643,1_0,1348
2644,0_1,1329
2644,1_0,1343
2645,0_1,1341
2645,1_0,1364
2646,0_1,1332
2646,1_0,1331
2647,0_1,1356
2647,1_0,1319
2648,0_1,1338
2648,1_0,1333
2649,0_1,1333
2649,1_0,1352
2650,0_1,1345
2650,1_0,1362
2651,0_1,1318
2651,1_0,1356
2652,0_1,1323
2652,1_0,1360
2653,0_1,1322
2653,1_0,1362
2654,0_1,1367
2654,1_0,1357
2655,0_1,1357
2655,1_0,1335
2656,0_1,1341
2656,1_0,1322
2657,0_1,1331
2657,1_0,1331
2658,0_1,1346
2658,1_0,1313
2659,0_1,1375
2659,1_0,1316
2660,0_1,1352
2660,1_0,1288
2661,0_1,1386
2661,1_0,1305
2662,0_1,1377
2662,1_0,1306
2663,0_1,1388
2663,1_0,1333
2664,0_1,1366
2664,1_0,1317
2665,0_1,1381
2665,1_0,1343
2666,0_1,1351
2666,1_0,1328
2667,0_1,1318
2667,1_0,1328
2668,0_1,1311
2668,1_0,1354
2669,0_1,1329
2669,1_0,1316
2670,0_1,1351
2670,1_0,1307
2671,0_1,1336
2671,1_0,1299
2672,0_1,1334
2672,1_0,1333
2673,0_1,1345
2673,1_0,1355
2674,0_1,1331
2674,1_0,1345
2675,0_1,1350
2675,1_0,1332
2676,0_1,1372
2676,1_0,1325
2677,0_1,1357
2677,1_0,1297
2678,0_1,1347
2678,1_0,1283
2679,0_1,1371
2679,1_0,1331
2680,0_1,1356
2680,1_0,1305
2681,0_1,1318
2681,1_0,1257
2682,0_1,1358
2682,1_0,1329
2683,0_1,1320
2683,1_0,1335
2684,0_1,1308
2684,1_0,1319
2685,0_1,1293
2685,1_0,1354
2686,0_1,1338
2686,1_0,1354
2687,0_1,1340
2687,1_0,1339
2688,0_1,1346
2688,1_0,1368
2689,0_1,1351
2689,1_0,1348
2690,0_1,1311
2690,1_0,1393
2691,0_1,1310
2691,1_0,1391
2692,0_1,1337
2692,1_0,1377
2693,0_1,1349
2693,1_0,1399
2694,0_1,1371
2694,1_0,1377
2695,0_1,1368
2695,1_0,1357
2696,0_1,1396
2696,1_0,1341
2697,0_1,1375
2697,1_0,1365
2698,0_1,1365
2698,1_0,1361
2699,0_1,1343
2699,1_0,1366
2700,0_1,1360
2700,1_0,1353
2701,0_1,1362
2701,1_0,1352
2702,0_1,1361
2702,1_0,1354
2703,0_1,1371
2703,1_0,1341
2704,0_1,1379
2704,1_0,1362
2705,0_1,1358
2705,1_0,1351
2706,0_1,1371
2706,1_0,1373
2707,0_1,1403
2707,1_0,1374
2708,0_1,1394
2708,1_0,1358
2709,0_1,1377
2709,1_0,1340
2710,0_1,1386
2710,1_0,1358
2711,0_1,1380
2711,1_0,1333
2712,0_1,1397
2712,1_0,1311
2713,0_1,1397
2713,1_0,1312
2714,0_1,1418
2714,1_0,1348
2715,0_1,1407
2715,1_0,1349
2716,0_1,1391
2716,1_0,1341
2717,0_1,1389
2717,1_0,1349
2718,0_1,1391
2718,1_0,1350
2719,0_1,1378
2719,1_0,1351
2720,0_1,1372
2720,1_0,1367
2721,0_1,1407
2721,1_0,1356
2722,0_1,1387
2722,1_0,1365
2723,0_1,1407
2723,1_0,1377
2724,0_1,1408
2724,1_0,1354
2725,0_1,1426
2725,1_0,1347
2726,0_1,1414
2726,1_0,1340
2727,0_1,1429
2727,1_0,1351
2728,0_1,1424
2728,1_0,1355
2729,0_1,1423
2729,1_0,1362
2730,0_1,1421
2730,1_0,1355
2731,0_1,1450
2731,1_0,1368
2732,0_1,1444
2732,1_0,1359
2733,0_1,1428
2733,1_0,1330
2734,0_1,1428
2734,1_0,1354
2735,0_1,1391
2735,1_0,1336
2736,0_1,1378
2736,1_0,1386
2737,0_1,1351
2737,1_0,1394
2738,0_1,1352
2738,1_0,1372
2739,0_1,1342
2739,1_0,1402
2740,0_1,1367
2740,1_0,1388
2741,0_1,1387
2741,1_0,1371
2742,0_1,1398
2742,1_0,1368
2743,0_1,1392
2743,1_0,1362
2744,0_1,1393
2744,1_0,1359
2745,0_1,1405
2745,1_0,1394
2746,0_1,1376
2746,1_0,1373
2747,0_1,1366
2747,1_0,1358
2748,0_1,1400
2748,1_0,1362
2749,0_1,1391
2749,1_0,1361
2750,0_1,1416
2750,1_0,1377
2751,0_1,1381
2751,1_0,1363
2752,0_1,1363
2752,1_0,1370
2753,0_1,1373
2753,1_0,1364
2754,0_1,1389
2754,1_0,1399
2755,0_1,1366
2755,1_0,1388
2756,0_1,1370
2756,1_0,1368
2757,0_1,1375
2757,1_0,1370
2758,0_1,1374
2758,1_0,1408
2759,0_1,1373
2759,1_0,1408
2760,0_1,1337
2760,1_0,1422
2761,0_1,1344
2761,1_0,1414
2762,0_1,1328
2762,1_0,1406
2763,0_1,1339
2763,1_0,1413
2764,0_1,1339
2764,1_0,1403
2765,0_1,1332
2765,1_0,1404
2766,0_1,1325
2766,1_0,1416
2767,0_1,1324
2767,1_0,1381
2768,0_1,1343
2768,1_0,1364
2769,0_1,1367
2769,1_0,1379
2770,0_1,1365
2770,1_0,1372
2771,0_1,1350
2771,1_0,1403
2772,0_1,1345
2772,1_0,1397
2773,0_1,1362
2773,1_0,1383
2774,0_1,1373
2774,1_0,1379
2775,0_1,1357
2775,1_0,1406
2776,0_1,1379
2776,1_0,1404
2777,0_1,1361
2777,1_0,1396
2778,0_1,1351
2778,1_0,1383
2779,0_1,1357
2779,1_0,1421
2780,0_1,1346
2780,1_0,1417
2781,0_1,1356
2781,1_0,1395
2782,0_1,1387
2782,1_0,1393
2783,0_1,1375
2783,1_0,1389
2784,0_1,1373
2784,1_0,1403
2785,0_1,1368
2785,1_0,1368
2786,0_1,1391
2786,1_0,1367
2787,0_1,1415
2787,1_0,1365
2788,0_1,1418
2788,1_0,1351
2789,0_1,1413
2789,1_0,1359
2790,0_1,1370
2790,1_0,1355
2791,0_1,1386
2791,1_0,1377
2792,0_1,1368
2792,1_0,1370
2793,0_1,1375
2793,1_0,1390
2794,0_1,1365
2794,1_0,1379
2795,0_1,1382
2795,1_0,1371
2796,0_1,1372
2796,1_0,1393
2797,0_1,1382
2797,1_0,1383
2798,0_1,1359
2798,1_0,1410
2799,0_1,1388
2799,1_0,1403
2800,0_1,1380
2800,1_0,1383
2801,0_1,1402
2801,1_0,1375
2802,0_1,1386
2802,1_0,1380
2803,0_1,1382
2803,1_0,1361
2804,0_1,1398
2804,1_0,1371
2805,0_1,1392
2805,1_0,1365
2806,0_1,1392
2806,1_0,1365
2807,0_1,1395
2807,1_0,1330
2808,0_1,1398
2808,1_0,1342
2809,0_1,1385
2809,1_0,1328
2810,0_1,1407
2810,1_0,1336
2811,0_1,1405
2811,1_0,1357
2812,0_1,1383
2812,1_0,1347
2813,0_1,1387
2813,1_0,1354
2814,0_1,1353
2814,1_0,1370
2815,0_1,1362
2815,1_0,1379
2816,0_1,1341
2816,1_0,1383
2817,0_1,1363
2817,1_0,1400
2818,0_1,1331
2818,1_0,1378
2819,0_1,1329
2819,1_0,1377
2820,0_1,1325
2820,1_0,1350
2821,0_1,1319
2821,1_0,1336
2822,0_1,1344
2822,1_0,1360
2823,0_1,1339
2823,1_0,1363
2824,0_1,1331
2824,1_0,1385
2825,0_1,1318
2825,1_0,1395
2826,0_1,1299
2826,1_0,1373
2827,0_1,1314
2827,1_0,1364
2828,0_1,1349
2828,1_0,1372
2829,0_1,1387
2829,1_0,1375
2830,0_1,1358
2830,1_0,1332
2831,0_1,1370
2831,1_0,1305
2832,0_1,1393
2832,1_0,1281
2833,0_1,1369
2833,1_0,1289
2834,0_1,1407
2834,1_0,1288
2835,0_1,1428
2835,1_0,1280
2836,0_1,1412
2836,1_0,1278
2837,0_1,1423
2837,1_0,1282
2838,0_1,1436
2838,1_0,1274
2839,0_1,1390
2839,1_0,1292
2840,0_1,1374
2840,1_0,1330
2841,0_1,1351
2841,1_0,1347
2842,0_1,1355
2842,1_0,1373
2843,0_1,1317
2843,1_0,1366
2844,0_1,1309
2844,1_0,1377
2845,0_1,1303
2845,1_0,1373
2846,0_1,1301
2846,1_0,1376
2847,0_1,1324
2847,1_0,1375
2848,0_1,1316
2848,1_0,1366
2849,0_1,1340
2849,1_0,1372
2850,0_1,1334
2850,1_0,1358
2851,0_1,1342
2851,1_0,1351
2852,0_1,1345
2852,1_0,1348
2853,0_1,1332
2853,1_0,1357
2854,0_1,1336
2854,1_0,1367
2855,0_1,1332
2855,1_0,1355
2856,0_1,1343
2856,1_0,1369
2857,0_1,1302
2857,1_0,1378
2858,0_1,1299
2858,1_0,1399
2859,0_1,1283
2859,1_0,1364
2860,0_1,1309
2860,1_0,1369
2861,0_1,1333
2861,1_0,1347
2862,0_1,1335
2862,1_0,1349
2863,0_1,1334
2863,1_0,1351
2864,0_1,1359
2864,1_0,1341
2865,0_1,1369
2865,1_0,1329
2866,0_1,1390
2866,1_0,1306
2867,0_1,1393
2867,1_0,1297
2868,0_1,1398
2868,1_0,1303
2869,0_1,1419
2869,1_0,1301
2870,0_1,1440
2870,1_0,1315
2871,0_1,1434
2871,1_0,1330
2872,0_1,1389
2872,1_0,1323
2873,0_1,1388
2873,1_0,1329
2874,0_1,1366
2874,1_0,1334
2875,0_1,1373
2875,1_0,1334
2876,0_1,1386
2876,1_0,1337
2877,0_1,1387
2877,1_0,1352
2878,0_1,1365
2878,1_0,1356
2879,0_1,1389
2879,1_0,1355
2880,0_1,1387
2880,1_0,1376
2881,0_1,1383
2881,1_0,1357
2882,0_1,1351
2882,1_0,1363
2883,0_1,1351
2883,1_0,1382
2884,0_1,1365
2884,1_0,1390
2885,0_1,1357
2885,1_0,1400
2886,0_1,1373
2886,1_0,1390
2887,0_1,1361
2887,1_0,1399
2888,0_1,1368
2888,1_0,1395
2889,0_1,1373
2889,1_0,1359
2890,0_1,1385
2890,1_0,1367
2891,0_1,1381
2891,1_0,1370
2892,0_1,1365
2892,1_0,1360
2893,0_1,1346
2893,1_0,1387
2894,0_1,1348
2894,1_0,1397
2895,0_1,1341
2895,1_0,1396
2896,0_1,1338
2896,1_0,1423
2897,0_1,1335
2897,1_0,1412
2898,0_1,1332
2898,1_0,1402
2899,0_1,1332
2899,1_0,1390
2900,0_1,1333
2900,1_0,1379
2901,0_1,1361
2901,1_0,1359
2902,0_1,1427
2902,1_0,1399
2903,0_1,1423
2903,1_0,1413
2904,0_1,1435
2904,1_0,1418
2905,0_1,1446
2905,1_0,1429
2906,0_1,1442
2906,1_0,1445
2907,0_1,1439
2907,1_0,1474
2908,0_1,1435
2908,1_0,1482
2909,0_1,1448
2909,1_0,1492
2910,0_1,1435
2910,1_0,1486
2911,0_1,1443
2911,1_0,1489
2912,0_1,1444
2912,1_0,1490
2913,0_1,1455
2913,1_0,1491
2914,0_1,1452
2914,1_0,1493
2915,0_1,1444
2915,1_0,1501
2916,0_1,1456
2916,1_0,1495
2917,0_1,1458
2917,1_0,1501
2918,0_1,1456
2918,1_0,1499
2919,0_1,1473
2919,1_0,1496
2920,0_1,1474
2920,1_0,1490
2921,0_1,1468
2921,1_0,1485
2922,0_1,1470
2922,1_0,1492
2923,0_1,1471
2923,1_0,1502
2924,0_1,1451
2924,1_0,1500
2925,0_1,1463
2925,1_0,1510
2926,0_1,1460
2926,1_0,1508
2927,0_1,1462
2927,1_0,1512
2928,0_1,1456
2928,1_0,1511
2929,0_1,1458
2929,1_0,1505
2930,0_1,1462
2930,1_0,1510
2931,0_1,1465
2931,1_0,1505
2932,0_1,1477
2932,1_0,1508
2933,0_1,1469
2933,1_0,1507
2934,0_1,1472
2934,1_0,1501
2935,0_1,1476
2935,1_0,1507
2936,0_1,1479
2936,1_0,1503
2937,0_1,1481
2937,1_0,1500
2938,0_1,1482
2938,1_0,1504
2939,0_1,1480
2939,1_0,1498
2940,0_1,1477
2940,1_0,1503
2941,0_1,1475
2941,1_0,1508
2942,0_1,1473
2942,1_0,1509
2943,0_1,1471
2943,1_0,1507
2944,0_1,1471
2944,1_0,1516
2945,0_1,1473
2945,1_0,1509
2946,0_1,1471
2946,1_0,1515
2947,0_1,1471
2947,1_0,1509
2948,0_1,1480
2948,1_0,1505
2949,0_1,1480
2949,1_0,1506
2950,0_1,1477
2950,1_0,1509
2951,0_1,1477
2951,1_0,1507
2952,0_1,1472
2952,1_0,1500
2953,0_1,1476
2953,1_0,1505
2954,0_1,1473
2954,1_0,1507
2955,0_1,1480
2955,1_0,1507
2956,0_1,1482
2956,1_0,1504
2957,0_1,1488
2957,1_0,1500
2958,0_1,1483
2958,1_0,1499
2959,0_1,1480
2959,1_0,1504
2960,0_1,1474
2960,1_0,1508
2961,0_1,1481
2961,1_0,1506
2962,0_1,1485
2962,1_0,1501
2963,0_1,1485
2963,1_0,1503
2964,0_1,1488
2964,1_0,1501
2965,0_1,1487
2965,1_0,1499
2966,0_1,1490
2966,1_0,1496
2967,0_1,1489
2967,1_0,1496
2968,0_1,1497
2968,1_0,1492
2969,0_1,1500
2969,1_0,1491
2970,0_1,1502
2970,1_0,1486
2971,0_1,1501
2971,1_0,1489
2972,0_1,1499
2972,1_0,1490
2973,0_1,1498
2973,1_0,1490
2974,0_1,1496
2974,1_0,1493
2975,0_1,1495
2975,1_0,1493
2976,0_1,1489
2976,1_0,1494
2977,0_1,1492
2977,1_0,1498
2978,0_1,1493
2978,1_0,1497
2979,0_1,1493
2979,1_0,1500
2980,0_1,1490
2980,1_0,1499
2981,0_1,1487
2981,1_0,1502
2982,0_1,1487
2982,1_0,1498
2983,0_1,1486
2983,1_0,1501
2984,0_1,1488
2984,1_0,1502
2985,0_1,1491
2985,1_0,1501
2986,0_1,1493
2986,1_0,1497
2987,0_1,1495
2987,1_0,1500
2988,0_1,1495
2988,1_0,1500
2989,0_1,1489
2989,1_0,1498
2990,0_1,1487
2990,1_0,1502
2991,0_1,1490
2991,1_0,1498
2992,0_1,1487
2992,1_0,1498
2993,0_1,1490
2993,1_0,1500
2994,0_1,1493
2994,1_0,1501
2995,0_1,1493
2995,1_0,1498
2996,0_1,1496
2996,1_0,1497
2997,0_1,1497
2997,1_0,1496
2998,0_1,1499
2998,1_0,1495
2999,0_1,1500
2999,1_0,1489
