0,0.0,0.0,256.0,0.001639093137254902,107.0,
1,1.0,6385.0,256.0,0.0017769607843137255,116.0,
2,2.0,5513.0,256.0,0.0018075980392156864,118.0,
3,3.0,5247.0,256.0,0.0018535539215686274,121.0,
4,4.0,5832.0,256.0,0.001838235294117647,120.0,
5,5.0,6390.0,256.0,0.001868872549019608,122.0,
6,6.0,6260.0,256.0,0.0018841911764705883,123.0,
7,7.0,7913.0,256.0,0.001991421568627451,130.0,
8,8.0,8241.0,256.0,0.0021292892156862743,139.0,
9,9.0,7814.0,256.0,0.0021599264705882354,141.0,
10,10.0,6035.0,256.0,0.0021752450980392158,142.0,
11,11.0,5298.0,256.0,0.0021599264705882354,141.0,
12,12.0,6186.0,256.0,0.0020986519607843136,137.0,
13,13.0,6149.0,256.0,0.002068014705882353,135.0,
14,14.0,6279.0,256.0,0.002068014705882353,135.0,
15,15.0,4636.0,256.0,0.0020833333333333333,136.0,
16,16.0,4770.0,256.0,0.0019761029411764705,129.0,
17,17.0,4430.0,256.0,0.0019301470588235295,126.0,
18,18.0,5269.0,256.0,0.001914828431372549,125.0,
19,19.0,5688.0,256.0,0.0019454656862745098,127.0,
20,20.0,6745.0,256.0,0.0019454656862745098,127.0,
21,21.0,4773.0,256.0,0.0018995098039215686,124.0,
22,22.0,3796.0,256.0,0.0018535539215686274,121.0,
23,23.0,4396.0,256.0,0.0018995098039215686,124.0,
24,24.0,7899.0,256.0,0.0018995098039215686,124.0,
25,25.0,6756.0,256.0,0.0018535539215686274,121.0,
26,26.0,6355.0,256.0,0.0018229166666666667,119.0,
27,27.0,6206.0,256.0,0.0018995098039215686,124.0,
28,28.0,6533.0,256.0,0.001914828431372549,125.0,
29,29.0,7372.0,256.0,0.001914828431372549,125.0,
30,30.0,10402.0,256.0,0.0020373774509803923,133.0,
31,31.0,8813.0,256.0,0.0020833333333333333,136.0,
32,32.0,7793.0,256.0,0.0020986519607843136,137.0,
33,33.0,7319.0,256.0,0.002113970588235294,138.0,
34,34.0,10270.0,256.0,0.0021752450980392158,142.0,
35,35.0,11587.0,256.0,0.00234375,153.0,
36,36.0,11076.0,256.0,0.002527573529411765,165.0,
37,37.0,9661.0,256.0,0.002573529411764706,168.0,
38,38.0,10262.0,256.0,0.0027113970588235293,177.0,
39,39.0,9251.0,256.0,0.002650122549019608,173.0,
40,40.0,8446.0,256.0,0.0026807598039215686,175.0,
41,41.0,7149.0,256.0,0.0026348039215686276,172.0,
42,42.0,8205.0,256.0,0.002466299019607843,161.0,
43,43.0,9432.0,256.0,0.0024356617647058824,159.0,
44,44.0,7475.0,256.0,0.002527573529411765,165.0,
45,45.0,9431.0,256.0,0.002527573529411765,165.0,
46,46.0,7400.0,256.0,0.0025582107843137255,167.0,
47,47.0,9259.0,256.0,0.002542892156862745,166.0,
48,48.0,6334.0,256.0,0.0025122549019607845,164.0,
49,49.0,7267.0,256.0,0.0024356617647058824,159.0,
50,50.0,8886.0,256.0,0.0024356617647058824,159.0,
51,51.0,6100.0,256.0,0.002466299019607843,161.0,
52,52.0,7431.0,256.0,0.0023897058823529414,156.0,
53,53.0,6513.0,256.0,0.0022824754901960786,149.0,
54,54.0,10982.0,256.0,0.0022518382352941175,147.0,
55,55.0,9248.0,256.0,0.0022212009803921568,145.0,
56,56.0,8753.0,256.0,0.0022824754901960786,149.0,
57,57.0,8089.0,256.0,0.0021599264705882354,141.0,
58,58.0,8099.0,256.0,0.0021752450980392158,142.0,
59,59.0,9559.0,256.0,0.0021752450980392158,142.0,
60,60.0,8026.0,256.0,0.0021292892156862743,139.0,
61,61.0,6166.0,256.0,0.0021599264705882354,141.0,
62,62.0,8867.0,256.0,0.0022058823529411764,144.0,
63,63.0,6766.0,256.0,0.0022671568627450982,148.0,
64,64.0,9475.0,256.0,0.0022824754901960786,149.0,
65,65.0,9846.0,256.0,0.0023897058823529414,156.0,
66,66.0,10083.0,256.0,0.00234375,153.0,
67,67.0,8431.0,256.0,0.00234375,153.0,
68,68.0,8312.0,256.0,0.0022212009803921568,145.0,
69,69.0,5777.0,256.0,0.002144607843137255,140.0,
70,70.0,6586.0,256.0,0.002068014705882353,135.0,
71,71.0,5805.0,256.0,0.0020526960784313726,134.0,
72,72.0,9637.0,256.0,0.0020526960784313726,134.0,
73,73.0,7980.0,256.0,0.0021292892156862743,139.0,
74,74.0,9459.0,256.0,0.002068014705882353,135.0,
75,75.0,8483.0,256.0,0.0020373774509803923,133.0,
76,76.0,8253.0,256.0,0.001991421568627451,130.0,
77,77.0,10320.0,256.0,0.0019761029411764705,129.0,
78,78.0,10220.0,256.0,0.00196078431372549,128.0,
79,79.0,10079.0,256.0,0.0019301470588235295,126.0,
80,80.0,11186.0,256.0,0.00196078431372549,128.0,
81,81.0,9834.0,256.0,0.0019761029411764705,129.0,
82,82.0,9297.0,256.0,0.0020833333333333333,136.0,
83,83.0,9093.0,256.0,0.001914828431372549,125.0,
84,84.0,9776.0,256.0,0.0018995098039215686,124.0,
85,85.0,9517.0,256.0,0.001991421568627451,130.0,
86,86.0,12162.0,256.0,0.00196078431372549,128.0,
87,87.0,11929.0,256.0,0.00196078431372549,128.0,
88,88.0,11499.0,256.0,0.002022058823529412,132.0,
89,89.0,10896.0,256.0,0.002144607843137255,140.0,
90,90.0,13745.0,256.0,0.0021599264705882354,141.0,
91,91.0,12255.0,256.0,0.0020986519607843136,137.0,
92,92.0,11522.0,256.0,0.002113970588235294,138.0,
93,93.0,12346.0,256.0,0.002190563725490196,143.0,
94,94.0,12617.0,256.0,0.0020986519607843136,137.0,
95,95.0,10822.0,256.0,0.0021752450980392158,142.0,
96,96.0,14324.0,256.0,0.0021752450980392158,142.0,
97,97.0,13826.0,256.0,0.002236519607843137,146.0,
98,98.0,13303.0,256.0,0.0021292892156862743,139.0,
99,99.0,12438.0,256.0,0.0021599264705882354,141.0,
100,100.0,14159.0,256.0,0.0021752450980392158,142.0,
101,101.0,14990.0,256.0,0.002144607843137255,140.0,
102,102.0,13973.0,256.0,0.002068014705882353,135.0,
103,103.0,12848.0,256.0,0.0020833333333333333,136.0,
104,104.0,14559.0,256.0,0.002144607843137255,140.0,
105,105.0,16183.0,256.0,0.0022671568627450982,148.0,
106,106.0,16589.0,256.0,0.0023590686274509803,154.0,
107,107.0,17316.0,256.0,0.0023590686274509803,154.0,
108,108.0,15297.0,256.0,0.0024509803921568627,160.0,
109,109.0,16616.0,256.0,0.0024050245098039217,157.0,
110,110.0,11571.0,256.0,0.0022824754901960786,149.0,
111,111.0,15501.0,256.0,0.0022518382352941175,147.0,
112,112.0,14929.0,256.0,0.0023284313725490196,152.0,
113,113.0,12936.0,256.0,0.0024050245098039217,157.0,
114,114.0,16433.0,256.0,0.0024509803921568627,160.0,
115,115.0,18455.0,256.0,0.0024969362745098037,163.0,
116,116.0,17176.0,256.0,0.002527573529411765,165.0,
117,117.0,17428.0,256.0,0.002420343137254902,158.0,
118,118.0,17596.0,256.0,0.0023743872549019606,155.0,
119,119.0,13897.0,256.0,0.002420343137254902,158.0,
120,120.0,15833.0,256.0,0.00234375,153.0,
121,121.0,16200.0,256.0,0.0024050245098039217,157.0,
122,122.0,13533.0,256.0,0.00234375,153.0,
123,123.0,16296.0,256.0,0.0022518382352941175,147.0,
124,124.0,16287.0,256.0,0.0023284313725490196,152.0,
125,125.0,15135.0,256.0,0.0024356617647058824,159.0,
126,126.0,15705.0,256.0,0.0024356617647058824,159.0,
127,127.0,18517.0,256.0,0.002542892156862745,166.0,
128,128.0,16699.0,256.0,0.002527573529411765,165.0,
129,129.0,15005.0,256.0,0.002527573529411765,165.0,
130,130.0,20074.0,256.0,0.0026654411764705883,174.0,
131,131.0,17737.0,256.0,0.0026654411764705883,174.0,
132,132.0,20101.0,256.0,0.0026807598039215686,175.0,
133,133.0,17264.0,256.0,0.0026654411764705883,174.0,
134,134.0,18008.0,256.0,0.0026654411764705883,174.0,
135,135.0,20313.0,256.0,0.0026807598039215686,175.0,
136,136.0,19061.0,256.0,0.0026041666666666665,170.0,
137,137.0,19210.0,256.0,0.0026041666666666665,170.0,
138,138.0,22890.0,256.0,0.002696078431372549,176.0,
139,139.0,21360.0,256.0,0.0028952205882352942,189.0,
140,140.0,17790.0,256.0,0.0028952205882352942,189.0,
141,141.0,19349.0,256.0,0.002925857843137255,191.0,
142,142.0,17821.0,256.0,0.002864583333333333,187.0,
143,143.0,19686.0,256.0,0.002849264705882353,186.0,
144,144.0,14550.0,256.0,0.0028339460784313725,185.0,
145,145.0,21732.0,256.0,0.0027267156862745097,178.0,
146,146.0,15969.0,256.0,0.002772671568627451,181.0,
147,147.0,17641.0,256.0,0.0027879901960784314,182.0,
148,148.0,17660.0,256.0,0.002650122549019608,173.0,
149,149.0,17759.0,256.0,0.002542892156862745,166.0,
150,150.0,18081.0,256.0,0.002619485294117647,171.0,
151,151.0,18981.0,256.0,0.002588848039215686,169.0,
152,152.0,21390.0,256.0,0.0026654411764705883,174.0,
153,153.0,18203.0,256.0,0.0026807598039215686,175.0,
154,154.0,21216.0,256.0,0.002772671568627451,181.0,
155,155.0,17018.0,256.0,0.002772671568627451,181.0,
156,156.0,21713.0,256.0,0.0027267156862745097,178.0,
157,157.0,22805.0,256.0,0.0027267156862745097,178.0,
158,158.0,24874.0,256.0,0.003002450980392157,196.0,
159,159.0,24121.0,256.0,0.003125,204.0,
160,160.0,20219.0,256.0,0.0032322303921568625,211.0,
161,161.0,23650.0,256.0,0.003201593137254902,209.0,
162,162.0,18751.0,256.0,0.003201593137254902,209.0,
163,163.0,18078.0,256.0,0.0033854166666666668,221.0,
164,164.0,25394.0,256.0,0.003278186274509804,214.0,
165,165.0,20822.0,256.0,0.0033854166666666668,221.0,
166,166.0,21342.0,256.0,0.0033700980392156864,220.0,
167,167.0,24190.0,256.0,0.0033088235294117647,216.0,
168,168.0,25466.0,256.0,0.003477328431372549,227.0,
169,169.0,24763.0,256.0,0.003553921568627451,232.0,
170,170.0,24869.0,256.0,0.003630514705882353,237.0,
171,171.0,25605.0,256.0,0.0035845588235294116,234.0,
172,172.0,25619.0,256.0,0.0035232843137254903,230.0,
173,173.0,25104.0,256.0,0.0035692401960784313,233.0,
174,174.0,25193.0,256.0,0.0035386029411764706,231.0,
175,175.0,20513.0,256.0,0.0034620098039215685,226.0,
176,176.0,21787.0,256.0,0.003446691176470588,225.0,
177,177.0,23002.0,256.0,0.0033088235294117647,216.0,
178,178.0,23905.0,256.0,0.003278186274509804,214.0,
179,179.0,20556.0,256.0,0.0033700980392156864,220.0,
180,180.0,28572.0,256.0,0.0034926470588235296,228.0,
181,181.0,32429.0,256.0,0.003676470588235294,240.0,
182,182.0,28361.0,256.0,0.003737745098039216,244.0,
183,183.0,29341.0,256.0,0.003599877450980392,235.0,
184,184.0,24933.0,256.0,0.003599877450980392,235.0,
185,185.0,28453.0,256.0,0.0035692401960784313,233.0,
186,186.0,25966.0,256.0,0.0035386029411764706,231.0,
187,187.0,21827.0,256.0,0.0035692401960784313,233.0,
188,188.0,27131.0,256.0,0.0034620098039215685,226.0,
189,189.0,22820.0,256.0,0.00350796568627451,229.0,
190,190.0,23000.0,256.0,0.00350796568627451,229.0,
191,191.0,26042.0,256.0,0.003630514705882353,237.0,
192,192.0,30752.0,256.0,0.0035845588235294116,234.0,
193,193.0,28995.0,256.0,0.0035232843137254903,230.0,
194,194.0,26269.0,256.0,0.0034926470588235296,228.0,
195,195.0,31004.0,256.0,0.0034620098039215685,226.0,
196,196.0,30156.0,256.0,0.003477328431372549,227.0,
197,197.0,25111.0,256.0,0.003446691176470588,225.0,
198,198.0,34741.0,256.0,0.003676470588235294,240.0,
199,199.0,29882.0,256.0,0.0036611519607843137,239.0,
200,200.0,29335.0,256.0,0.0036917892156862744,241.0,
201,201.0,32627.0,256.0,0.0037071078431372547,242.0,
202,202.0,29489.0,256.0,0.003599877450980392,235.0,
203,203.0,35075.0,256.0,0.0036458333333333334,238.0,
204,204.0,33850.0,256.0,0.0036151960784313727,236.0,
205,205.0,34035.0,256.0,0.003676470588235294,240.0,
206,206.0,32891.0,256.0,0.0036458333333333334,238.0,
207,207.0,36243.0,256.0,0.0036458333333333334,238.0,
208,208.0,36986.0,256.0,0.003722426470588235,243.0,
209,209.0,37389.0,256.0,0.0036917892156862744,241.0,
210,210.0,37923.0,256.0,0.0038909313725490197,254.0,
211,211.0,31347.0,256.0,0.0038756127450980393,253.0,
212,212.0,33892.0,256.0,0.003860294117647059,252.0,
213,213.0,35619.0,256.0,0.004044117647058824,264.0,
214,214.0,39842.0,256.0,0.004028799019607844,263.0,
215,215.0,39784.0,256.0,0.004181985294117647,273.0,
216,216.0,37120.0,256.0,0.004197303921568627,274.0,
217,217.0,34307.0,256.0,0.004044117647058824,264.0,
218,218.0,33312.0,256.0,0.004044117647058824,264.0,
219,219.0,29060.0,256.0,0.004074754901960785,266.0,
220,220.0,37833.0,256.0,0.004090073529411765,267.0,
221,221.0,40098.0,256.0,0.004120710784313726,269.0,
222,222.0,36227.0,256.0,0.004166666666666667,272.0,
223,223.0,35484.0,256.0,0.004243259803921568,277.0,
224,224.0,37964.0,256.0,0.0043504901960784315,284.0,
225,225.0,35980.0,256.0,0.0043964460784313725,287.0,
226,226.0,39021.0,256.0,0.0044424019607843136,290.0,
227,227.0,40126.0,256.0,0.0043964460784313725,287.0,
228,228.0,31848.0,256.0,0.004518995098039216,295.0,
229,229.0,37125.0,256.0,0.004427083333333333,289.0,
230,230.0,39280.0,256.0,0.004549632352941177,297.0,
231,231.0,40571.0,256.0,0.004595588235294118,300.0,
232,232.0,36604.0,256.0,0.0046721813725490195,305.0,
233,233.0,41074.0,256.0,0.004518995098039216,295.0,
234,234.0,43694.0,256.0,0.004595588235294118,300.0,
235,235.0,38322.0,256.0,0.004564950980392157,298.0,
236,236.0,32524.0,256.0,0.004733455882352941,309.0,
237,237.0,42027.0,256.0,0.004764093137254902,311.0,
238,238.0,35875.0,256.0,0.0047181372549019605,308.0,
239,239.0,40050.0,256.0,0.004810049019607843,314.0,
240,240.0,35384.0,256.0,0.00470281862745098,307.0,
241,241.0,32458.0,256.0,0.004733455882352941,309.0,
242,242.0,40970.0,256.0,0.004610906862745098,301.0,
243,243.0,34336.0,256.0,0.004564950980392157,298.0,
244,244.0,38187.0,256.0,0.0046721813725490195,305.0,
245,245.0,39631.0,256.0,0.0047181372549019605,308.0,
246,246.0,35641.0,256.0,0.0046875,306.0,
247,247.0,32385.0,256.0,0.004871323529411765,318.0,
248,248.0,37205.0,256.0,0.004963235294117647,324.0,
249,249.0,45040.0,256.0,0.005039828431372549,329.0,
250,250.0,42999.0,256.0,0.005024509803921569,328.0,
251,251.0,45215.0,256.0,0.005254289215686275,343.0,
252,252.0,42845.0,256.0,0.005315563725490196,347.0,
253,253.0,42365.0,256.0,0.005346200980392157,349.0,
254,254.0,39502.0,256.0,0.005530024509803922,361.0,
255,255.0,41746.0,256.0,0.005407475490196078,353.0,
256,256.0,44527.0,256.0,0.005300245098039216,346.0,
257,257.0,35954.0,256.0,0.005238970588235294,342.0,
258,258.0,44083.0,256.0,0.005254289215686275,343.0,
259,259.0,43688.0,256.0,0.0055147058823529415,360.0,
260,260.0,38061.0,256.0,0.005392156862745098,352.0,
261,261.0,37636.0,256.0,0.005376838235294118,351.0,
262,262.0,39365.0,256.0,0.005254289215686275,343.0,
263,263.0,44741.0,256.0,0.005223651960784313,341.0,
264,264.0,44158.0,256.0,0.005039828431372549,329.0,
265,265.0,41616.0,256.0,0.00507046568627451,331.0,
266,266.0,39751.0,256.0,0.005254289215686275,343.0,
267,267.0,46348.0,256.0,0.005300245098039216,346.0,
268,268.0,47686.0,256.0,0.005315563725490196,347.0,
269,269.0,41457.0,256.0,0.005300245098039216,346.0,
270,270.0,47873.0,256.0,0.005361519607843137,350.0,
271,271.0,36915.0,256.0,0.005177696078431372,338.0,
272,272.0,39848.0,256.0,0.005346200980392157,349.0,
273,273.0,41785.0,256.0,0.005438112745098039,355.0,
274,274.0,39402.0,256.0,0.005346200980392157,349.0,
275,275.0,45427.0,256.0,0.005300245098039216,346.0,
276,276.0,50478.0,256.0,0.005177696078431372,338.0,
277,277.0,42950.0,256.0,0.005254289215686275,343.0,
278,278.0,50955.0,256.0,0.005438112745098039,355.0,
279,279.0,39864.0,256.0,0.005300245098039216,346.0,
280,280.0,37262.0,256.0,0.005315563725490196,347.0,
281,281.0,44103.0,256.0,0.005300245098039216,346.0,
282,282.0,49245.0,256.0,0.005361519607843137,350.0,
283,283.0,50227.0,256.0,0.005438112745098039,355.0,
284,284.0,42167.0,256.0,0.005422794117647059,354.0,
285,285.0,45175.0,256.0,0.005422794117647059,354.0,
286,286.0,40172.0,256.0,0.005438112745098039,355.0,
287,287.0,41705.0,256.0,0.005637254901960784,368.0,
288,288.0,48502.0,256.0,0.005759803921568628,376.0,
289,289.0,40527.0,256.0,0.0056066176470588236,366.0,
290,290.0,50171.0,256.0,0.005667892156862745,370.0,
291,291.0,50972.0,256.0,0.005637254901960784,368.0,
292,292.0,40776.0,256.0,0.005637254901960784,368.0,
293,293.0,48349.0,256.0,0.005667892156862745,370.0,
294,294.0,42475.0,256.0,0.0058363970588235295,381.0,
295,295.0,54966.0,256.0,0.005713848039215686,373.0,
296,296.0,43997.0,256.0,0.005775122549019608,377.0,
297,297.0,45918.0,256.0,0.005759803921568628,376.0,
298,298.0,49134.0,256.0,0.0057904411764705885,378.0,
299,299.0,53486.0,256.0,0.005958946078431372,389.0,
300,300.0,43453.0,256.0,0.006004901960784314,392.0,
301,301.0,50871.0,256.0,0.0058823529411764705,384.0,
302,302.0,49070.0,256.0,0.00586703431372549,383.0,
303,303.0,50144.0,256.0,0.00586703431372549,383.0,
304,304.0,45689.0,256.0,0.005897671568627451,385.0,
305,305.0,48977.0,256.0,0.00585171568627451,382.0,
306,306.0,48411.0,256.0,0.005897671568627451,385.0,
307,307.0,37100.0,256.0,0.005897671568627451,385.0,
308,308.0,44266.0,256.0,0.006066176470588235,396.0,
309,309.0,49096.0,256.0,0.006326593137254902,413.0,
310,310.0,48214.0,256.0,0.006295955882352941,411.0,
311,311.0,53872.0,256.0,0.006326593137254902,413.0,
312,312.0,52325.0,256.0,0.006403186274509804,418.0,
313,313.0,51607.0,256.0,0.006418504901960784,419.0,
314,314.0,50513.0,256.0,0.006311274509803922,412.0,
315,315.0,50687.0,256.0,0.006433823529411764,420.0,
316,316.0,45535.0,256.0,0.006709558823529411,438.0,
317,317.0,46138.0,256.0,0.0067708333333333336,442.0,
318,318.0,45594.0,256.0,0.006862745098039216,448.0,
319,319.0,40908.0,256.0,0.006847426470588235,447.0,
320,320.0,40746.0,256.0,0.006832107843137255,446.0,
321,321.0,41812.0,256.0,0.006862745098039216,448.0,
322,322.0,39815.0,256.0,0.006556372549019608,428.0,
323,323.0,42400.0,256.0,0.00666360294117647,435.0,
324,324.0,44945.0,256.0,0.006479779411764706,423.0,
325,325.0,46715.0,256.0,0.006387867647058823,417.0,
326,326.0,53244.0,256.0,0.006372549019607843,416.0,
327,327.0,49162.0,256.0,0.0061580882352941175,402.0,
328,328.0,47242.0,256.0,0.006142769607843137,401.0,
329,329.0,44903.0,256.0,0.0059283088235294115,387.0,
330,330.0,46031.0,256.0,0.005775122549019608,377.0,
331,331.0,50874.0,256.0,0.00586703431372549,383.0,
332,332.0,50662.0,256.0,0.006081495098039216,397.0,
333,333.0,55954.0,256.0,0.006219362745098039,406.0,
334,334.0,54030.0,256.0,0.006341911764705882,414.0,
335,335.0,40575.0,256.0,0.006541053921568628,427.0,
336,336.0,53001.0,256.0,0.00664828431372549,434.0,
337,337.0,55443.0,256.0,0.006571691176470588,429.0,
338,338.0,54428.0,256.0,0.006372549019607843,416.0,
339,339.0,44425.0,256.0,0.006678921568627451,436.0,
340,340.0,48285.0,256.0,0.006617647058823529,432.0,
341,341.0,45564.0,256.0,0.006479779411764706,423.0,
342,342.0,40216.0,256.0,0.006479779411764706,423.0,
343,343.0,48999.0,256.0,0.006541053921568628,427.0,
344,344.0,53936.0,256.0,0.006556372549019608,428.0,
345,345.0,52205.0,256.0,0.006602328431372549,431.0,
346,346.0,48955.0,256.0,0.0067248774509803926,439.0,
347,347.0,41776.0,256.0,0.006893382352941176,450.0,
348,348.0,46181.0,256.0,0.006786151960784314,443.0,
349,349.0,45667.0,256.0,0.006832107843137255,446.0,
350,350.0,54393.0,256.0,0.00666360294117647,435.0,
351,351.0,55861.0,256.0,0.006694240196078431,437.0,
352,352.0,56170.0,256.0,0.006755514705882353,441.0,
353,353.0,45207.0,256.0,0.006893382352941176,450.0,
354,354.0,52275.0,256.0,0.006678921568627451,436.0,
355,355.0,53827.0,256.0,0.006694240196078431,437.0,
356,356.0,46637.0,256.0,0.006939338235294117,453.0,
357,357.0,65496.0,256.0,0.0070465686274509805,460.0,
358,358.0,59970.0,256.0,0.007153799019607843,467.0,
359,359.0,58487.0,256.0,0.0070006127450980395,457.0,
360,360.0,60526.0,256.0,0.00703125,459.0,
361,361.0,55194.0,256.0,0.0070006127450980395,457.0,
362,362.0,59916.0,256.0,0.006939338235294117,453.0,
363,363.0,55388.0,256.0,0.006908700980392157,451.0,
364,364.0,46650.0,256.0,0.00703125,459.0,
365,365.0,55520.0,256.0,0.0071384803921568625,466.0,
366,366.0,59051.0,256.0,0.007552083333333333,493.0,
367,367.0,54987.0,256.0,0.0073682598039215685,481.0,
368,368.0,51971.0,256.0,0.007245710784313726,473.0,
369,369.0,59941.0,256.0,0.0072763480392156864,475.0,
370,370.0,57307.0,256.0,0.0070925245098039215,463.0,
371,371.0,57140.0,256.0,0.00701593137254902,458.0,
372,372.0,55534.0,256.0,0.0072763480392156864,475.0,
373,373.0,52451.0,256.0,0.0073682598039215685,481.0,
374,374.0,58534.0,256.0,0.007398897058823529,483.0,
375,375.0,54138.0,256.0,0.007398897058823529,483.0,
376,376.0,52653.0,256.0,0.00742953431372549,485.0,
377,377.0,58070.0,256.0,0.007536764705882353,492.0,
378,378.0,51498.0,256.0,0.007628676470588235,498.0,
379,379.0,51364.0,256.0,0.007460171568627451,487.0,
380,380.0,50359.0,256.0,0.007552083333333333,493.0,
381,381.0,57676.0,256.0,0.007598039215686274,496.0,
382,382.0,52531.0,256.0,0.007689950980392156,502.0,
383,383.0,57933.0,256.0,0.007873774509803921,514.0,
384,384.0,57654.0,256.0,0.0078125,510.0,
385,385.0,51942.0,256.0,0.007521446078431373,491.0,
386,386.0,52391.0,256.0,0.0074142156862745095,484.0,
387,387.0,43601.0,256.0,0.007245710784313726,473.0,
388,388.0,48677.0,256.0,0.007077205882352941,462.0,
389,389.0,44979.0,256.0,0.007215073529411765,471.0,
390,390.0,50762.0,256.0,0.00701593137254902,458.0,
391,391.0,58642.0,256.0,0.007061887254901961,461.0,
392,392.0,58842.0,256.0,0.007199754901960784,470.0,
393,393.0,54576.0,256.0,0.007383578431372549,482.0,
394,394.0,55740.0,256.0,0.007628676470588235,498.0,
395,395.0,60397.0,256.0,0.007751225490196079,506.0,
396,396.0,60877.0,256.0,0.007705269607843138,503.0,
397,397.0,57398.0,256.0,0.007904411764705882,516.0,
398,398.0,62896.0,256.0,0.0078125,510.0,
399,399.0,61536.0,256.0,0.008072916666666667,527.0,
400,400.0,53446.0,256.0,0.00782781862745098,511.0,
401,401.0,56344.0,256.0,0.00779718137254902,509.0,
402,402.0,62588.0,256.0,0.007950367647058823,519.0,
403,403.0,67202.0,256.0,0.007996323529411764,522.0,
404,404.0,64628.0,256.0,0.008287377450980392,541.0,
405,405.0,78162.0,256.0,0.008333333333333333,544.0,
406,406.0,70280.0,256.0,0.008440563725490196,551.0,
407,407.0,65086.0,256.0,0.008348651960784314,545.0,
408,408.0,68231.0,256.0,0.008425245098039215,550.0,
409,409.0,77591.0,256.0,0.008333333333333333,544.0,
410,410.0,64024.0,256.0,0.008409926470588235,549.0,
411,411.0,77818.0,256.0,0.008501838235294117,555.0,
412,412.0,79954.0,256.0,0.00857843137254902,560.0,
413,413.0,77479.0,256.0,0.008700980392156863,568.0,
414,414.0,75724.0,256.0,0.00859375,561.0,
415,415.0,82895.0,256.0,0.008532475490196078,557.0,
416,416.0,72629.0,256.0,0.008379289215686274,547.0,
417,417.0,83999.0,256.0,0.00856311274509804,559.0,
418,418.0,79488.0,256.0,0.008700980392156863,568.0,
419,419.0,80419.0,256.0,0.008900122549019607,581.0,
420,420.0,86972.0,256.0,0.008946078431372548,584.0,
421,421.0,79926.0,256.0,0.00899203431372549,587.0,
422,422.0,83330.0,256.0,0.009037990196078432,590.0,
423,423.0,77163.0,256.0,0.00902267156862745,589.0,
424,424.0,84269.0,256.0,0.009252450980392157,604.0,
425,425.0,82639.0,256.0,0.009175857843137255,599.0,
426,426.0,87845.0,256.0,0.009114583333333334,595.0,
427,427.0,69984.0,256.0,0.009160539215686275,598.0,
428,428.0,86881.0,256.0,0.009114583333333334,595.0,
429,429.0,78417.0,256.0,0.009114583333333334,595.0,
430,430.0,84007.0,256.0,0.009267769607843137,605.0,
431,431.0,80672.0,256.0,0.009129901960784314,596.0,
432,432.0,80259.0,256.0,0.009099264705882354,594.0,
433,433.0,94465.0,256.0,0.00899203431372549,587.0,
434,434.0,80284.0,256.0,0.009114583333333334,595.0,
435,435.0,95463.0,256.0,0.009237132352941177,603.0,
436,436.0,89496.0,256.0,0.00939031862745098,613.0,
437,437.0,95293.0,256.0,0.009512867647058823,621.0,
438,438.0,88859.0,256.0,0.009650735294117647,630.0,
439,439.0,100959.0,256.0,0.009267769607843137,605.0,
440,440.0,93182.0,256.0,0.009436274509803921,616.0,
441,441.0,101679.0,256.0,0.009451593137254901,617.0,
442,442.0,104198.0,256.0,0.009574142156862746,625.0,
443,443.0,105444.0,256.0,0.009696691176470588,633.0,
444,444.0,89306.0,256.0,0.009696691176470588,633.0,
445,445.0,99657.0,256.0,0.009819240196078431,641.0,
446,446.0,99725.0,256.0,0.00974264705882353,636.0,
447,447.0,106623.0,256.0,0.00977328431372549,638.0,
448,448.0,98892.0,256.0,0.00972732843137255,635.0,
449,449.0,91724.0,256.0,0.009834558823529412,642.0,
450,450.0,97250.0,256.0,0.009819240196078431,641.0,
451,451.0,110440.0,256.0,0.009987745098039215,652.0,
452,452.0,90122.0,256.0,0.009941789215686274,649.0,
453,453.0,107861.0,256.0,0.01017156862745098,664.0,
454,454.0,110670.0,256.0,0.010202205882352941,666.0,
455,455.0,102834.0,256.0,0.010370710784313725,677.0,
456,456.0,117177.0,256.0,0.010386029411764705,678.0,
457,457.0,91092.0,256.0,0.010493259803921568,685.0,
458,458.0,106475.0,256.0,0.010615808823529412,693.0,
459,459.0,106816.0,256.0,0.010707720588235294,699.0,
460,460.0,119595.0,256.0,0.010830269607843137,707.0,
461,461.0,120304.0,256.0,0.011060049019607844,722.0,
462,462.0,104764.0,256.0,0.011151960784313726,728.0,
463,463.0,105955.0,256.0,0.011397058823529411,744.0,
464,464.0,111869.0,256.0,0.011534926470588236,753.0,
465,465.0,114541.0,256.0,0.011458333333333333,748.0,
466,466.0,112663.0,256.0,0.011397058823529411,744.0,
467,467.0,116032.0,256.0,0.011289828431372549,737.0,
468,468.0,109140.0,256.0,0.011228553921568627,733.0,
469,469.0,118156.0,256.0,0.011412377450980392,745.0,
470,470.0,129353.0,256.0,0.011289828431372549,737.0,
471,471.0,115277.0,256.0,0.011488970588235295,750.0,
472,472.0,132780.0,256.0,0.011443014705882352,747.0,
473,473.0,120978.0,256.0,0.011473651960784313,749.0,
474,474.0,101590.0,256.0,0.011565563725490197,755.0,
475,475.0,120508.0,256.0,0.011596200980392157,757.0,
476,476.0,112546.0,256.0,0.01133578431372549,740.0,
477,477.0,113961.0,256.0,0.01133578431372549,740.0,
478,478.0,121965.0,256.0,0.011473651960784313,749.0,
479,479.0,115066.0,256.0,0.01135110294117647,741.0,
480,480.0,124302.0,256.0,0.011427696078431372,746.0,
481,481.0,119736.0,256.0,0.011412377450980392,745.0,
482,482.0,115153.0,256.0,0.01130514705882353,738.0,
483,483.0,100327.0,256.0,0.011519607843137256,752.0,
484,484.0,114724.0,256.0,0.011642156862745098,760.0,
485,485.0,100639.0,256.0,0.011642156862745098,760.0,
486,486.0,110029.0,256.0,0.011534926470588236,753.0,
487,487.0,113208.0,256.0,0.011550245098039216,754.0,
488,488.0,116523.0,256.0,0.01171875,765.0,
489,489.0,111633.0,256.0,0.011994485294117648,783.0,
490,490.0,128629.0,256.0,0.012239583333333333,799.0,
491,491.0,124876.0,256.0,0.01248468137254902,815.0,
492,492.0,106688.0,256.0,0.012408088235294117,810.0,
493,493.0,122040.0,256.0,0.01246936274509804,814.0,
494,494.0,112927.0,256.0,0.012392769607843137,809.0,
495,495.0,117115.0,256.0,0.012423406862745097,811.0,
496,496.0,114562.0,256.0,0.012591911764705883,822.0,
497,497.0,112609.0,256.0,0.01248468137254902,815.0,
498,498.0,118640.0,256.0,0.012423406862745097,811.0,
499,499.0,126631.0,256.0,0.012408088235294117,810.0,
500,500.0,114134.0,256.0,0.01248468137254902,815.0,
501,501.0,95128.0,256.0,0.012591911764705883,822.0,
502,502.0,99756.0,256.0,0.012745098039215686,832.0,
503,503.0,86958.0,256.0,0.012576593137254902,821.0,
504,504.0,89793.0,256.0,0.012392769607843137,809.0,
505,505.0,82289.0,256.0,0.012285539215686274,802.0,
506,506.0,94356.0,256.0,0.012147671568627451,793.0,
507,507.0,101191.0,256.0,0.01210171568627451,790.0,
508,508.0,107007.0,256.0,0.012147671568627451,793.0,
509,509.0,111887.0,256.0,0.012438725490196078,812.0,
510,510.0,105936.0,256.0,0.012270220588235294,801.0,
511,511.0,102376.0,256.0,0.012438725490196078,812.0,
512,512.0,101293.0,256.0,0.012285539215686274,802.0,
513,513.0,106771.0,256.0,0.012362132352941176,807.0,
514,514.0,104557.0,256.0,0.012775735294117647,834.0,
515,515.0,103584.0,256.0,0.01291360294117647,843.0,
516,516.0,88697.0,256.0,0.012791053921568627,835.0,
517,517.0,98108.0,256.0,0.012683823529411765,828.0,
518,518.0,106418.0,256.0,0.012438725490196078,812.0,
519,519.0,98206.0,256.0,0.012377450980392156,808.0,
520,520.0,91542.0,256.0,0.012622549019607843,824.0,
521,521.0,98022.0,256.0,0.012438725490196078,812.0,
522,522.0,94320.0,256.0,0.012408088235294117,810.0,
523,523.0,82553.0,256.0,0.012362132352941176,807.0,
524,524.0,82792.0,256.0,0.012147671568627451,793.0,
525,525.0,96304.0,256.0,0.011856617647058823,774.0,
526,526.0,81143.0,256.0,0.011780024509803921,769.0,
527,527.0,101622.0,256.0,0.011871936274509803,775.0,
528,528.0,97172.0,256.0,0.011764705882352941,768.0,
529,529.0,87433.0,256.0,0.011550245098039216,754.0,
530,530.0,87743.0,256.0,0.011550245098039216,754.0,
531,531.0,82655.0,256.0,0.011504289215686275,751.0,
532,532.0,81640.0,256.0,0.011289828431372549,737.0,
533,533.0,77703.0,256.0,0.011090686274509804,724.0,
534,534.0,80246.0,256.0,0.011014093137254903,719.0,
535,535.0,93256.0,256.0,0.011044730392156863,721.0,
536,536.0,82446.0,256.0,0.010830269607843137,707.0,
537,537.0,88067.0,256.0,0.010891544117647058,711.0,
538,538.0,83123.0,256.0,0.01096813725490196,716.0,
539,539.0,81397.0,256.0,0.011121323529411765,726.0,
540,540.0,92347.0,256.0,0.011075367647058824,723.0,
541,541.0,82843.0,256.0,0.011075367647058824,723.0,
542,542.0,77951.0,256.0,0.010830269607843137,707.0,
543,543.0,82033.0,256.0,0.010677083333333334,697.0,
544,544.0,72013.0,256.0,0.010677083333333334,697.0,
545,545.0,84828.0,256.0,0.010569852941176471,690.0,
546,546.0,79973.0,256.0,0.010340073529411764,675.0,
547,547.0,75813.0,256.0,0.010340073529411764,675.0,
548,548.0,77736.0,256.0,0.010309436274509804,673.0,
549,549.0,74927.0,256.0,0.010340073529411764,675.0,
550,550.0,86427.0,256.0,0.010370710784313725,677.0,
551,551.0,78122.0,256.0,0.010370710784313725,677.0,
552,552.0,75578.0,256.0,0.010401348039215686,679.0,
553,553.0,77956.0,256.0,0.010585171568627452,691.0,
554,554.0,79409.0,256.0,0.010646446078431373,695.0,
555,555.0,77686.0,256.0,0.01053921568627451,688.0,
556,556.0,82237.0,256.0,0.010569852941176471,690.0,
557,557.0,83395.0,256.0,0.010447303921568627,682.0,
558,558.0,78661.0,256.0,0.010493259803921568,685.0,
559,559.0,87483.0,256.0,0.010631127450980393,694.0,
560,560.0,74433.0,256.0,0.010615808823529412,693.0,
561,561.0,80490.0,256.0,0.010431985294117646,681.0,
562,562.0,79635.0,256.0,0.010401348039215686,679.0,
563,563.0,77535.0,256.0,0.010370710784313725,677.0,
564,564.0,86611.0,256.0,0.010217524509803922,667.0,
565,565.0,62357.0,256.0,0.010064338235294118,657.0,
566,566.0,65196.0,256.0,0.010431985294117646,681.0,
567,567.0,78929.0,256.0,0.010431985294117646,681.0,
568,568.0,74119.0,256.0,0.010232843137254902,668.0,
569,569.0,70695.0,256.0,0.010202205882352941,666.0,
570,570.0,68820.0,256.0,0.010079656862745099,658.0,
571,571.0,75812.0,256.0,0.010079656862745099,658.0,
572,572.0,77304.0,256.0,0.010079656862745099,658.0,
573,573.0,71348.0,256.0,0.009926470588235294,648.0,
574,574.0,66165.0,256.0,0.01012561274509804,661.0,
575,575.0,71252.0,256.0,0.010033700980392158,655.0,
576,576.0,79255.0,256.0,0.009880514705882353,645.0,
577,577.0,75000.0,256.0,0.00975796568627451,637.0,
578,578.0,80348.0,256.0,0.009574142156862746,625.0,
579,579.0,64690.0,256.0,0.00939031862745098,613.0,
580,580.0,77803.0,256.0,0.00972732843137255,635.0,
581,581.0,76611.0,256.0,0.009650735294117647,630.0,
582,582.0,73979.0,256.0,0.00972732843137255,635.0,
583,583.0,70887.0,256.0,0.00977328431372549,638.0,
584,584.0,58070.0,256.0,0.009574142156862746,625.0,
585,585.0,64348.0,256.0,0.009696691176470588,633.0,
586,586.0,75782.0,256.0,0.009987745098039215,652.0,
587,587.0,70419.0,256.0,0.00978860294117647,639.0,
588,588.0,75507.0,256.0,0.00978860294117647,639.0,
589,589.0,74983.0,256.0,0.00977328431372549,638.0,
590,590.0,73096.0,256.0,0.010049019607843138,656.0,
591,591.0,67677.0,256.0,0.009941789215686274,649.0,
592,592.0,60555.0,256.0,0.009957107843137254,650.0,
593,593.0,66190.0,256.0,0.010003063725490195,653.0,
594,594.0,75587.0,256.0,0.009895833333333333,646.0,
595,595.0,75707.0,256.0,0.009849877450980392,643.0,
596,596.0,68032.0,256.0,0.009696691176470588,633.0,
597,597.0,63068.0,256.0,0.009375,612.0,
598,598.0,72008.0,256.0,0.009543504901960785,623.0,
599,599.0,67143.0,256.0,0.009650735294117647,630.0,
600,600.0,67738.0,256.0,0.009543504901960785,623.0,
601,601.0,59004.0,256.0,0.009558823529411765,624.0,
602,602.0,60586.0,256.0,0.00939031862745098,613.0,
603,603.0,59981.0,256.0,0.009175857843137255,599.0,
604,604.0,55364.0,256.0,0.009160539215686275,598.0,
605,605.0,59453.0,256.0,0.009252450980392157,604.0,
606,606.0,63902.0,256.0,0.009160539215686275,598.0,
607,607.0,61024.0,256.0,0.00897671568627451,586.0,
608,608.0,55178.0,256.0,0.009206495098039216,601.0,
609,609.0,61317.0,256.0,0.009099264705882354,594.0,
610,610.0,54506.0,256.0,0.008884803921568627,580.0,
611,611.0,56107.0,256.0,0.008946078431372548,584.0,
612,612.0,53375.0,256.0,0.008762254901960784,572.0,
613,613.0,47899.0,256.0,0.008762254901960784,572.0,
614,614.0,56891.0,256.0,0.008777573529411765,573.0,
615,615.0,51652.0,256.0,0.008900122549019607,581.0,
616,616.0,53079.0,256.0,0.008700980392156863,568.0,
617,617.0,52690.0,256.0,0.008685661764705883,567.0,
618,618.0,55430.0,256.0,0.008394607843137255,548.0,
619,619.0,44160.0,256.0,0.008302696078431373,542.0,
620,620.0,45206.0,256.0,0.008348651960784314,545.0,
621,621.0,45955.0,256.0,0.00814950980392157,532.0,
622,622.0,41617.0,256.0,0.008042279411764705,525.0,
623,623.0,47296.0,256.0,0.008103553921568628,529.0,
624,624.0,54804.0,256.0,0.0078125,510.0,
625,625.0,50749.0,256.0,0.007521446078431373,491.0,
626,626.0,48244.0,256.0,0.007337622549019608,479.0,
627,627.0,43828.0,256.0,0.007383578431372549,482.0,
628,628.0,46679.0,256.0,0.00742953431372549,485.0,
629,629.0,50471.0,256.0,0.007383578431372549,482.0,
630,630.0,52535.0,256.0,0.007306985294117647,477.0,
631,631.0,59052.0,256.0,0.007215073529411765,471.0,
632,632.0,52153.0,256.0,0.0073682598039215685,481.0,
633,633.0,46439.0,256.0,0.007490808823529412,489.0,
634,634.0,47166.0,256.0,0.007475490196078432,488.0,
635,635.0,51456.0,256.0,0.007490808823529412,489.0,
636,636.0,49828.0,256.0,0.007613357843137255,497.0,
637,637.0,52880.0,256.0,0.007674632352941176,501.0,
638,638.0,56916.0,256.0,0.007613357843137255,497.0,
639,639.0,55121.0,256.0,0.007460171568627451,487.0,
640,640.0,46169.0,256.0,0.00744485294117647,486.0,
641,641.0,51114.0,256.0,0.007337622549019608,479.0,
642,642.0,54749.0,256.0,0.007475490196078432,488.0,
643,643.0,51068.0,256.0,0.007613357843137255,497.0,
644,644.0,51073.0,256.0,0.0074142156862745095,484.0,
645,645.0,50826.0,256.0,0.007475490196078432,488.0,
646,646.0,51773.0,256.0,0.0074142156862745095,484.0,
647,647.0,50952.0,256.0,0.007352941176470588,480.0,
648,648.0,47202.0,256.0,0.007291666666666667,476.0,
649,649.0,54373.0,256.0,0.007352941176470588,480.0,
650,650.0,52519.0,256.0,0.007398897058823529,483.0,
651,651.0,60965.0,256.0,0.007552083333333333,493.0,
652,652.0,56200.0,256.0,0.007475490196078432,488.0,
653,653.0,61926.0,256.0,0.007521446078431373,491.0,
654,654.0,55124.0,256.0,0.007705269607843138,503.0,
655,655.0,60457.0,256.0,0.007919730392156862,517.0,
656,656.0,61161.0,256.0,0.00816482843137255,533.0,
657,657.0,52904.0,256.0,0.00821078431372549,536.0,
658,658.0,54375.0,256.0,0.008302696078431373,542.0,
659,659.0,54214.0,256.0,0.00822610294117647,537.0,
660,660.0,53330.0,256.0,0.00819546568627451,535.0,
661,661.0,54110.0,256.0,0.00814950980392157,532.0,
662,662.0,47287.0,256.0,0.00821078431372549,536.0,
663,663.0,51287.0,256.0,0.007965686274509803,520.0,
664,664.0,48789.0,256.0,0.007689950980392156,502.0,
665,665.0,55456.0,256.0,0.00784313725490196,512.0,
666,666.0,59497.0,256.0,0.007674632352941176,501.0,
667,667.0,58984.0,256.0,0.007751225490196079,506.0,
668,668.0,55417.0,256.0,0.00779718137254902,509.0,
669,669.0,48001.0,256.0,0.008042279411764705,525.0,
670,670.0,50681.0,256.0,0.007981004901960784,521.0,
671,671.0,60356.0,256.0,0.007781862745098039,508.0,
672,672.0,57720.0,256.0,0.007996323529411764,522.0,
673,673.0,59957.0,256.0,0.007889093137254902,515.0,
674,674.0,59890.0,256.0,0.007552083333333333,493.0,
675,675.0,49061.0,256.0,0.007598039215686274,496.0,
676,676.0,56094.0,256.0,0.007751225490196079,506.0,
677,677.0,55171.0,256.0,0.007873774509803921,514.0,
678,678.0,63248.0,256.0,0.0078125,510.0,
679,679.0,56625.0,256.0,0.007889093137254902,515.0,
680,680.0,62598.0,256.0,0.007965686274509803,520.0,
681,681.0,66290.0,256.0,0.008272058823529412,540.0,
682,682.0,55329.0,256.0,0.00822610294117647,537.0,
683,683.0,58112.0,256.0,0.008379289215686274,547.0,
684,684.0,64902.0,256.0,0.008486519607843137,554.0,
685,685.0,63904.0,256.0,0.008609068627450981,562.0,
686,686.0,51069.0,256.0,0.008425245098039215,550.0,
687,687.0,55471.0,256.0,0.008394607843137255,548.0,
688,688.0,63354.0,256.0,0.008134191176470589,531.0,
689,689.0,48216.0,256.0,0.008088235294117648,528.0,
690,690.0,55837.0,256.0,0.008088235294117648,528.0,
691,691.0,56231.0,256.0,0.008026960784313725,524.0,
692,692.0,53132.0,256.0,0.008118872549019608,530.0,
693,693.0,57778.0,256.0,0.008118872549019608,530.0,
694,694.0,52294.0,256.0,0.007904411764705882,516.0,
695,695.0,49311.0,256.0,0.007705269607843138,503.0,
696,696.0,47730.0,256.0,0.007643995098039215,499.0,
697,697.0,51114.0,256.0,0.007536764705882353,492.0,
698,698.0,46068.0,256.0,0.007490808823529412,489.0,
699,699.0,50961.0,256.0,0.0073682598039215685,481.0,
700,700.0,56275.0,256.0,0.007536764705882353,492.0,
701,701.0,52756.0,256.0,0.007582720588235294,495.0,
702,702.0,56545.0,256.0,0.007475490196078432,488.0,
703,703.0,55690.0,256.0,0.007521446078431373,491.0,
704,704.0,52571.0,256.0,0.007536764705882353,492.0,
705,705.0,51901.0,256.0,0.007582720588235294,495.0,
706,706.0,50068.0,256.0,0.007751225490196079,506.0,
707,707.0,49416.0,256.0,0.007475490196078432,488.0,
708,708.0,58211.0,256.0,0.007506127450980392,490.0,
709,709.0,54382.0,256.0,0.007720588235294118,504.0,
710,710.0,58709.0,256.0,0.007766544117647059,507.0,
711,711.0,54517.0,256.0,0.007735906862745098,505.0,
712,712.0,57424.0,256.0,0.007735906862745098,505.0,
713,713.0,69253.0,256.0,0.007735906862745098,505.0,
714,714.0,59993.0,256.0,0.007598039215686274,496.0,
715,715.0,54455.0,256.0,0.007582720588235294,495.0,
716,716.0,56806.0,256.0,0.007613357843137255,497.0,
717,717.0,60417.0,256.0,0.007751225490196079,506.0,
718,718.0,56767.0,256.0,0.00784313725490196,512.0,
719,719.0,57216.0,256.0,0.00782781862745098,511.0,
720,720.0,55536.0,256.0,0.007720588235294118,504.0,
721,721.0,56563.0,256.0,0.00782781862745098,511.0,
722,722.0,57626.0,256.0,0.00784313725490196,512.0,
723,723.0,55607.0,256.0,0.007873774509803921,514.0,
724,724.0,52979.0,256.0,0.007689950980392156,502.0,
725,725.0,55264.0,256.0,0.007766544117647059,507.0,
726,726.0,56069.0,256.0,0.007705269607843138,503.0,
727,727.0,54873.0,256.0,0.007567401960784314,494.0,
728,728.0,52560.0,256.0,0.007904411764705882,516.0,
729,729.0,63045.0,256.0,0.008057598039215687,526.0,
730,730.0,65000.0,256.0,0.008103553921568628,529.0,
731,731.0,55132.0,256.0,0.007889093137254902,515.0,
732,732.0,49904.0,256.0,0.007720588235294118,504.0,
733,733.0,60242.0,256.0,0.007751225490196079,506.0,
734,734.0,55305.0,256.0,0.00782781862745098,511.0,
735,735.0,60413.0,256.0,0.007950367647058823,519.0,
736,736.0,59992.0,256.0,0.008103553921568628,529.0,
737,737.0,59184.0,256.0,0.008256740196078432,539.0,
738,738.0,65766.0,256.0,0.00819546568627451,535.0,
739,739.0,53799.0,256.0,0.008302696078431373,542.0,
740,740.0,54831.0,256.0,0.00822610294117647,537.0,
741,741.0,52805.0,256.0,0.008241421568627451,538.0,
742,742.0,52975.0,256.0,0.00818014705882353,534.0,
743,743.0,60349.0,256.0,0.00822610294117647,537.0,
744,744.0,55209.0,256.0,0.008241421568627451,538.0,
745,745.0,54787.0,256.0,0.008517156862745097,556.0,
746,746.0,55060.0,256.0,0.008639705882352942,564.0,
747,747.0,53972.0,256.0,0.008532475490196078,557.0,
748,748.0,54423.0,256.0,0.008287377450980392,541.0,
749,749.0,51213.0,256.0,0.008256740196078432,539.0,
750,750.0,62441.0,256.0,0.00814950980392157,532.0,
751,751.0,52312.0,256.0,0.00816482843137255,533.0,
752,752.0,52439.0,256.0,0.008042279411764705,525.0,
753,753.0,55839.0,256.0,0.008026960784313725,524.0,
754,754.0,51664.0,256.0,0.008042279411764705,525.0,
755,755.0,56535.0,256.0,0.00816482843137255,533.0,
756,756.0,51287.0,256.0,0.007858455882352941,513.0,
757,757.0,56392.0,256.0,0.00779718137254902,509.0,
758,758.0,53554.0,256.0,0.007766544117647059,507.0,
759,759.0,56532.0,256.0,0.007858455882352941,513.0,
760,760.0,54905.0,256.0,0.007965686274509803,520.0,
761,761.0,60002.0,256.0,0.007981004901960784,521.0,
762,762.0,54570.0,256.0,0.00782781862745098,511.0,
763,763.0,58472.0,256.0,0.007674632352941176,501.0,
764,764.0,42443.0,256.0,0.007552083333333333,493.0,
765,765.0,47379.0,256.0,0.007567401960784314,494.0,
766,766.0,55477.0,256.0,0.007490808823529412,489.0,
767,767.0,50804.0,256.0,0.007460171568627451,487.0,
768,768.0,55273.0,256.0,0.00782781862745098,511.0,
769,769.0,46164.0,256.0,0.007598039215686274,496.0,
770,770.0,50029.0,256.0,0.007536764705882353,492.0,
771,771.0,59750.0,256.0,0.007552083333333333,493.0,
772,772.0,54065.0,256.0,0.007536764705882353,492.0,
773,773.0,57264.0,256.0,0.007398897058823529,483.0,
774,774.0,54354.0,256.0,0.0073223039215686275,478.0,
775,775.0,55093.0,256.0,0.007337622549019608,479.0,
776,776.0,58683.0,256.0,0.007352941176470588,480.0,
777,777.0,63262.0,256.0,0.007506127450980392,490.0,
778,778.0,57705.0,256.0,0.007598039215686274,496.0,
779,779.0,56095.0,256.0,0.007735906862745098,505.0,
780,780.0,56199.0,256.0,0.007628676470588235,498.0,
781,781.0,57753.0,256.0,0.007490808823529412,489.0,
782,782.0,55623.0,256.0,0.00742953431372549,485.0,
783,783.0,57966.0,256.0,0.0072763480392156864,475.0,
784,784.0,54892.0,256.0,0.007337622549019608,479.0,
785,785.0,54467.0,256.0,0.00742953431372549,485.0,
786,786.0,52137.0,256.0,0.007475490196078432,488.0,
787,787.0,59219.0,256.0,0.0074142156862745095,484.0,
788,788.0,57518.0,256.0,0.0071844362745098036,469.0,
789,789.0,59384.0,256.0,0.007123161764705882,465.0,
790,790.0,58949.0,256.0,0.007199754901960784,470.0,
791,791.0,54554.0,256.0,0.007199754901960784,470.0,
792,792.0,48215.0,256.0,0.007306985294117647,477.0,
793,793.0,54385.0,256.0,0.007107843137254902,464.0,
794,794.0,50961.0,256.0,0.007153799019607843,467.0,
795,795.0,54224.0,256.0,0.0071844362745098036,469.0,
796,796.0,60990.0,256.0,0.007383578431372549,482.0,
797,797.0,67478.0,256.0,0.007506127450980392,490.0,
798,798.0,62373.0,256.0,0.007306985294117647,477.0,
799,799.0,49298.0,256.0,0.007352941176470588,480.0,
800,800.0,60013.0,256.0,0.0074142156862745095,484.0,
801,801.0,63007.0,256.0,0.007613357843137255,497.0,
802,802.0,50561.0,256.0,0.007689950980392156,502.0,
803,803.0,59673.0,256.0,0.007674632352941176,501.0,
804,804.0,56042.0,256.0,0.007781862745098039,508.0,
805,805.0,64925.0,256.0,0.008118872549019608,530.0,
806,806.0,66809.0,256.0,0.008134191176470589,531.0,
807,807.0,68859.0,256.0,0.00816482843137255,533.0,
808,808.0,53313.0,256.0,0.008103553921568628,529.0,
809,809.0,58170.0,256.0,0.008302696078431373,542.0,
810,810.0,59778.0,256.0,0.008302696078431373,542.0,
811,811.0,56588.0,256.0,0.00816482843137255,533.0,
812,812.0,56773.0,256.0,0.008118872549019608,530.0,
813,813.0,52385.0,256.0,0.007781862745098039,508.0,
814,814.0,50042.0,256.0,0.007950367647058823,519.0,
815,815.0,64627.0,256.0,0.00821078431372549,536.0,
816,816.0,62834.0,256.0,0.008057598039215687,526.0,
817,817.0,57972.0,256.0,0.008026960784313725,524.0,
818,818.0,58813.0,256.0,0.00819546568627451,535.0,
819,819.0,59467.0,256.0,0.008088235294117648,528.0,
820,820.0,66842.0,256.0,0.00822610294117647,537.0,
821,821.0,59542.0,256.0,0.008134191176470589,531.0,
822,822.0,63695.0,256.0,0.008318014705882353,543.0,
823,823.0,52306.0,256.0,0.008272058823529412,540.0,
824,824.0,58198.0,256.0,0.008088235294117648,528.0,
825,825.0,58773.0,256.0,0.008057598039215687,526.0,
826,826.0,49147.0,256.0,0.00816482843137255,533.0,
827,827.0,51390.0,256.0,0.008026960784313725,524.0,
828,828.0,55130.0,256.0,0.008118872549019608,530.0,
829,829.0,63237.0,256.0,0.008256740196078432,539.0,
830,830.0,60591.0,256.0,0.008409926470588235,549.0,
831,831.0,64238.0,256.0,0.008348651960784314,545.0,
832,832.0,65380.0,256.0,0.008287377450980392,541.0,
833,833.0,65736.0,256.0,0.008302696078431373,542.0,
834,834.0,50984.0,256.0,0.008287377450980392,541.0,
835,835.0,60916.0,256.0,0.00819546568627451,535.0,
836,836.0,56026.0,256.0,0.00822610294117647,537.0,
837,837.0,59625.0,256.0,0.008241421568627451,538.0,
838,838.0,53921.0,256.0,0.007950367647058823,519.0,
839,839.0,48912.0,256.0,0.007919730392156862,517.0,
840,840.0,55865.0,256.0,0.007996323529411764,522.0,
841,841.0,55083.0,256.0,0.008287377450980392,541.0,
842,842.0,59449.0,256.0,0.007965686274509803,520.0,
843,843.0,62187.0,256.0,0.007981004901960784,521.0,
844,844.0,60678.0,256.0,0.007996323529411764,522.0,
845,845.0,60690.0,256.0,0.007950367647058823,519.0,
846,846.0,48873.0,256.0,0.008118872549019608,530.0,
847,847.0,53040.0,256.0,0.008318014705882353,543.0,
848,848.0,52834.0,256.0,0.00821078431372549,536.0,
849,849.0,48315.0,256.0,0.00819546568627451,535.0,
850,850.0,54600.0,256.0,0.008072916666666667,527.0,
851,851.0,53207.0,256.0,0.008072916666666667,527.0,
852,852.0,51343.0,256.0,0.007935049019607843,518.0,
853,853.0,54245.0,256.0,0.008026960784313725,524.0,
854,854.0,56727.0,256.0,0.008026960784313725,524.0,
855,855.0,46285.0,256.0,0.008011642156862744,523.0,
856,856.0,51772.0,256.0,0.007705269607843138,503.0,
857,857.0,54947.0,256.0,0.007613357843137255,497.0,
858,858.0,52099.0,256.0,0.007567401960784314,494.0,
859,859.0,49059.0,256.0,0.007506127450980392,490.0,
860,860.0,42602.0,256.0,0.0072763480392156864,475.0,
861,861.0,44801.0,256.0,0.0071844362745098036,469.0,
862,862.0,53232.0,256.0,0.007061887254901961,461.0,
863,863.0,55256.0,256.0,0.006969975490196079,455.0,
864,864.0,56196.0,256.0,0.007169117647058823,468.0,
865,865.0,49599.0,256.0,0.007352941176470588,480.0,
866,866.0,52006.0,256.0,0.007337622549019608,479.0,
867,867.0,47802.0,256.0,0.007475490196078432,488.0,
868,868.0,47559.0,256.0,0.007582720588235294,495.0,
869,869.0,62087.0,256.0,0.007735906862745098,505.0,
870,870.0,61895.0,256.0,0.007858455882352941,513.0,
871,871.0,56186.0,256.0,0.008042279411764705,525.0,
872,872.0,43371.0,256.0,0.007935049019607843,518.0,
873,873.0,50174.0,256.0,0.007858455882352941,513.0,
874,874.0,56431.0,256.0,0.007735906862745098,505.0,
875,875.0,54015.0,256.0,0.007659313725490196,500.0,
876,876.0,53670.0,256.0,0.007735906862745098,505.0,
877,877.0,65366.0,256.0,0.007567401960784314,494.0,
878,878.0,54536.0,256.0,0.007352941176470588,480.0,
879,879.0,57920.0,256.0,0.007352941176470588,480.0,
880,880.0,54065.0,256.0,0.007383578431372549,482.0,
881,881.0,59152.0,256.0,0.007567401960784314,494.0,
882,882.0,63132.0,256.0,0.007628676470588235,498.0,
883,883.0,66103.0,256.0,0.007751225490196079,506.0,
884,884.0,65532.0,256.0,0.00782781862745098,511.0,
885,885.0,52502.0,256.0,0.007705269607843138,503.0,
886,886.0,58219.0,256.0,0.007781862745098039,508.0,
887,887.0,57658.0,256.0,0.007720588235294118,504.0,
888,888.0,49834.0,256.0,0.007735906862745098,505.0,
889,889.0,55632.0,256.0,0.007781862745098039,508.0,
890,890.0,53145.0,256.0,0.007919730392156862,517.0,
891,891.0,58640.0,256.0,0.007873774509803921,514.0,
892,892.0,45122.0,256.0,0.007460171568627451,487.0,
893,893.0,61141.0,256.0,0.007659313725490196,500.0,
894,894.0,50604.0,256.0,0.0078125,510.0,
895,895.0,50776.0,256.0,0.007981004901960784,521.0,
896,896.0,55580.0,256.0,0.00784313725490196,512.0,
897,897.0,53840.0,256.0,0.007552083333333333,493.0,
898,898.0,52920.0,256.0,0.007521446078431373,491.0,
899,899.0,53298.0,256.0,0.007306985294117647,477.0,
900,900.0,56403.0,256.0,0.007383578431372549,482.0,
901,901.0,49044.0,256.0,0.0072763480392156864,475.0,
902,902.0,44439.0,256.0,0.0070925245098039215,463.0,
903,903.0,47306.0,256.0,0.0070006127450980395,457.0,
904,904.0,47862.0,256.0,0.007107843137254902,464.0,
905,905.0,54937.0,256.0,0.006969975490196079,455.0,
906,906.0,50106.0,256.0,0.0071384803921568625,466.0,
907,907.0,50985.0,256.0,0.007169117647058823,468.0,
908,908.0,43865.0,256.0,0.007153799019607843,467.0,
909,909.0,48142.0,256.0,0.0070465686274509805,460.0,
910,910.0,47477.0,256.0,0.007061887254901961,461.0,
911,911.0,42074.0,256.0,0.00703125,459.0,
912,912.0,50675.0,256.0,0.006862745098039216,448.0,
913,913.0,49905.0,256.0,0.0067708333333333336,442.0,
914,914.0,45634.0,256.0,0.00664828431372549,434.0,
915,915.0,46844.0,256.0,0.00664828431372549,434.0,
916,916.0,49318.0,256.0,0.00664828431372549,434.0,
917,917.0,54009.0,256.0,0.006862745098039216,448.0,
918,918.0,52277.0,256.0,0.0067708333333333336,442.0,
919,919.0,45111.0,256.0,0.006740196078431373,440.0,
920,920.0,49929.0,256.0,0.006694240196078431,437.0,
921,921.0,46330.0,256.0,0.006587009803921569,430.0,
922,922.0,42946.0,256.0,0.006587009803921569,430.0,
923,923.0,48617.0,256.0,0.006571691176470588,429.0,
924,924.0,47199.0,256.0,0.00663296568627451,433.0,
925,925.0,38954.0,256.0,0.006587009803921569,430.0,
926,926.0,52017.0,256.0,0.006678921568627451,436.0,
927,927.0,53549.0,256.0,0.006678921568627451,436.0,
928,928.0,49942.0,256.0,0.00664828431372549,434.0,
929,929.0,45246.0,256.0,0.006602328431372549,431.0,
930,930.0,46024.0,256.0,0.006602328431372549,431.0,
931,931.0,52459.0,256.0,0.006495098039215687,424.0,
932,932.0,49995.0,256.0,0.006541053921568628,427.0,
933,933.0,51851.0,256.0,0.006587009803921569,430.0,
934,934.0,52354.0,256.0,0.006694240196078431,437.0,
935,935.0,54518.0,256.0,0.006541053921568628,427.0,
936,936.0,53304.0,256.0,0.006479779411764706,423.0,
937,937.0,44641.0,256.0,0.006602328431372549,431.0,
938,938.0,54220.0,256.0,0.006525735294117647,426.0,
939,939.0,47664.0,256.0,0.006694240196078431,437.0,
940,940.0,54950.0,256.0,0.006602328431372549,431.0,
941,941.0,51150.0,256.0,0.006832107843137255,446.0,
942,942.0,47768.0,256.0,0.006832107843137255,446.0,
943,943.0,47590.0,256.0,0.006801470588235294,444.0,
944,944.0,45626.0,256.0,0.006969975490196079,455.0,
945,945.0,58057.0,256.0,0.007077205882352941,462.0,
946,946.0,46705.0,256.0,0.006939338235294117,453.0,
947,947.0,46384.0,256.0,0.00701593137254902,458.0,
948,948.0,43543.0,256.0,0.006939338235294117,453.0,
949,949.0,41344.0,256.0,0.0070006127450980395,457.0,
950,950.0,38035.0,256.0,0.006893382352941176,450.0,
951,951.0,47344.0,256.0,0.006755514705882353,441.0,
952,952.0,39091.0,256.0,0.006740196078431373,440.0,
953,953.0,45931.0,256.0,0.006433823529411764,420.0,
954,954.0,50552.0,256.0,0.006464460784313725,422.0,
955,955.0,47572.0,256.0,0.006418504901960784,419.0,
956,956.0,49975.0,256.0,0.006449142156862745,421.0,
957,957.0,55833.0,256.0,0.006510416666666667,425.0,
958,958.0,50236.0,256.0,0.006495098039215687,424.0,
959,959.0,53027.0,256.0,0.006510416666666667,425.0,
960,960.0,52384.0,256.0,0.00664828431372549,434.0,
961,961.0,54773.0,256.0,0.0067708333333333336,442.0,
962,962.0,54149.0,256.0,0.006939338235294117,453.0,
963,963.0,50518.0,256.0,0.006740196078431373,440.0,
964,964.0,52715.0,256.0,0.006755514705882353,441.0,
965,965.0,48660.0,256.0,0.0067248774509803926,439.0,
966,966.0,50895.0,256.0,0.006602328431372549,431.0,
967,967.0,45668.0,256.0,0.00663296568627451,433.0,
968,968.0,43774.0,256.0,0.006816789215686275,445.0,
969,969.0,48635.0,256.0,0.006556372549019608,428.0,
970,970.0,50654.0,256.0,0.006341911764705882,414.0,
971,971.0,48623.0,256.0,0.006510416666666667,425.0,
972,972.0,53525.0,256.0,0.006357230392156863,415.0,
973,973.0,48109.0,256.0,0.006510416666666667,425.0,
974,974.0,46837.0,256.0,0.006464460784313725,422.0,
975,975.0,50232.0,256.0,0.006694240196078431,437.0,
976,976.0,50179.0,256.0,0.00664828431372549,434.0,
977,977.0,45478.0,256.0,0.006541053921568628,427.0,
978,978.0,51244.0,256.0,0.006510416666666667,425.0,
979,979.0,44639.0,256.0,0.006678921568627451,436.0,
980,980.0,48403.0,256.0,0.0067248774509803926,439.0,
981,981.0,52024.0,256.0,0.006847426470588235,447.0,
982,982.0,49796.0,256.0,0.006862745098039216,448.0,
983,983.0,49548.0,256.0,0.0067708333333333336,442.0,
984,984.0,53127.0,256.0,0.006786151960784314,443.0,
985,985.0,48931.0,256.0,0.006893382352941176,450.0,
986,986.0,50471.0,256.0,0.00663296568627451,433.0,
987,987.0,46641.0,256.0,0.006816789215686275,445.0,
988,988.0,53551.0,256.0,0.0067248774509803926,439.0,
989,989.0,41422.0,256.0,0.006587009803921569,430.0,
990,990.0,47877.0,256.0,0.00663296568627451,433.0,
991,991.0,47753.0,256.0,0.00664828431372549,434.0,
992,992.0,52580.0,256.0,0.00664828431372549,434.0,
993,993.0,53758.0,256.0,0.006908700980392157,451.0,
994,994.0,52484.0,256.0,0.006816789215686275,445.0,
995,995.0,56487.0,256.0,0.006939338235294117,453.0,
996,996.0,62060.0,256.0,0.006908700980392157,451.0,
997,997.0,58045.0,256.0,0.006924019607843137,452.0,
998,998.0,51805.0,256.0,0.007061887254901961,461.0,
999,999.0,50403.0,256.0,0.0070465686274509805,460.0,
