0,0.0,0.0,2.0,0_1,801_0,84
1,1.0,6374.0,2.0,0_1,1041_0,93
2,2.0,3909.0,2.0,0_1,1011_0,94
3,3.0,2922.0,2.0,0_1,951_0,86
4,4.0,2917.0,2.0,0_1,941_0,88
5,5.0,3467.0,2.0,0_1,991_0,91
6,6.0,4578.0,2.0,0_1,1041_0,88
7,7.0,3663.0,2.0,0_1,1011_0,97
8,8.0,4202.0,2.0,0_1,1051_0,104
9,9.0,3144.0,2.0,0_1,1111_0,106
10,10.0,4223.0,2.0,0_1,1111_0,107
11,11.0,5024.0,2.0,0_1,1101_0,106
12,12.0,4657.0,2.0,0_1,1131_0,109
13,13.0,4639.0,2.0,0_1,1221_0,111
14,14.0,5359.0,2.0,0_1,1291_0,116
15,15.0,4869.0,2.0,0_1,1391_0,119
16,16.0,5215.0,2.0,0_1,1421_0,127
17,17.0,6002.0,2.0,0_1,1421_0,137
18,18.0,5580.0,2.0,0_1,1601_0,142
19,19.0,7123.0,2.0,0_1,1581_0,146
20,20.0,5042.0,2.0,0_1,1711_0,150
21,21.0,6695.0,2.0,0_1,1731_0,155
22,22.0,6510.0,2.0,0_1,1811_0,165
23,23.0,8138.0,2.0,0_1,1921_0,177
24,24.0,6741.0,2.0,0_1,2021_0,190
25,25.0,6766.0,2.0,0_1,1991_0,189
26,26.0,7973.0,2.0,0_1,2071_0,194
27,27.0,5711.0,2.0,0_1,2091_0,193
28,28.0,6455.0,2.0,0_1,2001_0,198
29,29.0,5429.0,2.0,0_1,1921_0,198
30,30.0,7035.0,2.0,0_1,1971_0,201
31,31.0,7264.0,2.0,0_1,2031_0,208
32,32.0,7158.0,2.0,0_1,2081_0,209
33,33.0,7401.0,2.0,0_1,2081_0,220
34,34.0,8943.0,2.0,0_1,2081_0,223
35,35.0,8773.0,2.0,0_1,2171_0,228
36,36.0,7393.0,2.0,0_1,2161_0,232
37,37.0,9545.0,2.0,0_1,2221_0,240
38,38.0,8654.0,2.0,0_1,2291_0,242
39,39.0,7973.0,2.0,0_1,2391_0,240
40,40.0,9219.0,2.0,0_1,2491_0,246
41,41.0,9990.0,2.0,0_1,2521_0,242
42,42.0,7158.0,2.0,0_1,2571_0,247
43,43.0,8144.0,2.0,0_1,2681_0,257
44,44.0,10054.0,2.0,0_1,2721_0,257
45,45.0,9279.0,2.0,0_1,2791_0,257
46,46.0,8352.0,2.0,0_1,2861_0,271
47,47.0,8494.0,2.0,0_1,2881_0,275
48,48.0,9797.0,2.0,0_1,3011_0,272
49,49.0,9951.0,2.0,0_1,3091_0,274
50,50.0,9664.0,2.0,0_1,3111_0,277
51,51.0,10459.0,2.0,0_1,3211_0,283
52,52.0,10962.0,2.0,0_1,3221_0,284
53,53.0,10161.0,2.0,0_1,3291_0,280
54,54.0,11774.0,2.0,0_1,3351_0,285
55,55.0,10849.0,2.0,0_1,3401_0,296
56,56.0,13013.0,2.0,0_1,3371_0,305
57,57.0,10394.0,2.0,0_1,3421_0,313
58,58.0,11507.0,2.0,0_1,3441_0,314
59,59.0,10064.0,2.0,0_1,3461_0,318
60,60.0,11889.0,2.0,0_1,3471_0,326
61,61.0,10747.0,2.0,0_1,3461_0,336
62,62.0,11733.0,2.0,0_1,3461_0,341
63,63.0,12328.0,2.0,0_1,3621_0,335
64,64.0,12656.0,2.0,0_1,3591_0,335
65,65.0,13338.0,2.0,0_1,3641_0,341
66,66.0,10667.0,2.0,0_1,3631_0,340
67,67.0,12096.0,2.0,0_1,3701_0,342
68,68.0,11570.0,2.0,0_1,3701_0,352
69,69.0,12846.0,2.0,0_1,3721_0,363
70,70.0,13430.0,2.0,0_1,3731_0,370
71,71.0,13624.0,2.0,0_1,3771_0,380
72,72.0,12568.0,2.0,0_1,3891_0,386
73,73.0,13463.0,2.0,0_1,3991_0,389
74,74.0,11792.0,2.0,0_1,3981_0,404
75,75.0,14142.0,2.0,0_1,4161_0,413
76,76.0,14398.0,2.0,0_1,4251_0,424
77,77.0,13584.0,2.0,0_1,4281_0,420
78,78.0,13676.0,2.0,0_1,4401_0,432
79,79.0,15317.0,2.0,0_1,4441_0,439
80,80.0,12871.0,2.0,0_1,4421_0,435
81,81.0,14929.0,2.0,0_1,4601_0,438
82,82.0,17502.0,2.0,0_1,4661_0,446
83,83.0,16338.0,2.0,0_1,4661_0,460
84,84.0,16313.0,2.0,0_1,4621_0,454
85,85.0,14745.0,2.0,0_1,4601_0,472
86,86.0,16159.0,2.0,0_1,4631_0,485
87,87.0,13439.0,2.0,0_1,4651_0,482
88,88.0,17914.0,2.0,0_1,4731_0,488
89,89.0,13482.0,2.0,0_1,4941_0,499
90,90.0,18490.0,2.0,0_1,5011_0,520
91,91.0,16115.0,2.0,0_1,5131_0,524
92,92.0,15238.0,2.0,0_1,5291_0,527
93,93.0,19470.0,2.0,0_1,5461_0,543
94,94.0,17337.0,2.0,0_1,5451_0,555
95,95.0,19685.0,2.0,0_1,5681_0,564
96,96.0,21980.0,2.0,0_1,5721_0,571
97,97.0,16811.0,2.0,0_1,5731_0,572
98,98.0,16979.0,2.0,0_1,5661_0,567
99,99.0,18348.0,2.0,0_1,5851_0,580
100,100.0,22576.0,2.0,0_1,6131_0,587
101,101.0,21473.0,2.0,0_1,6291_0,599
102,102.0,16137.0,2.0,0_1,6331_0,620
103,103.0,18952.0,2.0,0_1,6411_0,619
104,104.0,19654.0,2.0,0_1,6511_0,638
105,105.0,19339.0,2.0,0_1,6471_0,641
106,106.0,23355.0,2.0,0_1,6501_0,648
107,107.0,18177.0,2.0,0_1,6391_0,656
108,108.0,19392.0,2.0,0_1,6411_0,652
109,109.0,18531.0,2.0,0_1,6631_0,660
110,110.0,22045.0,2.0,0_1,6741_0,666
111,111.0,21022.0,2.0,0_1,6791_0,656
112,112.0,18659.0,2.0,0_1,6821_0,654
113,113.0,18897.0,2.0,0_1,6801_0,653
114,114.0,18748.0,2.0,0_1,6961_0,652
115,115.0,16236.0,2.0,0_1,6971_0,659
116,116.0,25488.0,2.0,0_1,7071_0,663
117,117.0,21914.0,2.0,0_1,7121_0,653
118,118.0,18602.0,2.0,0_1,7061_0,662
119,119.0,24513.0,2.0,0_1,7141_0,671
120,120.0,18334.0,2.0,0_1,7061_0,667
121,121.0,21014.0,2.0,0_1,7001_0,674
122,122.0,20963.0,2.0,0_1,7041_0,671
123,123.0,18219.0,2.0,0_1,7141_0,676
124,124.0,19273.0,2.0,0_1,7221_0,667
125,125.0,20378.0,2.0,0_1,7251_0,677
126,126.0,23266.0,2.0,0_1,7231_0,680
127,127.0,19110.0,2.0,0_1,7021_0,688
128,128.0,23082.0,2.0,0_1,7091_0,696
129,129.0,23955.0,2.0,0_1,7261_0,703
130,130.0,23279.0,2.0,0_1,7371_0,720
131,131.0,26997.0,2.0,0_1,7551_0,733
132,132.0,23355.0,2.0,0_1,7661_0,738
133,133.0,21809.0,2.0,0_1,7681_0,744
134,134.0,20521.0,2.0,0_1,7641_0,748
135,135.0,22785.0,2.0,0_1,7681_0,748
136,136.0,21823.0,2.0,0_1,7731_0,762
137,137.0,22413.0,2.0,0_1,7781_0,757
138,138.0,25263.0,2.0,0_1,7811_0,768
139,139.0,24509.0,2.0,0_1,7731_0,782
140,140.0,23028.0,2.0,0_1,7751_0,802
141,141.0,25318.0,2.0,0_1,7581_0,810
142,142.0,21583.0,2.0,0_1,7691_0,811
143,143.0,24117.0,2.0,0_1,7591_0,816
144,144.0,30362.0,2.0,0_1,7921_0,833
145,145.0,25221.0,2.0,0_1,8101_0,824
146,146.0,26401.0,2.0,0_1,8301_0,842
147,147.0,25377.0,2.0,0_1,8351_0,851
148,148.0,30323.0,2.0,0_1,8621_0,869
149,149.0,31767.0,2.0,0_1,8841_0,887
150,150.0,31454.0,2.0,0_1,9001_0,901
151,151.0,26138.0,2.0,0_1,9251_0,912
152,152.0,29255.0,2.0,0_1,9471_0,923
153,153.0,26388.0,2.0,0_1,9571_0,914
154,154.0,28323.0,2.0,0_1,9411_0,902
155,155.0,22561.0,2.0,0_1,9341_0,891
156,156.0,28079.0,2.0,0_1,9511_0,899
157,157.0,28158.0,2.0,0_1,9441_0,905
158,158.0,25907.0,2.0,0_1,9341_0,901
159,159.0,31237.0,2.0,0_1,9341_0,915
160,160.0,26870.0,2.0,0_1,9351_0,942
161,161.0,30307.0,2.0,0_1,9291_0,939
162,162.0,26475.0,2.0,0_1,9311_0,947
163,163.0,27966.0,2.0,0_1,9391_0,945
164,164.0,34438.0,2.0,0_1,9701_0,969
165,165.0,34429.0,2.0,0_1,10121_0,975
166,166.0,24900.0,2.0,0_1,10131_0,979
167,167.0,26101.0,2.0,0_1,10201_0,966
168,168.0,28850.0,2.0,0_1,10151_0,952
169,169.0,31423.0,2.0,0_1,10211_0,982
170,170.0,33763.0,2.0,0_1,10351_0,991
171,171.0,31673.0,2.0,0_1,10111_0,979
172,172.0,23241.0,2.0,0_1,10141_0,977
173,173.0,31956.0,2.0,0_1,10131_0,963
174,174.0,27363.0,2.0,0_1,10201_0,966
175,175.0,27307.0,2.0,0_1,10181_0,974
176,176.0,30566.0,2.0,0_1,10431_0,989
177,177.0,31421.0,2.0,0_1,10431_0,1001
178,178.0,31415.0,2.0,0_1,10411_0,992
179,179.0,34097.0,2.0,0_1,10601_0,1026
180,180.0,34007.0,2.0,0_1,10541_0,1053
181,181.0,27455.0,2.0,0_1,10691_0,1062
182,182.0,35038.0,2.0,0_1,10591_0,1063
183,183.0,27866.0,2.0,0_1,10401_0,1085
184,184.0,27678.0,2.0,0_1,10161_0,1061
185,185.0,25091.0,2.0,0_1,9961_0,1039
186,186.0,23204.0,2.0,0_1,9841_0,986
187,187.0,29181.0,2.0,0_1,9721_0,972
188,188.0,27155.0,2.0,0_1,9971_0,976
189,189.0,35252.0,2.0,0_1,10031_0,967
190,190.0,31768.0,2.0,0_1,10101_0,985
191,191.0,32567.0,2.0,0_1,10161_0,1013
192,192.0,30409.0,2.0,0_1,10211_0,1015
193,193.0,29430.0,2.0,0_1,10201_0,1010
194,194.0,29008.0,2.0,0_1,10331_0,1016
195,195.0,29749.0,2.0,0_1,10241_0,1005
196,196.0,27847.0,2.0,0_1,10061_0,987
197,197.0,28220.0,2.0,0_1,10031_0,989
198,198.0,31977.0,2.0,0_1,10081_0,1008
199,199.0,28791.0,2.0,0_1,10031_0,1014
200,200.0,29949.0,2.0,0_1,10041_0,1003
201,201.0,25747.0,2.0,0_1,9801_0,990
202,202.0,21334.0,2.0,0_1,9691_0,951
203,203.0,18733.0,2.0,0_1,9531_0,925
204,204.0,28868.0,2.0,0_1,9511_0,914
205,205.0,26511.0,2.0,0_1,9501_0,901
206,206.0,24919.0,2.0,0_1,9641_0,905
207,207.0,28764.0,2.0,0_1,9781_0,932
208,208.0,28045.0,2.0,0_1,9681_0,936
209,209.0,27979.0,2.0,0_1,9791_0,933
210,210.0,26947.0,2.0,0_1,9901_0,931
211,211.0,30761.0,2.0,0_1,9901_0,917
212,212.0,25989.0,2.0,0_1,9701_0,903
213,213.0,27305.0,2.0,0_1,9331_0,881
214,214.0,25087.0,2.0,0_1,9431_0,880
215,215.0,30470.0,2.0,0_1,9371_0,884
216,216.0,25538.0,2.0,0_1,9281_0,883
217,217.0,24234.0,2.0,0_1,9111_0,877
218,218.0,25876.0,2.0,0_1,9171_0,874
219,219.0,26797.0,2.0,0_1,9311_0,868
220,220.0,27574.0,2.0,0_1,9491_0,864
221,221.0,30739.0,2.0,0_1,9911_0,874
222,222.0,27990.0,2.0,0_1,9601_0,871
223,223.0,26265.0,2.0,0_1,9601_0,880
224,224.0,28811.0,2.0,0_1,9501_0,867
225,225.0,22395.0,2.0,0_1,9311_0,889
226,226.0,27284.0,2.0,0_1,9191_0,898
227,227.0,28491.0,2.0,0_1,9091_0,908
228,228.0,28100.0,2.0,0_1,9081_0,918
229,229.0,22158.0,2.0,0_1,9371_0,897
230,230.0,26965.0,2.0,0_1,8951_0,888
231,231.0,26451.0,2.0,0_1,8761_0,873
232,232.0,25072.0,2.0,0_1,8751_0,866
233,233.0,25565.0,2.0,0_1,8731_0,869
234,234.0,24347.0,2.0,0_1,8771_0,841
235,235.0,22774.0,2.0,0_1,8561_0,833
236,236.0,23995.0,2.0,0_1,8851_0,873
237,237.0,29537.0,2.0,0_1,9141_0,907
238,238.0,29786.0,2.0,0_1,9281_0,907
239,239.0,30725.0,2.0,0_1,9491_0,905
240,240.0,30992.0,2.0,0_1,9471_0,921
241,241.0,25084.0,2.0,0_1,9271_0,904
242,242.0,21330.0,2.0,0_1,8921_0,887
243,243.0,24772.0,2.0,0_1,8971_0,879
244,244.0,28367.0,2.0,0_1,9161_0,882
245,245.0,26206.0,2.0,0_1,9301_0,884
246,246.0,30529.0,2.0,0_1,9151_0,892
247,247.0,26405.0,2.0,0_1,9191_0,899
248,248.0,30457.0,2.0,0_1,9141_0,923
249,249.0,29353.0,2.0,0_1,9251_0,928
250,250.0,26460.0,2.0,0_1,9581_0,940
251,251.0,31555.0,2.0,0_1,9881_0,960
252,252.0,33633.0,2.0,0_1,9931_0,963
253,253.0,28809.0,2.0,0_1,10101_0,970
254,254.0,28145.0,2.0,0_1,10131_0,989
255,255.0,30217.0,2.0,0_1,10451_0,998
256,256.0,27653.0,2.0,0_1,10191_0,962
257,257.0,28380.0,2.0,0_1,9851_0,927
258,258.0,23634.0,2.0,0_1,9781_0,937
259,259.0,30538.0,2.0,0_1,9841_0,942
260,260.0,31257.0,2.0,0_1,9751_0,944
261,261.0,29534.0,2.0,0_1,10001_0,955
262,262.0,32434.0,2.0,0_1,10201_0,970
263,263.0,32726.0,2.0,0_1,10381_0,997
264,264.0,31234.0,2.0,0_1,10751_0,1040
265,265.0,34464.0,2.0,0_1,10771_0,1042
266,266.0,36211.0,2.0,0_1,11091_0,1049
267,267.0,39653.0,2.0,0_1,11271_0,1077
268,268.0,35811.0,2.0,0_1,11541_0,1087
269,269.0,33140.0,2.0,0_1,11641_0,1107
270,270.0,35653.0,2.0,0_1,12031_0,1118
271,271.0,39034.0,2.0,0_1,12371_0,1142
272,272.0,35920.0,2.0,0_1,12431_0,1169
273,273.0,45348.0,2.0,0_1,12371_0,1217
274,274.0,36430.0,2.0,0_1,12401_0,1233
275,275.0,32105.0,2.0,0_1,12261_0,1239
276,276.0,38331.0,2.0,0_1,12541_0,1229
277,277.0,38985.0,2.0,0_1,12621_0,1264
278,278.0,41478.0,2.0,0_1,12761_0,1302
279,279.0,41825.0,2.0,0_1,13091_0,1302
280,280.0,39056.0,2.0,0_1,13171_0,1295
281,281.0,40430.0,2.0,0_1,13161_0,1325
282,282.0,40571.0,2.0,0_1,13191_0,1335
283,283.0,41179.0,2.0,0_1,13051_0,1325
284,284.0,36939.0,2.0,0_1,13191_0,1331
285,285.0,37348.0,2.0,0_1,13321_0,1349
286,286.0,43955.0,2.0,0_1,13661_0,1362
287,287.0,44927.0,2.0,0_1,14231_0,1376
288,288.0,44569.0,2.0,0_1,14181_0,1408
289,289.0,43734.0,2.0,0_1,14151_0,1408
290,290.0,42101.0,2.0,0_1,14271_0,1421
291,291.0,46671.0,2.0,0_1,14361_0,1440
292,292.0,42481.0,2.0,0_1,14561_0,1430
293,293.0,42351.0,2.0,0_1,14601_0,1413
294,294.0,36509.0,2.0,0_1,14571_0,1400
295,295.0,42714.0,2.0,0_1,14741_0,1379
296,296.0,44275.0,2.0,0_1,14691_0,1347
297,297.0,41839.0,2.0,0_1,14771_0,1335
298,298.0,41321.0,2.0,0_1,14811_0,1354
299,299.0,41479.0,2.0,0_1,14771_0,1364
300,300.0,35967.0,2.0,0_1,14141_0,1359
301,301.0,38771.0,2.0,0_1,14251_0,1369
302,302.0,45563.0,2.0,0_1,13891_0,1355
303,303.0,39380.0,2.0,0_1,13741_0,1392
304,304.0,45350.0,2.0,0_1,14081_0,1396
305,305.0,45831.0,2.0,0_1,14301_0,1428
306,306.0,41966.0,2.0,0_1,14441_0,1444
307,307.0,38826.0,2.0,0_1,14261_0,1475
308,308.0,46222.0,2.0,0_1,14521_0,1468
309,309.0,40318.0,2.0,0_1,14651_0,1492
310,310.0,46543.0,2.0,0_1,14511_0,1504
311,311.0,40080.0,2.0,0_1,14571_0,1500
312,312.0,45180.0,2.0,0_1,14851_0,1521
313,313.0,45563.0,2.0,0_1,14511_0,1533
314,314.0,42674.0,2.0,0_1,14591_0,1532
315,315.0,48937.0,2.0,0_1,15101_0,1606
316,316.0,57592.0,2.0,0_1,15601_0,1620
317,317.0,42988.0,2.0,0_1,15281_0,1620
318,318.0,38282.0,2.0,0_1,14961_0,1604
319,319.0,37129.0,2.0,0_1,14971_0,1611
320,320.0,45791.0,2.0,0_1,14991_0,1604
321,321.0,38060.0,2.0,0_1,14691_0,1551
322,322.0,40082.0,2.0,0_1,14321_0,1517
323,323.0,40803.0,2.0,0_1,14201_0,1492
324,324.0,42548.0,2.0,0_1,13781_0,1506
325,325.0,41566.0,2.0,0_1,13991_0,1534
326,326.0,48246.0,2.0,0_1,14251_0,1531
327,327.0,46648.0,2.0,0_1,14261_0,1499
328,328.0,37756.0,2.0,0_1,14171_0,1533
329,329.0,42084.0,2.0,0_1,14061_0,1494
330,330.0,41382.0,2.0,0_1,14051_0,1481
331,331.0,45905.0,2.0,0_1,13881_0,1477
332,332.0,46542.0,2.0,0_1,14271_0,1482
333,333.0,45291.0,2.0,0_1,14381_0,1447
334,334.0,37548.0,2.0,0_1,14351_0,1414
335,335.0,41655.0,2.0,0_1,14561_0,1419
336,336.0,40577.0,2.0,0_1,14731_0,1421
337,337.0,50916.0,2.0,0_1,15021_0,1432
338,338.0,38472.0,2.0,0_1,15291_0,1440
339,339.0,44216.0,2.0,0_1,15401_0,1442
340,340.0,47481.0,2.0,0_1,14971_0,1424
341,341.0,41005.0,2.0,0_1,15021_0,1438
342,342.0,42160.0,2.0,0_1,14791_0,1439
343,343.0,39216.0,2.0,0_1,14831_0,1444
344,344.0,45723.0,2.0,0_1,14621_0,1489
345,345.0,43719.0,2.0,0_1,14461_0,1474
346,346.0,43371.0,2.0,0_1,14591_0,1454
347,347.0,43147.0,2.0,0_1,14841_0,1470
348,348.0,49335.0,2.0,0_1,15271_0,1541
349,349.0,46122.0,2.0,0_1,15551_0,1579
350,350.0,47545.0,2.0,0_1,15561_0,1560
351,351.0,40663.0,2.0,0_1,15581_0,1526
352,352.0,44985.0,2.0,0_1,15561_0,1499
353,353.0,50547.0,2.0,0_1,15511_0,1493
354,354.0,49298.0,2.0,0_1,15531_0,1482
355,355.0,38136.0,2.0,0_1,16191_0,1563
356,356.0,55019.0,2.0,0_1,16301_0,1569
357,357.0,42467.0,2.0,0_1,16301_0,1550
358,358.0,46331.0,2.0,0_1,16431_0,1555
359,359.0,49740.0,2.0,0_1,16561_0,1581
360,360.0,49025.0,2.0,0_1,16541_0,1611
361,361.0,54813.0,2.0,0_1,16401_0,1616
362,362.0,51124.0,2.0,0_1,15911_0,1589
363,363.0,47365.0,2.0,0_1,16241_0,1640
364,364.0,53239.0,2.0,0_1,16261_0,1642
365,365.0,52073.0,2.0,0_1,16561_0,1662
366,366.0,50673.0,2.0,0_1,16451_0,1652
367,367.0,51854.0,2.0,0_1,16921_0,1661
368,368.0,50551.0,2.0,0_1,16921_0,1650
369,369.0,47231.0,2.0,0_1,17411_0,1673
370,370.0,58198.0,2.0,0_1,17361_0,1686
371,371.0,54983.0,2.0,0_1,17541_0,1679
372,372.0,54101.0,2.0,0_1,18051_0,1741
373,373.0,54501.0,2.0,0_1,18171_0,1748
374,374.0,54929.0,2.0,0_1,18661_0,1768
375,375.0,60157.0,2.0,0_1,18891_0,1784
376,376.0,45036.0,2.0,0_1,19451_0,1796
377,377.0,58012.0,2.0,0_1,19391_0,1829
378,378.0,56146.0,2.0,0_1,19241_0,1803
379,379.0,52022.0,2.0,0_1,18771_0,1785
380,380.0,44601.0,2.0,0_1,18231_0,1764
381,381.0,49357.0,2.0,0_1,18001_0,1728
382,382.0,55629.0,2.0,0_1,18101_0,1798
383,383.0,58896.0,2.0,0_1,18321_0,1806
384,384.0,56636.0,2.0,0_1,18241_0,1813
385,385.0,63661.0,2.0,0_1,18411_0,1819
386,386.0,51607.0,2.0,0_1,18431_0,1808
387,387.0,58012.0,2.0,0_1,18781_0,1848
388,388.0,56326.0,2.0,0_1,18601_0,1862
389,389.0,48500.0,2.0,0_1,18351_0,1843
390,390.0,54818.0,2.0,0_1,18531_0,1817
391,391.0,54443.0,2.0,0_1,18601_0,1817
392,392.0,55243.0,2.0,0_1,18641_0,1834
393,393.0,55752.0,2.0,0_1,19151_0,1841
394,394.0,52847.0,2.0,0_1,18981_0,1871
395,395.0,61215.0,2.0,0_1,18841_0,1873
396,396.0,49539.0,2.0,0_1,18621_0,1834
397,397.0,55712.0,2.0,0_1,18641_0,1835
398,398.0,53751.0,2.0,0_1,18931_0,1842
399,399.0,55028.0,2.0,0_1,19131_0,1823
400,400.0,50006.0,2.0,0_1,18641_0,1817
401,401.0,41104.0,2.0,0_1,18521_0,1787
402,402.0,61826.0,2.0,0_1,18511_0,1800
403,403.0,58855.0,2.0,0_1,18361_0,1824
404,404.0,60608.0,2.0,0_1,18811_0,1880
405,405.0,64325.0,2.0,0_1,18961_0,1877
406,406.0,67626.0,2.0,0_1,19071_0,1920
407,407.0,71783.0,2.0,0_1,19351_0,1929
408,408.0,71280.0,2.0,0_1,20041_0,2020
409,409.0,78304.0,2.0,0_1,20211_0,2038
410,410.0,62743.0,2.0,0_1,20811_0,2111
411,411.0,77989.0,2.0,0_1,20821_0,2110
412,412.0,74795.0,2.0,0_1,21141_0,2107
413,413.0,70890.0,2.0,0_1,21701_0,2134
414,414.0,78656.0,2.0,0_1,22131_0,2166
415,415.0,75318.0,2.0,0_1,22621_0,2201
416,416.0,77452.0,2.0,0_1,22841_0,2198
417,417.0,74667.0,2.0,0_1,22871_0,2221
418,418.0,73028.0,2.0,0_1,23051_0,2263
419,419.0,74767.0,2.0,0_1,23211_0,2260
420,420.0,82637.0,2.0,0_1,23411_0,2279
421,421.0,80601.0,2.0,0_1,23401_0,2302
422,422.0,83724.0,2.0,0_1,23601_0,2334
423,423.0,83661.0,2.0,0_1,24021_0,2384
424,424.0,84337.0,2.0,0_1,24051_0,2419
425,425.0,77644.0,2.0,0_1,23951_0,2441
426,426.0,79262.0,2.0,0_1,24651_0,2539
427,427.0,96671.0,2.0,0_1,25331_0,2598
428,428.0,88451.0,2.0,0_1,25221_0,2630
429,429.0,87334.0,2.0,0_1,25631_0,2677
430,430.0,94580.0,2.0,0_1,26371_0,2703
431,431.0,92012.0,2.0,0_1,26931_0,2759
432,432.0,99195.0,2.0,0_1,27791_0,2816
433,433.0,85608.0,2.0,0_1,27951_0,2791
434,434.0,88843.0,2.0,0_1,28301_0,2809
435,435.0,101266.0,2.0,0_1,29121_0,2863
436,436.0,106793.0,2.0,0_1,29161_0,2880
437,437.0,87792.0,2.0,0_1,29471_0,2883
438,438.0,99703.0,2.0,0_1,29781_0,2902
439,439.0,99490.0,2.0,0_1,29711_0,2944
440,440.0,107188.0,2.0,0_1,30211_0,2990
441,441.0,105520.0,2.0,0_1,30401_0,3055
442,442.0,99531.0,2.0,0_1,30431_0,3026
443,443.0,99227.0,2.0,0_1,31071_0,3068
444,444.0,105511.0,2.0,0_1,31461_0,3106
445,445.0,102660.0,2.0,0_1,31731_0,3131
446,446.0,106814.0,2.0,0_1,31731_0,3171
447,447.0,107898.0,2.0,0_1,32191_0,3178
448,448.0,118058.0,2.0,0_1,33231_0,3293
449,449.0,127192.0,2.0,0_1,33411_0,3331
450,450.0,119708.0,2.0,0_1,34101_0,3369
451,451.0,100204.0,2.0,0_1,34421_0,3374
452,452.0,125839.0,2.0,0_1,34881_0,3425
453,453.0,119118.0,2.0,0_1,35091_0,3439
454,454.0,110937.0,2.0,0_1,35351_0,3474
455,455.0,120317.0,2.0,0_1,35411_0,3510
456,456.0,124706.0,2.0,0_1,35551_0,3528
457,457.0,112874.0,2.0,0_1,35561_0,3566
458,458.0,130407.0,2.0,0_1,35751_0,3600
459,459.0,120318.0,2.0,0_1,35951_0,3640
460,460.0,123759.0,2.0,0_1,36281_0,3668
461,461.0,117064.0,2.0,0_1,36811_0,3717
462,462.0,129119.0,2.0,0_1,37081_0,3763
463,463.0,118508.0,2.0,0_1,37301_0,3795
464,464.0,128852.0,2.0,0_1,37651_0,3814
465,465.0,108476.0,2.0,0_1,37301_0,3815
466,466.0,121360.0,2.0,0_1,37721_0,3834
467,467.0,126934.0,2.0,0_1,37731_0,3835
468,468.0,120818.0,2.0,0_1,37821_0,3818
469,469.0,130593.0,2.0,0_1,38341_0,3871
470,470.0,131402.0,2.0,0_1,38171_0,3879
471,471.0,130901.0,2.0,0_1,38001_0,3918
472,472.0,130705.0,2.0,0_1,38251_0,3924
473,473.0,133734.0,2.0,0_1,39171_0,3996
474,474.0,149445.0,2.0,0_1,39401_0,3993
475,475.0,123298.0,2.0,0_1,39211_0,3973
476,476.0,121365.0,2.0,0_1,39811_0,4001
477,477.0,132712.0,2.0,0_1,40121_0,4034
478,478.0,143411.0,2.0,0_1,40451_0,4097
479,479.0,144531.0,2.0,0_1,40521_0,4120
480,480.0,134332.0,2.0,0_1,40811_0,4158
481,481.0,144804.0,2.0,0_1,41541_0,4186
482,482.0,128709.0,2.0,0_1,41641_0,4159
483,483.0,127588.0,2.0,0_1,41681_0,4168
484,484.0,142170.0,2.0,0_1,42421_0,4210
485,485.0,147864.0,2.0,0_1,43011_0,4235
486,486.0,130554.0,2.0,0_1,42791_0,4250
487,487.0,134243.0,2.0,0_1,43371_0,4270
488,488.0,141244.0,2.0,0_1,43371_0,4267
489,489.0,142017.0,2.0,0_1,43381_0,4267
490,490.0,120345.0,2.0,0_1,42781_0,4239
491,491.0,130412.0,2.0,0_1,43211_0,4269
492,492.0,159141.0,2.0,0_1,43511_0,4260
493,493.0,133412.0,2.0,0_1,43681_0,4333
494,494.0,152759.0,2.0,0_1,43701_0,4345
495,495.0,148191.0,2.0,0_1,43451_0,4337
496,496.0,128498.0,2.0,0_1,43901_0,4379
497,497.0,150163.0,2.0,0_1,43861_0,4363
498,498.0,138423.0,2.0,0_1,43721_0,4338
499,499.0,149190.0,2.0,0_1,43941_0,4339
500,500.0,144168.0,2.0,0_1,43991_0,4334
501,501.0,126645.0,2.0,0_1,44091_0,4335
502,502.0,124463.0,2.0,0_1,43951_0,4346
503,503.0,121771.0,2.0,0_1,43691_0,4369
504,504.0,122391.0,2.0,0_1,43771_0,4329
505,505.0,119746.0,2.0,0_1,42931_0,4260
506,506.0,122891.0,2.0,0_1,43501_0,4352
507,507.0,131153.0,2.0,0_1,43281_0,4314
508,508.0,111906.0,2.0,0_1,42901_0,4230
509,509.0,118699.0,2.0,0_1,43621_0,4219
510,510.0,130894.0,2.0,0_1,43931_0,4192
511,511.0,131652.0,2.0,0_1,44041_0,4160
512,512.0,117717.0,2.0,0_1,43171_0,4132
513,513.0,129872.0,2.0,0_1,42221_0,4129
514,514.0,124860.0,2.0,0_1,42101_0,4132
515,515.0,125946.0,2.0,0_1,41661_0,4134
516,516.0,123627.0,2.0,0_1,41231_0,4046
517,517.0,103890.0,2.0,0_1,40711_0,3970
518,518.0,113179.0,2.0,0_1,40961_0,3934
519,519.0,103894.0,2.0,0_1,41161_0,3991
520,520.0,110086.0,2.0,0_1,41371_0,4034
521,521.0,118513.0,2.0,0_1,41061_0,3976
522,522.0,118894.0,2.0,0_1,40661_0,3949
523,523.0,105141.0,2.0,0_1,40251_0,4002
524,524.0,106219.0,2.0,0_1,40771_0,4003
525,525.0,110150.0,2.0,0_1,40321_0,4015
526,526.0,117910.0,2.0,0_1,39291_0,3905
527,527.0,100381.0,2.0,0_1,38911_0,3849
528,528.0,114109.0,2.0,0_1,37951_0,3738
529,529.0,96391.0,2.0,0_1,36991_0,3674
530,530.0,109555.0,2.0,0_1,36551_0,3603
531,531.0,85975.0,2.0,0_1,34921_0,3459
532,532.0,81841.0,2.0,0_1,34701_0,3449
533,533.0,107103.0,2.0,0_1,34731_0,3435
534,534.0,98307.0,2.0,0_1,35011_0,3432
535,535.0,108832.0,2.0,0_1,34981_0,3430
536,536.0,92290.0,2.0,0_1,34891_0,3414
537,537.0,99341.0,2.0,0_1,34791_0,3402
538,538.0,98371.0,2.0,0_1,34101_0,3380
539,539.0,99777.0,2.0,0_1,33831_0,3318
540,540.0,98776.0,2.0,0_1,33541_0,3290
541,541.0,98523.0,2.0,0_1,32921_0,3219
542,542.0,86121.0,2.0,0_1,32971_0,3200
543,543.0,87179.0,2.0,0_1,32591_0,3155
544,544.0,83313.0,2.0,0_1,32891_0,3193
545,545.0,96401.0,2.0,0_1,33201_0,3227
546,546.0,99829.0,2.0,0_1,32561_0,3240
547,547.0,87780.0,2.0,0_1,32851_0,3202
548,548.0,102422.0,2.0,0_1,32991_0,3218
549,549.0,90899.0,2.0,0_1,33111_0,3175
550,550.0,99996.0,2.0,0_1,32891_0,3166
551,551.0,93738.0,2.0,0_1,32941_0,3144
552,552.0,90182.0,2.0,0_1,32461_0,3122
553,553.0,91259.0,2.0,0_1,32211_0,3088
554,554.0,97807.0,2.0,0_1,31711_0,3087
555,555.0,81208.0,2.0,0_1,31281_0,3044
556,556.0,83617.0,2.0,0_1,30561_0,2929
557,557.0,84748.0,2.0,0_1,30291_0,2892
558,558.0,89100.0,2.0,0_1,30171_0,2891
559,559.0,85156.0,2.0,0_1,30211_0,2960
560,560.0,95334.0,2.0,0_1,30481_0,2931
561,561.0,85190.0,2.0,0_1,29911_0,2936
562,562.0,90011.0,2.0,0_1,30001_0,2957
563,563.0,85652.0,2.0,0_1,30231_0,2978
564,564.0,83361.0,2.0,0_1,29771_0,2896
565,565.0,75736.0,2.0,0_1,29761_0,2896
566,566.0,87990.0,2.0,0_1,29241_0,2945
567,567.0,97036.0,2.0,0_1,29851_0,2953
568,568.0,97135.0,2.0,0_1,30041_0,2981
569,569.0,84432.0,2.0,0_1,29951_0,2922
570,570.0,86408.0,2.0,0_1,29441_0,2918
571,571.0,80264.0,2.0,0_1,29171_0,2917
572,572.0,93335.0,2.0,0_1,29371_0,2939
573,573.0,82859.0,2.0,0_1,28941_0,2917
574,574.0,84391.0,2.0,0_1,28861_0,2936
575,575.0,84685.0,2.0,0_1,29471_0,2962
576,576.0,97265.0,2.0,0_1,29411_0,2968
577,577.0,75481.0,2.0,0_1,29421_0,2957
578,578.0,86800.0,2.0,0_1,29521_0,2866
579,579.0,81458.0,2.0,0_1,29031_0,2816
580,580.0,82891.0,2.0,0_1,28951_0,2834
581,581.0,96548.0,2.0,0_1,28281_0,2777
582,582.0,81388.0,2.0,0_1,28021_0,2753
583,583.0,89762.0,2.0,0_1,28011_0,2746
584,584.0,88724.0,2.0,0_1,28861_0,2835
585,585.0,97481.0,2.0,0_1,28671_0,2871
586,586.0,84912.0,2.0,0_1,28721_0,2895
587,587.0,82440.0,2.0,0_1,29011_0,2930
588,588.0,83608.0,2.0,0_1,29641_0,2949
589,589.0,90767.0,2.0,0_1,30161_0,2975
590,590.0,87697.0,2.0,0_1,29841_0,2964
591,591.0,82751.0,2.0,0_1,29801_0,2969
592,592.0,82770.0,2.0,0_1,30101_0,2965
593,593.0,91258.0,2.0,0_1,29621_0,2998
594,594.0,81624.0,2.0,0_1,29651_0,3004
595,595.0,95075.0,2.0,0_1,29681_0,3002
596,596.0,84285.0,2.0,0_1,28651_0,3016
597,597.0,81861.0,2.0,0_1,28631_0,3031
598,598.0,89403.0,2.0,0_1,28921_0,2984
599,599.0,83000.0,2.0,0_1,29231_0,2957
600,600.0,93676.0,2.0,0_1,29221_0,2954
601,601.0,86756.0,2.0,0_1,29311_0,2947
602,602.0,87467.0,2.0,0_1,29161_0,2940
603,603.0,87097.0,2.0,0_1,29201_0,2952
604,604.0,84635.0,2.0,0_1,29401_0,2921
605,605.0,90239.0,2.0,0_1,29411_0,2924
606,606.0,79153.0,2.0,0_1,29071_0,2916
607,607.0,86793.0,2.0,0_1,28971_0,2942
608,608.0,87399.0,2.0,0_1,28961_0,2921
609,609.0,87332.0,2.0,0_1,28691_0,2903
610,610.0,92567.0,2.0,0_1,28591_0,2872
611,611.0,85020.0,2.0,0_1,28591_0,2821
612,612.0,87205.0,2.0,0_1,28831_0,2861
613,613.0,93312.0,2.0,0_1,29601_0,2961
614,614.0,101197.0,2.0,0_1,30161_0,3072
615,615.0,103220.0,2.0,0_1,30791_0,3123
616,616.0,100924.0,2.0,0_1,31591_0,3212
617,617.0,98255.0,2.0,0_1,32181_0,3270
618,618.0,91179.0,2.0,0_1,32601_0,3265
619,619.0,93724.0,2.0,0_1,32501_0,3264
620,620.0,89781.0,2.0,0_1,32301_0,3279
621,621.0,91476.0,2.0,0_1,32101_0,3198
622,622.0,82550.0,2.0,0_1,31441_0,3102
623,623.0,83780.0,2.0,0_1,31651_0,3059
624,624.0,92659.0,2.0,0_1,30701_0,3052
625,625.0,91316.0,2.0,0_1,30271_0,3073
626,626.0,96214.0,2.0,0_1,30091_0,3040
627,627.0,93605.0,2.0,0_1,29681_0,2980
628,628.0,87530.0,2.0,0_1,30191_0,2955
629,629.0,84865.0,2.0,0_1,29971_0,2897
630,630.0,95230.0,2.0,0_1,29991_0,2888
631,631.0,91004.0,2.0,0_1,30461_0,2956
632,632.0,90592.0,2.0,0_1,31211_0,2973
633,633.0,95068.0,2.0,0_1,30991_0,3063
634,634.0,99050.0,2.0,0_1,31001_0,3095
635,635.0,87328.0,2.0,0_1,31621_0,3161
636,636.0,102347.0,2.0,0_1,32211_0,3205
637,637.0,95274.0,2.0,0_1,32281_0,3279
638,638.0,103845.0,2.0,0_1,32721_0,3309
639,639.0,87161.0,2.0,0_1,32941_0,3272
640,640.0,79800.0,2.0,0_1,32561_0,3255
641,641.0,90438.0,2.0,0_1,31831_0,3210
642,642.0,89484.0,2.0,0_1,31031_0,3171
643,643.0,90932.0,2.0,0_1,30811_0,3164
644,644.0,88871.0,2.0,0_1,30781_0,3101
645,645.0,83811.0,2.0,0_1,30431_0,3001
646,646.0,83147.0,2.0,0_1,29881_0,2950
647,647.0,87578.0,2.0,0_1,29331_0,2909
648,648.0,86399.0,2.0,0_1,29441_0,2900
649,649.0,83786.0,2.0,0_1,29301_0,2926
650,650.0,89118.0,2.0,0_1,29111_0,2914
651,651.0,86501.0,2.0,0_1,28781_0,2855
652,652.0,88996.0,2.0,0_1,28061_0,2833
653,653.0,76481.0,2.0,0_1,28681_0,2894
654,654.0,95034.0,2.0,0_1,28591_0,2854
655,655.0,78203.0,2.0,0_1,28671_0,2854
656,656.0,84584.0,2.0,0_1,28511_0,2879
657,657.0,82557.0,2.0,0_1,28571_0,2877
658,658.0,74532.0,2.0,0_1,28451_0,2837
659,659.0,71417.0,2.0,0_1,27981_0,2781
660,660.0,86653.0,2.0,0_1,27951_0,2810
661,661.0,77993.0,2.0,0_1,27281_0,2743
662,662.0,75335.0,2.0,0_1,27001_0,2692
663,663.0,80367.0,2.0,0_1,26691_0,2706
664,664.0,88133.0,2.0,0_1,26931_0,2683
665,665.0,87817.0,2.0,0_1,27181_0,2724
666,666.0,87585.0,2.0,0_1,27411_0,2762
667,667.0,84696.0,2.0,0_1,27401_0,2778
668,668.0,82348.0,2.0,0_1,27531_0,2793
669,669.0,76073.0,2.0,0_1,27961_0,2793
670,670.0,76432.0,2.0,0_1,28181_0,2770
671,671.0,81694.0,2.0,0_1,27931_0,2750
672,672.0,82059.0,2.0,0_1,28131_0,2802
673,673.0,91726.0,2.0,0_1,28331_0,2774
674,674.0,83019.0,2.0,0_1,28581_0,2793
675,675.0,87034.0,2.0,0_1,28081_0,2762
676,676.0,82754.0,2.0,0_1,27921_0,2742
677,677.0,73351.0,2.0,0_1,27861_0,2747
678,678.0,92424.0,2.0,0_1,28181_0,2802
679,679.0,79819.0,2.0,0_1,28021_0,2840
680,680.0,92332.0,2.0,0_1,27771_0,2883
681,681.0,91821.0,2.0,0_1,27851_0,2930
682,682.0,89026.0,2.0,0_1,28431_0,2955
683,683.0,89841.0,2.0,0_1,28511_0,2927
684,684.0,84947.0,2.0,0_1,28311_0,2919
685,685.0,86553.0,2.0,0_1,28441_0,2916
686,686.0,76374.0,2.0,0_1,28351_0,2892
687,687.0,83579.0,2.0,0_1,28341_0,2841
688,688.0,84014.0,2.0,0_1,28961_0,2859
689,689.0,89653.0,2.0,0_1,29201_0,2859
690,690.0,86861.0,2.0,0_1,29451_0,2885
691,691.0,95019.0,2.0,0_1,29691_0,2910
692,692.0,87693.0,2.0,0_1,30271_0,2895
693,693.0,95747.0,2.0,0_1,30591_0,2897
694,694.0,92562.0,2.0,0_1,30731_0,2923
695,695.0,98710.0,2.0,0_1,30981_0,3039
696,696.0,90318.0,2.0,0_1,31291_0,3079
697,697.0,100345.0,2.0,0_1,31651_0,3101
698,698.0,102252.0,2.0,0_1,31771_0,3085
699,699.0,91266.0,2.0,0_1,31971_0,3165
700,700.0,103096.0,2.0,0_1,32411_0,3186
701,701.0,90259.0,2.0,0_1,32061_0,3255
702,702.0,91654.0,2.0,0_1,32431_0,3250
703,703.0,101658.0,2.0,0_1,32991_0,3295
704,704.0,104557.0,2.0,0_1,33211_0,3342
705,705.0,100759.0,2.0,0_1,33881_0,3301
706,706.0,110500.0,2.0,0_1,34571_0,3261
707,707.0,101846.0,2.0,0_1,34361_0,3240
708,708.0,94170.0,2.0,0_1,33661_0,3210
709,709.0,90771.0,2.0,0_1,33231_0,3203
710,710.0,79721.0,2.0,0_1,32821_0,3217
711,711.0,93278.0,2.0,0_1,31921_0,3164
712,712.0,85910.0,2.0,0_1,30761_0,3106
713,713.0,82953.0,2.0,0_1,30971_0,3101
714,714.0,95834.0,2.0,0_1,30501_0,3032
715,715.0,84249.0,2.0,0_1,30261_0,2928
716,716.0,79861.0,2.0,0_1,30331_0,2914
717,717.0,93352.0,2.0,0_1,29941_0,2943
718,718.0,83406.0,2.0,0_1,29771_0,2953
719,719.0,96008.0,2.0,0_1,30191_0,3047
720,720.0,98304.0,2.0,0_1,30141_0,3081
721,721.0,101358.0,2.0,0_1,30181_0,3064
722,722.0,77739.0,2.0,0_1,30181_0,3046
723,723.0,91938.0,2.0,0_1,30101_0,3034
724,724.0,90131.0,2.0,0_1,29991_0,3027
725,725.0,71776.0,2.0,0_1,28871_0,2939
726,726.0,73736.0,2.0,0_1,28331_0,2862
727,727.0,69583.0,2.0,0_1,28511_0,2813
728,728.0,88859.0,2.0,0_1,28851_0,2780
729,729.0,78324.0,2.0,0_1,28471_0,2744
730,730.0,83472.0,2.0,0_1,28171_0,2750
731,731.0,85332.0,2.0,0_1,28291_0,2765
732,732.0,93190.0,2.0,0_1,28771_0,2809
733,733.0,89687.0,2.0,0_1,28301_0,2830
734,734.0,87440.0,2.0,0_1,28381_0,2872
735,735.0,83162.0,2.0,0_1,28871_0,2886
736,736.0,86313.0,2.0,0_1,29331_0,2937
737,737.0,91362.0,2.0,0_1,28991_0,2943
738,738.0,86598.0,2.0,0_1,28561_0,2909
739,739.0,81411.0,2.0,0_1,28981_0,2960
740,740.0,97979.0,2.0,0_1,29561_0,2996
741,741.0,90086.0,2.0,0_1,29831_0,2919
742,742.0,83087.0,2.0,0_1,29811_0,2880
743,743.0,87882.0,2.0,0_1,29681_0,2881
744,744.0,82565.0,2.0,0_1,29841_0,2875
745,745.0,96312.0,2.0,0_1,29571_0,2835
746,746.0,80775.0,2.0,0_1,30021_0,2927
747,747.0,90106.0,2.0,0_1,30451_0,2945
748,748.0,89809.0,2.0,0_1,31411_0,2937
749,749.0,99379.0,2.0,0_1,31571_0,2938
750,750.0,89068.0,2.0,0_1,31811_0,2962
751,751.0,85450.0,2.0,0_1,31711_0,2997
752,752.0,99878.0,2.0,0_1,31461_0,3005
753,753.0,87577.0,2.0,0_1,31441_0,3020
754,754.0,87253.0,2.0,0_1,30471_0,2959
755,755.0,70962.0,2.0,0_1,30251_0,2922
756,756.0,81084.0,2.0,0_1,29601_0,2874
757,757.0,93628.0,2.0,0_1,29701_0,2890
758,758.0,99215.0,2.0,0_1,29741_0,2943
759,759.0,90814.0,2.0,0_1,28831_0,2924
760,760.0,84725.0,2.0,0_1,28981_0,2937
761,761.0,79591.0,2.0,0_1,28671_0,2935
762,762.0,92654.0,2.0,0_1,28581_0,2974
763,763.0,79598.0,2.0,0_1,28701_0,3035
764,764.0,90390.0,2.0,0_1,28361_0,3060
765,765.0,88381.0,2.0,0_1,28151_0,3062
766,766.0,82374.0,2.0,0_1,28661_0,3035
767,767.0,96002.0,2.0,0_1,28541_0,2992
768,768.0,82620.0,2.0,0_1,28781_0,2961
769,769.0,91163.0,2.0,0_1,29421_0,2986
770,770.0,91395.0,2.0,0_1,30081_0,2991
771,771.0,94778.0,2.0,0_1,30341_0,3013
772,772.0,88814.0,2.0,0_1,30421_0,3030
773,773.0,81216.0,2.0,0_1,29961_0,2970
774,774.0,82243.0,2.0,0_1,29551_0,2971
775,775.0,75992.0,2.0,0_1,29061_0,2946
776,776.0,84789.0,2.0,0_1,27891_0,2889
777,777.0,76384.0,2.0,0_1,27061_0,2803
778,778.0,64952.0,2.0,0_1,25831_0,2742
779,779.0,71915.0,2.0,0_1,25491_0,2690
780,780.0,76608.0,2.0,0_1,25601_0,2656
781,781.0,83982.0,2.0,0_1,25811_0,2593
782,782.0,66702.0,2.0,0_1,25281_0,2538
783,783.0,76116.0,2.0,0_1,24941_0,2559
784,784.0,74453.0,2.0,0_1,24501_0,2545
785,785.0,74042.0,2.0,0_1,25111_0,2485
786,786.0,80520.0,2.0,0_1,25151_0,2479
787,787.0,70476.0,2.0,0_1,25541_0,2489
788,788.0,75818.0,2.0,0_1,25601_0,2520
789,789.0,76269.0,2.0,0_1,25451_0,2543
790,790.0,73235.0,2.0,0_1,25441_0,2554
791,791.0,76546.0,2.0,0_1,25081_0,2527
792,792.0,65093.0,2.0,0_1,24441_0,2485
793,793.0,60328.0,2.0,0_1,23781_0,2433
794,794.0,66276.0,2.0,0_1,23321_0,2384
795,795.0,70750.0,2.0,0_1,22751_0,2352
796,796.0,56774.0,2.0,0_1,22431_0,2271
797,797.0,61502.0,2.0,0_1,22111_0,2210
798,798.0,57579.0,2.0,0_1,21871_0,2121
799,799.0,56982.0,2.0,0_1,21101_0,2096
800,800.0,66521.0,2.0,0_1,21191_0,2105
801,801.0,67772.0,2.0,0_1,20821_0,2055
802,802.0,65440.0,2.0,0_1,20771_0,2135
803,803.0,64332.0,2.0,0_1,21181_0,2107
804,804.0,65933.0,2.0,0_1,21511_0,2132
805,805.0,68669.0,2.0,0_1,21781_0,2131
806,806.0,62107.0,2.0,0_1,21341_0,2136
807,807.0,59635.0,2.0,0_1,21821_0,2115
808,808.0,67860.0,2.0,0_1,21441_0,2106
809,809.0,63818.0,2.0,0_1,21441_0,2110
810,810.0,60763.0,2.0,0_1,21551_0,2159
811,811.0,59238.0,2.0,0_1,21701_0,2192
812,812.0,66552.0,2.0,0_1,21771_0,2178
813,813.0,64547.0,2.0,0_1,21761_0,2138
814,814.0,68672.0,2.0,0_1,21261_0,2130
815,815.0,61584.0,2.0,0_1,21351_0,2145
816,816.0,62204.0,2.0,0_1,20941_0,2116
817,817.0,59852.0,2.0,0_1,20661_0,2134
818,818.0,63078.0,2.0,0_1,20781_0,2143
819,819.0,61740.0,2.0,0_1,20701_0,2121
820,820.0,58589.0,2.0,0_1,20801_0,2047
821,821.0,66727.0,2.0,0_1,21201_0,2092
822,822.0,74378.0,2.0,0_1,21631_0,2075
823,823.0,59333.0,2.0,0_1,21361_0,2090
824,824.0,65226.0,2.0,0_1,21171_0,2109
825,825.0,58204.0,2.0,0_1,21051_0,2099
826,826.0,62790.0,2.0,0_1,21141_0,2111
827,827.0,65192.0,2.0,0_1,21481_0,2164
828,828.0,68220.0,2.0,0_1,21411_0,2157
829,829.0,63747.0,2.0,0_1,21591_0,2157
830,830.0,65011.0,2.0,0_1,22011_0,2177
831,831.0,68547.0,2.0,0_1,22401_0,2209
832,832.0,69100.0,2.0,0_1,22641_0,2207
833,833.0,73286.0,2.0,0_1,22991_0,2245
834,834.0,60226.0,2.0,0_1,23051_0,2268
835,835.0,73455.0,2.0,0_1,23021_0,2256
836,836.0,64014.0,2.0,0_1,23181_0,2248
837,837.0,69068.0,2.0,0_1,22901_0,2196
838,838.0,60030.0,2.0,0_1,22661_0,2191
839,839.0,69405.0,2.0,0_1,22751_0,2217
840,840.0,74347.0,2.0,0_1,22951_0,2235
841,841.0,68939.0,2.0,0_1,22831_0,2216
842,842.0,66608.0,2.0,0_1,22961_0,2193
843,843.0,67689.0,2.0,0_1,23051_0,2202
844,844.0,67225.0,2.0,0_1,23311_0,2211
845,845.0,66965.0,2.0,0_1,23391_0,2246
846,846.0,63600.0,2.0,0_1,23221_0,2230
847,847.0,65924.0,2.0,0_1,23291_0,2242
848,848.0,74534.0,2.0,0_1,23271_0,2235
849,849.0,66383.0,2.0,0_1,23531_0,2273
850,850.0,71455.0,2.0,0_1,23531_0,2227
851,851.0,70820.0,2.0,0_1,23441_0,2224
852,852.0,65345.0,2.0,0_1,23301_0,2238
853,853.0,70676.0,2.0,0_1,23411_0,2298
854,854.0,80253.0,2.0,0_1,23581_0,2348
855,855.0,82888.0,2.0,0_1,24221_0,2384
856,856.0,72676.0,2.0,0_1,24451_0,2413
857,857.0,72077.0,2.0,0_1,24441_0,2435
858,858.0,60808.0,2.0,0_1,24391_0,2419
859,859.0,75839.0,2.0,0_1,24241_0,2364
860,860.0,70304.0,2.0,0_1,24531_0,2402
861,861.0,80733.0,2.0,0_1,25261_0,2376
862,862.0,82832.0,2.0,0_1,25401_0,2399
863,863.0,77247.0,2.0,0_1,25641_0,2467
864,864.0,72277.0,2.0,0_1,25851_0,2491
865,865.0,76329.0,2.0,0_1,25911_0,2511
866,866.0,83026.0,2.0,0_1,26231_0,2528
867,867.0,86224.0,2.0,0_1,25631_0,2513
868,868.0,65283.0,2.0,0_1,25471_0,2539
869,869.0,72807.0,2.0,0_1,25131_0,2522
870,870.0,77818.0,2.0,0_1,25651_0,2547
871,871.0,78751.0,2.0,0_1,25701_0,2573
872,872.0,78786.0,2.0,0_1,25611_0,2609
873,873.0,79500.0,2.0,0_1,25651_0,2616
874,874.0,74343.0,2.0,0_1,25771_0,2615
875,875.0,76646.0,2.0,0_1,26301_0,2593
876,876.0,83818.0,2.0,0_1,26491_0,2600
877,877.0,75537.0,2.0,0_1,26341_0,2606
878,878.0,64303.0,2.0,0_1,26321_0,2608
879,879.0,82722.0,2.0,0_1,26241_0,2594
880,880.0,77561.0,2.0,0_1,25911_0,2567
881,881.0,75137.0,2.0,0_1,26131_0,2572
882,882.0,75565.0,2.0,0_1,26081_0,2530
883,883.0,79842.0,2.0,0_1,25701_0,2545
884,884.0,83372.0,2.0,0_1,25921_0,2591
885,885.0,84758.0,2.0,0_1,25601_0,2585
886,886.0,63306.0,2.0,0_1,26021_0,2618
887,887.0,85839.0,2.0,0_1,26551_0,2616
888,888.0,82223.0,2.0,0_1,26141_0,2646
889,889.0,78896.0,2.0,0_1,26231_0,2647
890,890.0,78141.0,2.0,0_1,26321_0,2676
891,891.0,84117.0,2.0,0_1,27281_0,2790
892,892.0,86367.0,2.0,0_1,27641_0,2807
893,893.0,84282.0,2.0,0_1,27301_0,2780
894,894.0,73538.0,2.0,0_1,27481_0,2788
895,895.0,70074.0,2.0,0_1,27571_0,2830
896,896.0,77807.0,2.0,0_1,27411_0,2822
897,897.0,87070.0,2.0,0_1,27671_0,2838
898,898.0,80391.0,2.0,0_1,27321_0,2820
899,899.0,79159.0,2.0,0_1,26501_0,2733
900,900.0,76297.0,2.0,0_1,26371_0,2733
901,901.0,79642.0,2.0,0_1,26501_0,2717
902,902.0,80895.0,2.0,0_1,26901_0,2795
903,903.0,89414.0,2.0,0_1,27391_0,2845
904,904.0,85702.0,2.0,0_1,27571_0,2874
905,905.0,98079.0,2.0,0_1,27861_0,2911
906,906.0,80257.0,2.0,0_1,27941_0,2899
907,907.0,94882.0,2.0,0_1,28521_0,2901
908,908.0,94418.0,2.0,0_1,28531_0,2908
909,909.0,93288.0,2.0,0_1,29351_0,3006
910,910.0,80245.0,2.0,0_1,29311_0,3005
911,911.0,78824.0,2.0,0_1,29211_0,3021
912,912.0,89098.0,2.0,0_1,29451_0,3006
913,913.0,84244.0,2.0,0_1,29771_0,2970
914,914.0,96672.0,2.0,0_1,30021_0,2971
915,915.0,98035.0,2.0,0_1,30261_0,2982
916,916.0,84563.0,2.0,0_1,29901_0,2996
917,917.0,85762.0,2.0,0_1,29531_0,3015
918,918.0,75629.0,2.0,0_1,28811_0,3011
919,919.0,77252.0,2.0,0_1,28371_0,2967
920,920.0,86655.0,2.0,0_1,27911_0,2941
921,921.0,93321.0,2.0,0_1,27221_0,2901
922,922.0,82327.0,2.0,0_1,27251_0,2841
923,923.0,79638.0,2.0,0_1,27411_0,2881
924,924.0,92641.0,2.0,0_1,27311_0,3006
925,925.0,94110.0,2.0,0_1,27671_0,3070
926,926.0,93862.0,2.0,0_1,28501_0,3072
927,927.0,95943.0,2.0,0_1,28741_0,3031
928,928.0,86784.0,2.0,0_1,29531_0,3049
929,929.0,87205.0,2.0,0_1,29971_0,3088
930,930.0,89720.0,2.0,0_1,30101_0,3053
931,931.0,87414.0,2.0,0_1,29921_0,2988
932,932.0,79266.0,2.0,0_1,29671_0,2933
933,933.0,73805.0,2.0,0_1,29611_0,2853
934,934.0,81566.0,2.0,0_1,29061_0,2850
935,935.0,78626.0,2.0,0_1,28591_0,2789
936,936.0,87968.0,2.0,0_1,27821_0,2775
937,937.0,71898.0,2.0,0_1,27171_0,2713
938,938.0,73986.0,2.0,0_1,26371_0,2662
939,939.0,84611.0,2.0,0_1,26121_0,2597
940,940.0,79897.0,2.0,0_1,25721_0,2624
941,941.0,84012.0,2.0,0_1,26351_0,2654
942,942.0,91256.0,2.0,0_1,26781_0,2703
943,943.0,82297.0,2.0,0_1,27001_0,2749
944,944.0,81044.0,2.0,0_1,27101_0,2733
945,945.0,82051.0,2.0,0_1,26931_0,2728
946,946.0,70505.0,2.0,0_1,27331_0,2771
947,947.0,86756.0,2.0,0_1,27361_0,2810
948,948.0,78211.0,2.0,0_1,27311_0,2788
949,949.0,78837.0,2.0,0_1,27361_0,2815
950,950.0,83059.0,2.0,0_1,27621_0,2831
951,951.0,80617.0,2.0,0_1,27681_0,2771
952,952.0,80957.0,2.0,0_1,27551_0,2764
953,953.0,90915.0,2.0,0_1,27491_0,2723
954,954.0,86013.0,2.0,0_1,27511_0,2702
955,955.0,84071.0,2.0,0_1,27971_0,2769
956,956.0,101035.0,2.0,0_1,28361_0,2819
957,957.0,96163.0,2.0,0_1,29031_0,2893
958,958.0,88249.0,2.0,0_1,29391_0,2959
959,959.0,80357.0,2.0,0_1,29261_0,2980
960,960.0,85951.0,2.0,0_1,29431_0,2933
961,961.0,73297.0,2.0,0_1,28781_0,2892
962,962.0,76121.0,2.0,0_1,28461_0,2923
963,963.0,89394.0,2.0,0_1,27961_0,2889
964,964.0,83684.0,2.0,0_1,27661_0,2901
965,965.0,78832.0,2.0,0_1,27321_0,2898
966,966.0,83738.0,2.0,0_1,27541_0,2891
967,967.0,84979.0,2.0,0_1,27861_0,2877
968,968.0,80950.0,2.0,0_1,28311_0,2842
969,969.0,89574.0,2.0,0_1,28371_0,2772
970,970.0,76804.0,2.0,0_1,28021_0,2737
971,971.0,84665.0,2.0,0_1,28571_0,2774
972,972.0,90398.0,2.0,0_1,28601_0,2825
973,973.0,82686.0,2.0,0_1,28611_0,2813
974,974.0,89897.0,2.0,0_1,28631_0,2830
975,975.0,84191.0,2.0,0_1,28291_0,2823
976,976.0,78244.0,2.0,0_1,28031_0,2795
977,977.0,81242.0,2.0,0_1,27941_0,2778
978,978.0,79951.0,2.0,0_1,27801_0,2763
979,979.0,91065.0,2.0,0_1,27381_0,2737
980,980.0,89291.0,2.0,0_1,27741_0,2786
981,981.0,83055.0,2.0,0_1,27731_0,2774
982,982.0,87322.0,2.0,0_1,28101_0,2803
983,983.0,77598.0,2.0,0_1,28231_0,2812
984,984.0,91011.0,2.0,0_1,28521_0,2807
985,985.0,92321.0,2.0,0_1,28621_0,2859
986,986.0,77262.0,2.0,0_1,28551_0,2885
987,987.0,88777.0,2.0,0_1,28631_0,2899
988,988.0,74880.0,2.0,0_1,28921_0,2953
989,989.0,92133.0,2.0,0_1,28501_0,2931
990,990.0,80780.0,2.0,0_1,28831_0,2921
991,991.0,89527.0,2.0,0_1,27991_0,2881
992,992.0,69430.0,2.0,0_1,27101_0,2813
993,993.0,79792.0,2.0,0_1,27171_0,2811
994,994.0,77865.0,2.0,0_1,27471_0,2798
995,995.0,91233.0,2.0,0_1,27471_0,2806
996,996.0,75333.0,2.0,0_1,27331_0,2800
997,997.0,89339.0,2.0,0_1,27571_0,2809
998,998.0,87019.0,2.0,0_1,27651_0,2833
999,999.0,85891.0,2.0,0_1,28051_0,2845
