0,0.0,0.0,256.0,0.0015625,102.0,
1,1.0,5917.0,256.0,0.0015778186274509804,103.0,
2,2.0,6472.0,256.0,0.0015778186274509804,103.0,
3,3.0,4152.0,256.0,0.0014705882352941176,96.0,
4,4.0,3282.0,256.0,0.0015012254901960785,98.0,
5,5.0,3732.0,256.0,0.0014705882352941176,96.0,
6,6.0,3100.0,256.0,0.0013939950980392157,91.0,
7,7.0,3534.0,256.0,0.0013633578431372548,89.0,
8,8.0,3360.0,256.0,0.0013480392156862745,88.0,
9,9.0,3966.0,256.0,0.0013174019607843138,86.0,
10,10.0,4735.0,256.0,0.0013020833333333333,85.0,
11,11.0,4504.0,256.0,0.0012561274509803922,82.0,
12,12.0,5126.0,256.0,0.0012561274509803922,82.0,
13,13.0,5558.0,256.0,0.0013020833333333333,85.0,
14,14.0,7194.0,256.0,0.0013939950980392157,91.0,
15,15.0,4883.0,256.0,0.001409313725490196,92.0,
16,16.0,5146.0,256.0,0.001485906862745098,97.0,
17,17.0,4579.0,256.0,0.001485906862745098,97.0,
18,18.0,4122.0,256.0,0.0015625,102.0,
19,19.0,5194.0,256.0,0.0015471813725490195,101.0,
20,20.0,4945.0,256.0,0.001608455882352941,105.0,
21,21.0,5193.0,256.0,0.0015778186274509804,103.0,
22,22.0,6458.0,256.0,0.0016237745098039217,106.0,
23,23.0,6181.0,256.0,0.0016544117647058823,108.0,
24,24.0,4792.0,256.0,0.0016237745098039217,106.0,
25,25.0,5552.0,256.0,0.0016544117647058823,108.0,
26,26.0,6180.0,256.0,0.0016850490196078432,110.0,
27,27.0,7415.0,256.0,0.0016544117647058823,108.0,
28,28.0,7165.0,256.0,0.0016850490196078432,110.0,
29,29.0,7312.0,256.0,0.0017616421568627451,115.0,
30,30.0,7986.0,256.0,0.0017616421568627451,115.0,
31,31.0,9280.0,256.0,0.0018075980392156864,118.0,
32,32.0,7379.0,256.0,0.0019454656862745098,127.0,
33,33.0,9636.0,256.0,0.001914828431372549,125.0,
34,34.0,8894.0,256.0,0.002006740196078431,131.0,
35,35.0,11713.0,256.0,0.0021752450980392158,142.0,
36,36.0,9070.0,256.0,0.0022824754901960786,149.0,
37,37.0,9194.0,256.0,0.0023743872549019606,155.0,
38,38.0,12926.0,256.0,0.002527573529411765,165.0,
39,39.0,10166.0,256.0,0.0024969362745098037,163.0,
40,40.0,10642.0,256.0,0.0024509803921568627,160.0,
41,41.0,7557.0,256.0,0.0024050245098039217,157.0,
42,42.0,7648.0,256.0,0.002466299019607843,161.0,
43,43.0,9755.0,256.0,0.0025582107843137255,167.0,
44,44.0,7986.0,256.0,0.0024816176470588234,162.0,
45,45.0,6505.0,256.0,0.0024509803921568627,160.0,
46,46.0,7787.0,256.0,0.002297794117647059,150.0,
47,47.0,5425.0,256.0,0.0022212009803921568,145.0,
48,48.0,5978.0,256.0,0.0022212009803921568,145.0,
49,49.0,6413.0,256.0,0.002190563725490196,143.0,
50,50.0,5422.0,256.0,0.002144607843137255,140.0,
51,51.0,5298.0,256.0,0.002113970588235294,138.0,
52,52.0,5167.0,256.0,0.0019761029411764705,129.0,
53,53.0,5675.0,256.0,0.0018229166666666667,119.0,
54,54.0,3698.0,256.0,0.0016697303921568627,109.0,
55,55.0,3871.0,256.0,0.0015165441176470589,99.0,
56,56.0,3420.0,256.0,0.0015931372549019608,104.0,
57,57.0,5467.0,256.0,0.0016237745098039217,106.0,
58,58.0,4243.0,256.0,0.0015778186274509804,103.0,
59,59.0,4867.0,256.0,0.0016237745098039217,106.0,
60,60.0,4842.0,256.0,0.001639093137254902,107.0,
61,61.0,4324.0,256.0,0.0015625,102.0,
62,62.0,5544.0,256.0,0.0015165441176470589,99.0,
63,63.0,5626.0,256.0,0.0015012254901960785,98.0,
64,64.0,3403.0,256.0,0.0015318627450980392,100.0,
65,65.0,4336.0,256.0,0.001485906862745098,97.0,
66,66.0,4732.0,256.0,0.0014552696078431373,95.0,
67,67.0,3847.0,256.0,0.001439950980392157,94.0,
68,68.0,2824.0,256.0,0.001439950980392157,94.0,
69,69.0,2830.0,256.0,0.0013939950980392157,91.0,
70,70.0,4512.0,256.0,0.0013786764705882354,90.0,
71,71.0,4691.0,256.0,0.0013786764705882354,90.0,
72,72.0,5842.0,256.0,0.0013633578431372548,89.0,
73,73.0,5213.0,256.0,0.0013786764705882354,90.0,
74,74.0,3829.0,256.0,0.0013020833333333333,85.0,
75,75.0,4943.0,256.0,0.0013633578431372548,89.0,
76,76.0,4523.0,256.0,0.0013174019607843138,86.0,
77,77.0,5262.0,256.0,0.0013480392156862745,88.0,
78,78.0,6292.0,256.0,0.0013786764705882354,90.0,
79,79.0,5433.0,256.0,0.001409313725490196,92.0,
80,80.0,6702.0,256.0,0.001409313725490196,92.0,
81,81.0,5755.0,256.0,0.001409313725490196,92.0,
82,82.0,4352.0,256.0,0.0013633578431372548,89.0,
83,83.0,4342.0,256.0,0.0013786764705882354,90.0,
84,84.0,5535.0,256.0,0.0013633578431372548,89.0,
85,85.0,5240.0,256.0,0.0012561274509803922,82.0,
86,86.0,5381.0,256.0,0.0012561274509803922,82.0,
87,87.0,5165.0,256.0,0.0013327205882352942,87.0,
88,88.0,5712.0,256.0,0.0013327205882352942,87.0,
89,89.0,5460.0,256.0,0.0013174019607843138,86.0,
90,90.0,4520.0,256.0,0.0013480392156862745,88.0,
91,91.0,3083.0,256.0,0.0013939950980392157,91.0,
92,92.0,5691.0,256.0,0.001439950980392157,94.0,
93,93.0,5657.0,256.0,0.0015625,102.0,
94,94.0,4054.0,256.0,0.0016237745098039217,106.0,
95,95.0,4705.0,256.0,0.0015931372549019608,104.0,
96,96.0,5783.0,256.0,0.0015318627450980392,100.0,
97,97.0,3704.0,256.0,0.0014705882352941176,96.0,
98,98.0,3832.0,256.0,0.001439950980392157,94.0,
99,99.0,4948.0,256.0,0.001485906862745098,97.0,
100,100.0,3609.0,256.0,0.0013633578431372548,89.0,
101,101.0,4312.0,256.0,0.0013786764705882354,90.0,
102,102.0,3655.0,256.0,0.0012714460784313726,83.0,
103,103.0,3662.0,256.0,0.0012408088235294117,81.0,
104,104.0,4321.0,256.0,0.0013327205882352942,87.0,
105,105.0,4016.0,256.0,0.001439950980392157,94.0,
106,106.0,4398.0,256.0,0.001485906862745098,97.0,
107,107.0,3868.0,256.0,0.0014246323529411764,93.0,
108,108.0,3580.0,256.0,0.0014552696078431373,95.0,
109,109.0,4880.0,256.0,0.0013633578431372548,89.0,
110,110.0,3054.0,256.0,0.0012714460784313726,83.0,
111,111.0,2939.0,256.0,0.0012714460784313726,83.0,
112,112.0,2873.0,256.0,0.0012714460784313726,83.0,
113,113.0,4482.0,256.0,0.0012561274509803922,82.0,
114,114.0,3394.0,256.0,0.0012254901960784314,80.0,
115,115.0,4662.0,256.0,0.001210171568627451,79.0,
116,116.0,4467.0,256.0,0.0011488970588235295,75.0,
117,117.0,4845.0,256.0,0.0011488970588235295,75.0,
118,118.0,3542.0,256.0,0.0011182598039215686,73.0,
119,119.0,4385.0,256.0,0.0010876225490196079,71.0,
120,120.0,3959.0,256.0,0.001056985294117647,69.0,
121,121.0,4866.0,256.0,0.0010723039215686275,70.0,
122,122.0,3945.0,256.0,0.0011795343137254901,77.0,
123,123.0,4002.0,256.0,0.0011488970588235295,75.0,
124,124.0,3403.0,256.0,0.0010876225490196079,71.0,
125,125.0,2827.0,256.0,0.0011029411764705882,72.0,
126,126.0,3484.0,256.0,0.001056985294117647,69.0,
127,127.0,3452.0,256.0,0.0010876225490196079,71.0,
128,128.0,3184.0,256.0,0.0010876225490196079,71.0,
129,129.0,4433.0,256.0,0.0010876225490196079,71.0,
130,130.0,3498.0,256.0,0.0010723039215686275,70.0,
131,131.0,5514.0,256.0,0.001056985294117647,69.0,
132,132.0,5130.0,256.0,9.80392156862745E-4,64.0,
133,133.0,5961.0,256.0,0.001011029411764706,66.0,
134,134.0,5518.0,256.0,0.0011182598039215686,73.0,
135,135.0,5591.0,256.0,0.0010263480392156863,67.0,
136,136.0,4948.0,256.0,0.0010416666666666667,68.0,
137,137.0,5743.0,256.0,0.001056985294117647,69.0,
138,138.0,6239.0,256.0,0.0011335784313725491,74.0,
139,139.0,5978.0,256.0,0.0011335784313725491,74.0,
140,140.0,6358.0,256.0,0.0011335784313725491,74.0,
141,141.0,5827.0,256.0,0.0011029411764705882,72.0,
142,142.0,6197.0,256.0,0.0011488970588235295,75.0,
143,143.0,3962.0,256.0,0.0012408088235294117,81.0,
144,144.0,7197.0,256.0,0.0013020833333333333,85.0,
145,145.0,3783.0,256.0,0.0013020833333333333,85.0,
146,146.0,3408.0,256.0,0.0013020833333333333,85.0,
147,147.0,5248.0,256.0,0.0012714460784313726,83.0,
148,148.0,3421.0,256.0,0.0011948529411764707,78.0,
149,149.0,2815.0,256.0,0.0011642156862745098,76.0,
150,150.0,4440.0,256.0,0.001210171568627451,79.0,
151,151.0,5385.0,256.0,0.0011335784313725491,74.0,
152,152.0,5372.0,256.0,0.0011948529411764707,78.0,
153,153.0,4111.0,256.0,0.0012408088235294117,81.0,
154,154.0,6157.0,256.0,0.0011948529411764707,78.0,
155,155.0,5233.0,256.0,0.001210171568627451,79.0,
156,156.0,4599.0,256.0,0.0012254901960784314,80.0,
157,157.0,5562.0,256.0,0.0012561274509803922,82.0,
158,158.0,5339.0,256.0,0.001210171568627451,79.0,
159,159.0,4268.0,256.0,0.001210171568627451,79.0,
160,160.0,5004.0,256.0,0.0011642156862745098,76.0,
161,161.0,3743.0,256.0,0.0011642156862745098,76.0,
162,162.0,3792.0,256.0,0.0010876225490196079,71.0,
163,163.0,3430.0,256.0,0.0011335784313725491,74.0,
164,164.0,3212.0,256.0,0.0011335784313725491,74.0,
165,165.0,3580.0,256.0,0.0011642156862745098,76.0,
166,166.0,4309.0,256.0,0.0010876225490196079,71.0,
167,167.0,3748.0,256.0,0.0010723039215686275,70.0,
168,168.0,3868.0,256.0,0.0011182598039215686,73.0,
169,169.0,4169.0,256.0,0.001056985294117647,69.0,
170,170.0,3940.0,256.0,0.001011029411764706,66.0,
171,171.0,4309.0,256.0,9.957107843137254E-4,65.0,
172,172.0,4961.0,256.0,0.0010263480392156863,67.0,
173,173.0,4429.0,256.0,0.0010263480392156863,67.0,
174,174.0,4276.0,256.0,9.650735294117647E-4,63.0,
175,175.0,3717.0,256.0,9.497549019607843E-4,62.0,
176,176.0,5557.0,256.0,9.34436274509804E-4,61.0,
177,177.0,5188.0,256.0,9.957107843137254E-4,65.0,
178,178.0,5096.0,256.0,0.0010416666666666667,68.0,
179,179.0,5580.0,256.0,0.0011029411764705882,72.0,
180,180.0,5653.0,256.0,0.0012254901960784314,80.0,
181,181.0,4467.0,256.0,0.0012254901960784314,80.0,
182,182.0,6642.0,256.0,0.0012254901960784314,80.0,
183,183.0,7536.0,256.0,0.001286764705882353,84.0,
184,184.0,7736.0,256.0,0.0013633578431372548,89.0,
185,185.0,6876.0,256.0,0.001286764705882353,84.0,
186,186.0,3947.0,256.0,0.0013174019607843138,86.0,
187,187.0,6362.0,256.0,0.0013327205882352942,87.0,
188,188.0,6667.0,256.0,0.0013480392156862745,88.0,
189,189.0,4859.0,256.0,0.001286764705882353,84.0,
190,190.0,4725.0,256.0,0.0013480392156862745,88.0,
191,191.0,4936.0,256.0,0.0013174019607843138,86.0,
192,192.0,4650.0,256.0,0.0012714460784313726,83.0,
193,193.0,4812.0,256.0,0.0012561274509803922,82.0,
194,194.0,3606.0,256.0,0.0012561274509803922,82.0,
195,195.0,4775.0,256.0,0.0011948529411764707,78.0,
196,196.0,4419.0,256.0,0.0011488970588235295,75.0,
197,197.0,4438.0,256.0,0.0011642156862745098,76.0,
198,198.0,7075.0,256.0,0.0012408088235294117,81.0,
199,199.0,7055.0,256.0,0.0013480392156862745,88.0,
200,200.0,4919.0,256.0,0.0013480392156862745,88.0,
201,201.0,5544.0,256.0,0.0013174019607843138,86.0,
202,202.0,5391.0,256.0,0.0012714460784313726,83.0,
203,203.0,5341.0,256.0,0.0012561274509803922,82.0,
204,204.0,6173.0,256.0,0.0013020833333333333,85.0,
205,205.0,6429.0,256.0,0.0013327205882352942,87.0,
206,206.0,6894.0,256.0,0.0013327205882352942,87.0,
207,207.0,6438.0,256.0,0.0013174019607843138,86.0,
208,208.0,4591.0,256.0,0.0013174019607843138,86.0,
209,209.0,6033.0,256.0,0.0013786764705882354,90.0,
210,210.0,7338.0,256.0,0.0013786764705882354,90.0,
211,211.0,7513.0,256.0,0.0013633578431372548,89.0,
212,212.0,5726.0,256.0,0.0013480392156862745,88.0,
213,213.0,5192.0,256.0,0.0013939950980392157,91.0,
214,214.0,6137.0,256.0,0.001439950980392157,94.0,
215,215.0,7294.0,256.0,0.0015165441176470589,99.0,
216,216.0,7672.0,256.0,0.0015931372549019608,104.0,
217,217.0,6295.0,256.0,0.0016237745098039217,106.0,
218,218.0,7213.0,256.0,0.0014705882352941176,96.0,
219,219.0,5305.0,256.0,0.0015012254901960785,98.0,
220,220.0,4315.0,256.0,0.0015318627450980392,100.0,
221,221.0,4368.0,256.0,0.0015012254901960785,98.0,
222,222.0,3605.0,256.0,0.0014705882352941176,96.0,
223,223.0,3898.0,256.0,0.001409313725490196,92.0,
224,224.0,4396.0,256.0,0.0013327205882352942,87.0,
225,225.0,3749.0,256.0,0.0013633578431372548,89.0,
226,226.0,4247.0,256.0,0.0012714460784313726,83.0,
227,227.0,3613.0,256.0,0.0012254901960784314,80.0,
228,228.0,3858.0,256.0,0.001210171568627451,79.0,
229,229.0,4586.0,256.0,0.001210171568627451,79.0,
230,230.0,4618.0,256.0,0.001210171568627451,79.0,
231,231.0,4221.0,256.0,0.0011795343137254901,77.0,
232,232.0,3537.0,256.0,0.0011335784313725491,74.0,
233,233.0,5011.0,256.0,0.0011642156862745098,76.0,
234,234.0,5570.0,256.0,0.0011795343137254901,77.0,
235,235.0,6564.0,256.0,0.0011642156862745098,76.0,
236,236.0,5170.0,256.0,0.001210171568627451,79.0,
237,237.0,5550.0,256.0,0.0011335784313725491,74.0,
238,238.0,5454.0,256.0,0.0010876225490196079,71.0,
239,239.0,5020.0,256.0,0.0011029411764705882,72.0,
240,240.0,5804.0,256.0,0.0011948529411764707,78.0,
241,241.0,6259.0,256.0,0.001210171568627451,79.0,
242,242.0,6331.0,256.0,0.0011182598039215686,73.0,
243,243.0,5823.0,256.0,0.0010263480392156863,67.0,
244,244.0,6673.0,256.0,0.0010416666666666667,68.0,
245,245.0,7332.0,256.0,0.0010263480392156863,67.0,
246,246.0,5794.0,256.0,0.001011029411764706,66.0,
247,247.0,5930.0,256.0,0.0010263480392156863,67.0,
248,248.0,6874.0,256.0,0.0011029411764705882,72.0,
249,249.0,6839.0,256.0,0.001056985294117647,69.0,
250,250.0,8311.0,256.0,0.001056985294117647,69.0,
251,251.0,8291.0,256.0,0.0010723039215686275,70.0,
252,252.0,8439.0,256.0,9.957107843137254E-4,65.0,
253,253.0,8911.0,256.0,0.0010263480392156863,67.0,
254,254.0,8909.0,256.0,0.0010723039215686275,70.0,
255,255.0,8645.0,256.0,0.0011642156862745098,76.0,
256,256.0,10085.0,256.0,0.0012408088235294117,81.0,
257,257.0,8261.0,256.0,0.0012254901960784314,80.0,
258,258.0,11361.0,256.0,0.001409313725490196,92.0,
259,259.0,12004.0,256.0,0.0015012254901960785,98.0,
260,260.0,9925.0,256.0,0.0015165441176470589,99.0,
261,261.0,12896.0,256.0,0.0015471813725490195,101.0,
262,262.0,10311.0,256.0,0.0015165441176470589,99.0,
263,263.0,13298.0,256.0,0.0015165441176470589,99.0,
264,264.0,14216.0,256.0,0.0015778186274509804,103.0,
265,265.0,11088.0,256.0,0.0015778186274509804,103.0,
266,266.0,12233.0,256.0,0.001639093137254902,107.0,
267,267.0,13291.0,256.0,0.0017463235294117648,114.0,
268,268.0,11777.0,256.0,0.001838235294117647,120.0,
269,269.0,14261.0,256.0,0.0018229166666666667,119.0,
270,270.0,13011.0,256.0,0.0018075980392156864,118.0,
271,271.0,13276.0,256.0,0.0018229166666666667,119.0,
272,272.0,14499.0,256.0,0.001868872549019608,122.0,
273,273.0,10917.0,256.0,0.001914828431372549,125.0,
274,274.0,13049.0,256.0,0.0018841911764705883,123.0,
275,275.0,13260.0,256.0,0.002022058823529412,132.0,
276,276.0,13589.0,256.0,0.0020526960784313726,134.0,
277,277.0,13744.0,256.0,0.0021292892156862743,139.0,
278,278.0,17115.0,256.0,0.0021599264705882354,141.0,
279,279.0,15529.0,256.0,0.002022058823529412,132.0,
280,280.0,14717.0,256.0,0.002022058823529412,132.0,
281,281.0,17981.0,256.0,0.002006740196078431,131.0,
282,282.0,18098.0,256.0,0.0020986519607843136,137.0,
283,283.0,15617.0,256.0,0.002236519607843137,146.0,
284,284.0,16342.0,256.0,0.0022058823529411764,144.0,
285,285.0,17219.0,256.0,0.0022212009803921568,145.0,
286,286.0,18220.0,256.0,0.0022824754901960786,149.0,
287,287.0,18049.0,256.0,0.0022824754901960786,149.0,
288,288.0,18758.0,256.0,0.0022518382352941175,147.0,
289,289.0,22175.0,256.0,0.0023743872549019606,155.0,
290,290.0,19877.0,256.0,0.002420343137254902,158.0,
291,291.0,15710.0,256.0,0.0023743872549019606,155.0,
292,292.0,19212.0,256.0,0.0023743872549019606,155.0,
293,293.0,22109.0,256.0,0.0023284313725490196,152.0,
294,294.0,23149.0,256.0,0.0025582107843137255,167.0,
295,295.0,18852.0,256.0,0.002650122549019608,173.0,
296,296.0,21512.0,256.0,0.0026807598039215686,175.0,
297,297.0,21204.0,256.0,0.0028033088235294118,183.0,
298,298.0,26691.0,256.0,0.002818627450980392,184.0,
299,299.0,23869.0,256.0,0.003094362745098039,202.0,
300,300.0,27181.0,256.0,0.003170955882352941,207.0,
301,301.0,26518.0,256.0,0.0032322303921568625,211.0,
302,302.0,28280.0,256.0,0.003477328431372549,227.0,
303,303.0,29032.0,256.0,0.0036611519607843137,239.0,
304,304.0,26730.0,256.0,0.003722426470588235,243.0,
305,305.0,31033.0,256.0,0.003722426470588235,243.0,
306,306.0,29553.0,256.0,0.003799019607843137,248.0,
307,307.0,28414.0,256.0,0.0038756127450980393,253.0,
308,308.0,33603.0,256.0,0.003860294117647059,252.0,
309,309.0,32870.0,256.0,0.004044117647058824,264.0,
310,310.0,30981.0,256.0,0.004028799019607844,263.0,
311,311.0,30240.0,256.0,0.004197303921568627,274.0,
312,312.0,29232.0,256.0,0.004381127450980392,286.0,
313,313.0,26783.0,256.0,0.004258578431372549,278.0,
314,314.0,27696.0,256.0,0.004105392156862745,268.0,
315,315.0,28693.0,256.0,0.004044117647058824,264.0,
316,316.0,27706.0,256.0,0.004059436274509804,265.0,
317,317.0,27818.0,256.0,0.003860294117647059,252.0,
318,318.0,31954.0,256.0,0.003676470588235294,240.0,
319,319.0,28273.0,256.0,0.003722426470588235,243.0,
320,320.0,31032.0,256.0,0.003799019607843137,248.0,
321,321.0,31005.0,256.0,0.0038143382352941175,249.0,
322,322.0,31066.0,256.0,0.003783700980392157,247.0,
323,323.0,28999.0,256.0,0.003783700980392157,247.0,
324,324.0,31968.0,256.0,0.003737745098039216,244.0,
325,325.0,38175.0,256.0,0.003783700980392157,247.0,
326,326.0,29395.0,256.0,0.00390625,255.0,
327,327.0,34239.0,256.0,0.004227941176470588,276.0,
328,328.0,30641.0,256.0,0.004090073529411765,267.0,
329,329.0,29009.0,256.0,0.004059436274509804,265.0,
330,330.0,28410.0,256.0,0.003936887254901961,257.0,
331,331.0,31982.0,256.0,0.003998161764705882,261.0,
332,332.0,32592.0,256.0,0.003998161764705882,261.0,
333,333.0,32553.0,256.0,0.004013480392156862,262.0,
334,334.0,36054.0,256.0,0.0038909313725490197,254.0,
335,335.0,36430.0,256.0,0.004105392156862745,268.0,
336,336.0,38238.0,256.0,0.004181985294117647,273.0,
337,337.0,36657.0,256.0,0.004427083333333333,289.0,
338,338.0,41844.0,256.0,0.0047181372549019605,308.0,
339,339.0,36472.0,256.0,0.00470281862745098,307.0,
340,340.0,36838.0,256.0,0.004840686274509804,316.0,
341,341.0,36499.0,256.0,0.004794730392156863,313.0,
342,342.0,35756.0,256.0,0.004656862745098039,304.0,
343,343.0,36809.0,256.0,0.004748774509803921,310.0,
344,344.0,37568.0,256.0,0.004794730392156863,313.0,
345,345.0,44087.0,256.0,0.005009191176470589,327.0,
346,346.0,37223.0,256.0,0.004932598039215686,322.0,
347,347.0,38776.0,256.0,0.004810049019607843,314.0,
348,348.0,43157.0,256.0,0.004764093137254902,311.0,
349,349.0,48391.0,256.0,0.004901960784313725,320.0,
350,350.0,45712.0,256.0,0.005116421568627451,334.0,
351,351.0,45709.0,256.0,0.005223651960784313,341.0,
352,352.0,44913.0,256.0,0.005238970588235294,342.0,
353,353.0,47210.0,256.0,0.005254289215686275,343.0,
354,354.0,42952.0,256.0,0.005438112745098039,355.0,
355,355.0,44272.0,256.0,0.005499387254901961,359.0,
356,356.0,39385.0,256.0,0.00548406862745098,358.0,
357,357.0,41484.0,256.0,0.005438112745098039,355.0,
358,358.0,33752.0,256.0,0.005453431372549019,356.0,
359,359.0,45877.0,256.0,0.005499387254901961,359.0,
360,360.0,42198.0,256.0,0.005330882352941177,348.0,
361,361.0,44871.0,256.0,0.005284926470588236,345.0,
362,362.0,44971.0,256.0,0.005315563725490196,347.0,
363,363.0,44903.0,256.0,0.005545343137254902,362.0,
364,364.0,39671.0,256.0,0.005667892156862745,370.0,
365,365.0,43164.0,256.0,0.005545343137254902,362.0,
366,366.0,42813.0,256.0,0.00546875,357.0,
367,367.0,42559.0,256.0,0.005346200980392157,349.0,
368,368.0,45699.0,256.0,0.005238970588235294,342.0,
369,369.0,46674.0,256.0,0.005591299019607843,365.0,
370,370.0,50753.0,256.0,0.0055606617647058825,363.0,
371,371.0,49139.0,256.0,0.0056066176470588236,366.0,
372,372.0,43490.0,256.0,0.00586703431372549,383.0,
373,373.0,52910.0,256.0,0.005821078431372549,380.0,
374,374.0,45397.0,256.0,0.005989583333333334,391.0,
375,375.0,54549.0,256.0,0.006127450980392157,400.0,
376,376.0,52446.0,256.0,0.005989583333333334,391.0,
377,377.0,51755.0,256.0,0.005897671568627451,385.0,
378,378.0,49433.0,256.0,0.006035539215686275,394.0,
379,379.0,51657.0,256.0,0.006127450980392157,400.0,
380,380.0,51219.0,256.0,0.006173406862745098,403.0,
381,381.0,47951.0,256.0,0.006341911764705882,414.0,
382,382.0,45404.0,256.0,0.006449142156862745,421.0,
383,383.0,51950.0,256.0,0.006372549019607843,416.0,
384,384.0,51444.0,256.0,0.006495098039215687,424.0,
385,385.0,57652.0,256.0,0.006525735294117647,426.0,
386,386.0,46489.0,256.0,0.006541053921568628,427.0,
387,387.0,51951.0,256.0,0.00666360294117647,435.0,
388,388.0,52155.0,256.0,0.006709558823529411,438.0,
389,389.0,52338.0,256.0,0.006587009803921569,430.0,
390,390.0,52723.0,256.0,0.0067708333333333336,442.0,
391,391.0,49866.0,256.0,0.006801470588235294,444.0,
392,392.0,47495.0,256.0,0.006678921568627451,436.0,
393,393.0,52460.0,256.0,0.006479779411764706,423.0,
394,394.0,51695.0,256.0,0.006602328431372549,431.0,
395,395.0,53717.0,256.0,0.006740196078431373,440.0,
396,396.0,50634.0,256.0,0.00664828431372549,434.0,
397,397.0,53954.0,256.0,0.006510416666666667,425.0,
398,398.0,51852.0,256.0,0.006418504901960784,419.0,
399,399.0,53159.0,256.0,0.006387867647058823,417.0,
400,400.0,55796.0,256.0,0.006357230392156863,415.0,
401,401.0,51632.0,256.0,0.006495098039215687,424.0,
402,402.0,61944.0,256.0,0.006525735294117647,426.0,
403,403.0,61244.0,256.0,0.006816789215686275,445.0,
404,404.0,57453.0,256.0,0.006878063725490196,449.0,
405,405.0,62767.0,256.0,0.00701593137254902,458.0,
406,406.0,57510.0,256.0,0.007245710784313726,473.0,
407,407.0,58988.0,256.0,0.007245710784313726,473.0,
408,408.0,59635.0,256.0,0.007337622549019608,479.0,
409,409.0,64548.0,256.0,0.007659313725490196,500.0,
410,410.0,70424.0,256.0,0.007552083333333333,493.0,
411,411.0,69738.0,256.0,0.007659313725490196,500.0,
412,412.0,74410.0,256.0,0.007889093137254902,515.0,
413,413.0,81585.0,256.0,0.008088235294117648,528.0,
414,414.0,77748.0,256.0,0.00822610294117647,537.0,
415,415.0,75830.0,256.0,0.008241421568627451,538.0,
416,416.0,76076.0,256.0,0.00856311274509804,559.0,
417,417.0,81621.0,256.0,0.008792892156862745,574.0,
418,418.0,90140.0,256.0,0.008961397058823529,585.0,
419,419.0,86995.0,256.0,0.009114583333333334,595.0,
420,420.0,91342.0,256.0,0.009528186274509805,622.0,
421,421.0,94089.0,256.0,0.009712009803921569,634.0,
422,422.0,96417.0,256.0,0.009865196078431372,644.0,
423,423.0,76909.0,256.0,0.010079656862745099,658.0,
424,424.0,76299.0,256.0,0.010355392156862745,676.0,
425,425.0,82922.0,256.0,0.010355392156862745,676.0,
426,426.0,96474.0,256.0,0.01050857843137255,686.0,
427,427.0,85429.0,256.0,0.010355392156862745,676.0,
428,428.0,85804.0,256.0,0.010585171568627452,691.0,
429,429.0,84505.0,256.0,0.010738357843137255,701.0,
430,430.0,80743.0,256.0,0.0109375,714.0,
431,431.0,81835.0,256.0,0.0109375,714.0,
432,432.0,103478.0,256.0,0.011090686274509804,724.0,
433,433.0,90309.0,256.0,0.011044730392156863,721.0,
434,434.0,95805.0,256.0,0.011106004901960785,725.0,
435,435.0,90953.0,256.0,0.011090686274509804,724.0,
436,436.0,94882.0,256.0,0.011151960784313726,728.0,
437,437.0,88946.0,256.0,0.011213235294117647,732.0,
438,438.0,105476.0,256.0,0.011458333333333333,748.0,
439,439.0,99597.0,256.0,0.011596200980392157,757.0,
440,440.0,95662.0,256.0,0.011397058823529411,744.0,
441,441.0,96965.0,256.0,0.01138174019607843,743.0,
442,442.0,93909.0,256.0,0.011412377450980392,745.0,
443,443.0,89977.0,256.0,0.011565563725490197,755.0,
444,444.0,92952.0,256.0,0.01173406862745098,766.0,
445,445.0,99395.0,256.0,0.01170343137254902,764.0,
446,446.0,92053.0,256.0,0.01170343137254902,764.0,
447,447.0,105062.0,256.0,0.011871936274509803,775.0,
448,448.0,101831.0,256.0,0.012178308823529412,795.0,
449,449.0,95176.0,256.0,0.0125,816.0,
450,450.0,108735.0,256.0,0.012239583333333333,799.0,
451,451.0,101117.0,256.0,0.012316176470588235,804.0,
452,452.0,93937.0,256.0,0.01211703431372549,791.0,
453,453.0,97462.0,256.0,0.012300857843137255,803.0,
454,454.0,107689.0,256.0,0.012224264705882353,798.0,
455,455.0,90009.0,256.0,0.012653186274509804,826.0,
456,456.0,102240.0,256.0,0.012576593137254902,821.0,
457,457.0,105562.0,256.0,0.012637867647058824,825.0,
458,458.0,116291.0,256.0,0.01291360294117647,843.0,
459,459.0,113725.0,256.0,0.01332720588235294,870.0,
460,460.0,112976.0,256.0,0.01331188725490196,869.0,
461,461.0,112734.0,256.0,0.013434436274509805,877.0,
462,462.0,115990.0,256.0,0.013587622549019608,887.0,
463,463.0,106001.0,256.0,0.013725490196078431,896.0,
464,464.0,110593.0,256.0,0.013909313725490195,908.0,
465,465.0,115022.0,256.0,0.014200367647058823,927.0,
466,466.0,114341.0,256.0,0.014368872549019607,938.0,
467,467.0,95829.0,256.0,0.014246323529411764,930.0,
468,468.0,101824.0,256.0,0.01446078431372549,944.0,
469,469.0,114082.0,256.0,0.014598651960784314,953.0,
470,470.0,108061.0,256.0,0.014276960784313725,932.0,
471,471.0,97682.0,256.0,0.014935661764705883,975.0,
472,472.0,106283.0,256.0,0.014950980392156863,976.0,
473,473.0,95198.0,256.0,0.014721200980392157,961.0,
474,474.0,104831.0,256.0,0.014200367647058823,927.0,
475,475.0,105146.0,256.0,0.013955269607843138,911.0,
476,476.0,95391.0,256.0,0.01371017156862745,895.0,
477,477.0,99720.0,256.0,0.013449754901960785,878.0,
478,478.0,112018.0,256.0,0.013219975490196078,863.0,
479,479.0,119321.0,256.0,0.013373161764705882,873.0,
480,480.0,98348.0,256.0,0.013786764705882353,900.0,
481,481.0,104848.0,256.0,0.01401654411764706,915.0,
482,482.0,107283.0,256.0,0.013924632352941177,909.0,
483,483.0,105208.0,256.0,0.013878676470588235,906.0,
484,484.0,105307.0,256.0,0.01367953431372549,893.0,
485,485.0,111050.0,256.0,0.013817401960784313,902.0,
486,486.0,109900.0,256.0,0.01366421568627451,892.0,
487,487.0,93526.0,256.0,0.013909313725490195,908.0,
488,488.0,104820.0,256.0,0.013939950980392158,910.0,
489,489.0,92361.0,256.0,0.013771446078431372,899.0,
490,490.0,97918.0,256.0,0.013756127450980392,898.0,
491,491.0,111273.0,256.0,0.013848039215686274,904.0,
492,492.0,115848.0,256.0,0.013756127450980392,898.0,
493,493.0,94897.0,256.0,0.01364889705882353,891.0,
494,494.0,98646.0,256.0,0.013495710784313726,881.0,
495,495.0,96916.0,256.0,0.013342524509803921,871.0,
496,496.0,98889.0,256.0,0.013771446078431372,899.0,
497,497.0,106400.0,256.0,0.01369485294117647,894.0,
498,498.0,95986.0,256.0,0.013511029411764706,882.0,
499,499.0,89570.0,256.0,0.013802083333333333,901.0,
500,500.0,99775.0,256.0,0.013618259803921569,889.0,
501,501.0,76928.0,256.0,0.013556985294117647,885.0,
502,502.0,80752.0,256.0,0.013174019607843137,860.0,
503,503.0,76254.0,256.0,0.013020833333333334,850.0,
504,504.0,81084.0,256.0,0.012607230392156863,823.0,
505,505.0,91986.0,256.0,0.012408088235294117,810.0,
506,506.0,79367.0,256.0,0.01246936274509804,814.0,
507,507.0,87563.0,256.0,0.012346813725490196,806.0,
508,508.0,89293.0,256.0,0.012331495098039215,805.0,
509,509.0,76196.0,256.0,0.01246936274509804,814.0,
510,510.0,83222.0,256.0,0.012316176470588235,804.0,
511,511.0,77713.0,256.0,0.012316176470588235,804.0,
512,512.0,68389.0,256.0,0.012331495098039215,805.0,
513,513.0,75675.0,256.0,0.011994485294117648,783.0,
514,514.0,73398.0,256.0,0.011902573529411764,777.0,
515,515.0,80841.0,256.0,0.011979166666666667,782.0,
516,516.0,67362.0,256.0,0.01211703431372549,791.0,
517,517.0,77683.0,256.0,0.01210171568627451,790.0,
518,518.0,72312.0,256.0,0.012009803921568628,784.0,
519,519.0,77003.0,256.0,0.011948529411764705,780.0,
520,520.0,75811.0,256.0,0.012025122549019608,785.0,
521,521.0,69587.0,256.0,0.01168811274509804,763.0,
522,522.0,58679.0,256.0,0.011887254901960784,776.0,
523,523.0,72492.0,256.0,0.011917892156862744,778.0,
524,524.0,78036.0,256.0,0.011856617647058823,774.0,
525,525.0,72327.0,256.0,0.011764705882352941,768.0,
526,526.0,62571.0,256.0,0.011213235294117647,732.0,
527,527.0,64035.0,256.0,0.011014093137254903,719.0,
528,528.0,69891.0,256.0,0.010799632352941176,705.0,
529,529.0,59064.0,256.0,0.01098345588235294,717.0,
530,530.0,58467.0,256.0,0.010723039215686275,700.0,
531,531.0,70043.0,256.0,0.010723039215686275,700.0,
532,532.0,65709.0,256.0,0.01050857843137255,686.0,
533,533.0,66642.0,256.0,0.010600490196078432,692.0,
534,534.0,62927.0,256.0,0.010462622549019607,683.0,
535,535.0,60979.0,256.0,0.010355392156862745,676.0,
536,536.0,70891.0,256.0,0.010631127450980393,694.0,
537,537.0,67945.0,256.0,0.010462622549019607,683.0,
538,538.0,54091.0,256.0,0.010631127450980393,694.0,
539,539.0,54960.0,256.0,0.010386029411764705,678.0,
540,540.0,63213.0,256.0,0.010186887254901961,665.0,
541,541.0,57455.0,256.0,0.009957107843137254,650.0,
542,542.0,71008.0,256.0,0.010094975490196079,659.0,
543,543.0,60954.0,256.0,0.010094975490196079,659.0,
544,544.0,73360.0,256.0,0.010324754901960784,674.0,
545,545.0,61777.0,256.0,0.010416666666666666,680.0,
546,546.0,71817.0,256.0,0.010447303921568627,682.0,
547,547.0,62233.0,256.0,0.010232843137254902,668.0,
548,548.0,65472.0,256.0,0.01055453431372549,689.0,
549,549.0,62900.0,256.0,0.01052389705882353,687.0,
550,550.0,64028.0,256.0,0.010370710784313725,677.0,
551,551.0,63839.0,256.0,0.010416666666666666,680.0,
552,552.0,73295.0,256.0,0.010370710784313725,677.0,
553,553.0,66073.0,256.0,0.01050857843137255,686.0,
554,554.0,67653.0,256.0,0.010493259803921568,685.0,
555,555.0,72464.0,256.0,0.01055453431372549,689.0,
556,556.0,58258.0,256.0,0.010263480392156863,670.0,
557,557.0,58933.0,256.0,0.010064338235294118,657.0,
558,558.0,59151.0,256.0,0.009941789215686274,649.0,
559,559.0,51367.0,256.0,0.00977328431372549,638.0,
560,560.0,56441.0,256.0,0.00975796568627451,637.0,
561,561.0,55769.0,256.0,0.009650735294117647,630.0,
562,562.0,47660.0,256.0,0.009604779411764706,627.0,
563,563.0,51790.0,256.0,0.009620098039215687,628.0,
564,564.0,57129.0,256.0,0.009451593137254901,617.0,
565,565.0,60814.0,256.0,0.009221813725490196,602.0,
566,566.0,55274.0,256.0,0.009083946078431373,593.0,
567,567.0,48811.0,256.0,0.008946078431372548,584.0,
568,568.0,50139.0,256.0,0.008900122549019607,581.0,
569,569.0,52090.0,256.0,0.008716299019607843,569.0,
570,570.0,49762.0,256.0,0.008762254901960784,572.0,
571,571.0,58831.0,256.0,0.00857843137254902,560.0,
572,572.0,55188.0,256.0,0.008517156862745097,556.0,
573,573.0,55459.0,256.0,0.00856311274509804,559.0,
574,574.0,42064.0,256.0,0.008716299019607843,569.0,
575,575.0,50040.0,256.0,0.008731617647058824,570.0,
576,576.0,46559.0,256.0,0.008900122549019607,581.0,
577,577.0,48582.0,256.0,0.008670343137254902,566.0,
578,578.0,44692.0,256.0,0.008486519607843137,554.0,
579,579.0,46649.0,256.0,0.008072916666666667,527.0,
580,580.0,43612.0,256.0,0.007935049019607843,518.0,
581,581.0,39786.0,256.0,0.007751225490196079,506.0,
582,582.0,40132.0,256.0,0.007582720588235294,495.0,
583,583.0,44654.0,256.0,0.007506127450980392,490.0,
584,584.0,51673.0,256.0,0.007460171568627451,487.0,
585,585.0,52446.0,256.0,0.007337622549019608,479.0,
586,586.0,49708.0,256.0,0.007291666666666667,476.0,
587,587.0,56847.0,256.0,0.007383578431372549,482.0,
588,588.0,54415.0,256.0,0.007552083333333333,493.0,
589,589.0,47404.0,256.0,0.0078125,510.0,
590,590.0,52872.0,256.0,0.007735906862745098,505.0,
591,591.0,45983.0,256.0,0.007689950980392156,502.0,
592,592.0,43552.0,256.0,0.0078125,510.0,
593,593.0,47649.0,256.0,0.0078125,510.0,
594,594.0,52126.0,256.0,0.0078125,510.0,
595,595.0,46325.0,256.0,0.008011642156862744,523.0,
596,596.0,46299.0,256.0,0.00782781862745098,511.0,
597,597.0,45948.0,256.0,0.007705269607843138,503.0,
598,598.0,45047.0,256.0,0.0074142156862745095,484.0,
599,599.0,43728.0,256.0,0.007352941176470588,480.0,
600,600.0,46478.0,256.0,0.0070925245098039215,463.0,
601,601.0,42459.0,256.0,0.007123161764705882,465.0,
602,602.0,47550.0,256.0,0.006954656862745098,454.0,
603,603.0,45682.0,256.0,0.006908700980392157,451.0,
604,604.0,43026.0,256.0,0.006862745098039216,448.0,
605,605.0,53755.0,256.0,0.006571691176470588,429.0,
606,606.0,49235.0,256.0,0.006479779411764706,423.0,
607,607.0,51672.0,256.0,0.006510416666666667,425.0,
608,608.0,42770.0,256.0,0.006571691176470588,429.0,
609,609.0,49206.0,256.0,0.006495098039215687,424.0,
610,610.0,44051.0,256.0,0.006755514705882353,441.0,
611,611.0,47180.0,256.0,0.006847426470588235,447.0,
612,612.0,49759.0,256.0,0.006694240196078431,437.0,
613,613.0,42631.0,256.0,0.006969975490196079,455.0,
614,614.0,43212.0,256.0,0.007061887254901961,461.0,
615,615.0,42286.0,256.0,0.00703125,459.0,
616,616.0,36844.0,256.0,0.006816789215686275,445.0,
617,617.0,36266.0,256.0,0.006510416666666667,425.0,
618,618.0,38809.0,256.0,0.006510416666666667,425.0,
619,619.0,31705.0,256.0,0.006326593137254902,413.0,
620,620.0,34307.0,256.0,0.005989583333333334,391.0,
621,621.0,38480.0,256.0,0.0059283088235294115,387.0,
622,622.0,39566.0,256.0,0.005775122549019608,377.0,
623,623.0,41725.0,256.0,0.005667892156862745,370.0,
624,624.0,46091.0,256.0,0.0057444852941176475,375.0,
625,625.0,44361.0,256.0,0.00548406862745098,358.0,
626,626.0,42196.0,256.0,0.005438112745098039,355.0,
627,627.0,42670.0,256.0,0.005422794117647059,354.0,
628,628.0,38558.0,256.0,0.0055606617647058825,363.0,
629,629.0,41724.0,256.0,0.0057444852941176475,375.0,
630,630.0,42405.0,256.0,0.0058823529411764705,384.0,
631,631.0,46821.0,256.0,0.0058363970588235295,381.0,
632,632.0,41110.0,256.0,0.0057444852941176475,375.0,
633,633.0,42409.0,256.0,0.00586703431372549,383.0,
634,634.0,47317.0,256.0,0.005958946078431372,389.0,
635,635.0,42002.0,256.0,0.005989583333333334,391.0,
636,636.0,43734.0,256.0,0.005897671568627451,385.0,
637,637.0,43759.0,256.0,0.006127450980392157,400.0,
638,638.0,49105.0,256.0,0.006188725490196078,404.0,
639,639.0,45418.0,256.0,0.006188725490196078,404.0,
640,640.0,42123.0,256.0,0.00625,408.0,
641,641.0,46912.0,256.0,0.006096813725490196,398.0,
642,642.0,45436.0,256.0,0.006173406862745098,403.0,
643,643.0,42212.0,256.0,0.0062040441176470585,405.0,
644,644.0,45276.0,256.0,0.006127450980392157,400.0,
645,645.0,42103.0,256.0,0.006188725490196078,404.0,
646,646.0,45820.0,256.0,0.006295955882352941,411.0,
647,647.0,47547.0,256.0,0.006280637254901961,410.0,
648,648.0,50326.0,256.0,0.006387867647058823,417.0,
649,649.0,46265.0,256.0,0.00625,408.0,
650,650.0,44192.0,256.0,0.0061580882352941175,402.0,
651,651.0,45972.0,256.0,0.006173406862745098,403.0,
652,652.0,48865.0,256.0,0.006188725490196078,404.0,
653,653.0,41992.0,256.0,0.006433823529411764,420.0,
654,654.0,46149.0,256.0,0.00625,408.0,
655,655.0,48261.0,256.0,0.005943627450980392,388.0,
656,656.0,49071.0,256.0,0.006066176470588235,396.0,
657,657.0,50112.0,256.0,0.006050857843137255,395.0,
658,658.0,42825.0,256.0,0.006081495098039216,397.0,
659,659.0,55595.0,256.0,0.006127450980392157,400.0,
660,660.0,50539.0,256.0,0.006219362745098039,406.0,
661,661.0,52766.0,256.0,0.006004901960784314,392.0,
662,662.0,47033.0,256.0,0.006188725490196078,404.0,
663,663.0,48907.0,256.0,0.006433823529411764,420.0,
664,664.0,50271.0,256.0,0.006464460784313725,422.0,
665,665.0,46352.0,256.0,0.006862745098039216,448.0,
666,666.0,51298.0,256.0,0.006541053921568628,427.0,
667,667.0,43540.0,256.0,0.00664828431372549,434.0,
668,668.0,54407.0,256.0,0.006740196078431373,440.0,
669,669.0,47159.0,256.0,0.006694240196078431,437.0,
670,670.0,51379.0,256.0,0.006617647058823529,432.0,
671,671.0,57062.0,256.0,0.006311274509803922,412.0,
672,672.0,57027.0,256.0,0.006449142156862745,421.0,
673,673.0,55394.0,256.0,0.006449142156862745,421.0,
674,674.0,49475.0,256.0,0.006418504901960784,419.0,
675,675.0,51181.0,256.0,0.006418504901960784,419.0,
676,676.0,50974.0,256.0,0.006433823529411764,420.0,
677,677.0,49124.0,256.0,0.0067248774509803926,439.0,
678,678.0,44480.0,256.0,0.00663296568627451,433.0,
679,679.0,43032.0,256.0,0.006541053921568628,427.0,
680,680.0,45008.0,256.0,0.006479779411764706,423.0,
681,681.0,47894.0,256.0,0.006418504901960784,419.0,
682,682.0,49855.0,256.0,0.006311274509803922,412.0,
683,683.0,47525.0,256.0,0.006387867647058823,417.0,
684,684.0,50914.0,256.0,0.006418504901960784,419.0,
685,685.0,50660.0,256.0,0.006311274509803922,412.0,
686,686.0,56450.0,256.0,0.006326593137254902,413.0,
687,687.0,47305.0,256.0,0.006433823529411764,420.0,
688,688.0,47613.0,256.0,0.006219362745098039,406.0,
689,689.0,45151.0,256.0,0.006096813725490196,398.0,
690,690.0,44995.0,256.0,0.005897671568627451,385.0,
691,691.0,41773.0,256.0,0.005698529411764706,372.0,
692,692.0,44964.0,256.0,0.005713848039215686,373.0,
693,693.0,46785.0,256.0,0.005652573529411765,369.0,
694,694.0,43265.0,256.0,0.0057444852941176475,375.0,
695,695.0,43802.0,256.0,0.006004901960784314,392.0,
696,696.0,48385.0,256.0,0.006050857843137255,395.0,
697,697.0,45348.0,256.0,0.006096813725490196,398.0,
698,698.0,50665.0,256.0,0.005989583333333334,391.0,
699,699.0,50101.0,256.0,0.0059283088235294115,387.0,
700,700.0,49920.0,256.0,0.006004901960784314,392.0,
701,701.0,53704.0,256.0,0.006311274509803922,412.0,
702,702.0,55664.0,256.0,0.006495098039215687,424.0,
703,703.0,47299.0,256.0,0.006265318627450981,409.0,
704,704.0,48921.0,256.0,0.006387867647058823,417.0,
705,705.0,50770.0,256.0,0.006479779411764706,423.0,
706,706.0,46258.0,256.0,0.006709558823529411,438.0,
707,707.0,53157.0,256.0,0.006908700980392157,451.0,
708,708.0,40915.0,256.0,0.006985294117647059,456.0,
709,709.0,50074.0,256.0,0.006816789215686275,445.0,
710,710.0,44367.0,256.0,0.0067708333333333336,442.0,
711,711.0,49582.0,256.0,0.006556372549019608,428.0,
712,712.0,46365.0,256.0,0.006479779411764706,423.0,
713,713.0,53661.0,256.0,0.006341911764705882,414.0,
714,714.0,47317.0,256.0,0.006326593137254902,413.0,
715,715.0,47170.0,256.0,0.006341911764705882,414.0,
716,716.0,52527.0,256.0,0.006541053921568628,427.0,
717,717.0,55441.0,256.0,0.006464460784313725,422.0,
718,718.0,51225.0,256.0,0.006495098039215687,424.0,
719,719.0,57205.0,256.0,0.006433823529411764,420.0,
720,720.0,60009.0,256.0,0.006495098039215687,424.0,
721,721.0,52328.0,256.0,0.006387867647058823,417.0,
722,722.0,51326.0,256.0,0.006602328431372549,431.0,
723,723.0,55374.0,256.0,0.00663296568627451,433.0,
724,724.0,60051.0,256.0,0.006571691176470588,429.0,
725,725.0,66183.0,256.0,0.006755514705882353,441.0,
726,726.0,55596.0,256.0,0.0067248774509803926,439.0,
727,727.0,55624.0,256.0,0.007077205882352941,462.0,
728,728.0,54537.0,256.0,0.0072763480392156864,475.0,
729,729.0,62143.0,256.0,0.0070465686274509805,460.0,
730,730.0,54432.0,256.0,0.006954656862745098,454.0,
731,731.0,54757.0,256.0,0.007153799019607843,467.0,
732,732.0,59310.0,256.0,0.0071844362745098036,469.0,
733,733.0,58082.0,256.0,0.00742953431372549,485.0,
734,734.0,62458.0,256.0,0.007215073529411765,471.0,
735,735.0,55152.0,256.0,0.00703125,459.0,
736,736.0,57679.0,256.0,0.007077205882352941,462.0,
737,737.0,57577.0,256.0,0.006985294117647059,456.0,
738,738.0,55908.0,256.0,0.007077205882352941,462.0,
739,739.0,54581.0,256.0,0.007291666666666667,476.0,
740,740.0,55818.0,256.0,0.007199754901960784,470.0,
741,741.0,58352.0,256.0,0.007215073529411765,471.0,
742,742.0,52700.0,256.0,0.0072763480392156864,475.0,
743,743.0,53851.0,256.0,0.007123161764705882,465.0,
744,744.0,53857.0,256.0,0.007061887254901961,461.0,
745,745.0,47243.0,256.0,0.007245710784313726,473.0,
746,746.0,54206.0,256.0,0.0073223039215686275,478.0,
747,747.0,54952.0,256.0,0.0071844362745098036,469.0,
748,748.0,53322.0,256.0,0.0070925245098039215,463.0,
749,749.0,54526.0,256.0,0.00703125,459.0,
750,750.0,51805.0,256.0,0.006924019607843137,452.0,
751,751.0,54150.0,256.0,0.0067708333333333336,442.0,
752,752.0,57309.0,256.0,0.006954656862745098,454.0,
753,753.0,54214.0,256.0,0.006893382352941176,450.0,
754,754.0,51914.0,256.0,0.006694240196078431,437.0,
755,755.0,59971.0,256.0,0.006801470588235294,444.0,
756,756.0,61317.0,256.0,0.0070006127450980395,457.0,
757,757.0,56138.0,256.0,0.007215073529411765,471.0,
758,758.0,50873.0,256.0,0.006954656862745098,454.0,
759,759.0,47839.0,256.0,0.006816789215686275,445.0,
760,760.0,52428.0,256.0,0.006709558823529411,438.0,
761,761.0,55305.0,256.0,0.0067248774509803926,439.0,
762,762.0,59070.0,256.0,0.0067248774509803926,439.0,
763,763.0,57780.0,256.0,0.006862745098039216,448.0,
764,764.0,53167.0,256.0,0.006969975490196079,455.0,
765,765.0,55426.0,256.0,0.006954656862745098,454.0,
766,766.0,46242.0,256.0,0.007107843137254902,464.0,
767,767.0,57546.0,256.0,0.007215073529411765,471.0,
768,768.0,58493.0,256.0,0.007107843137254902,464.0,
769,769.0,57719.0,256.0,0.00742953431372549,485.0,
770,770.0,63941.0,256.0,0.007536764705882353,492.0,
771,771.0,53387.0,256.0,0.007460171568627451,487.0,
772,772.0,53745.0,256.0,0.007383578431372549,482.0,
773,773.0,55589.0,256.0,0.007521446078431373,491.0,
774,774.0,55795.0,256.0,0.007506127450980392,490.0,
775,775.0,63052.0,256.0,0.007536764705882353,492.0,
776,776.0,53010.0,256.0,0.007521446078431373,491.0,
777,777.0,55948.0,256.0,0.007245710784313726,473.0,
778,778.0,52075.0,256.0,0.0070925245098039215,463.0,
779,779.0,49677.0,256.0,0.0070465686274509805,460.0,
780,780.0,52476.0,256.0,0.007245710784313726,473.0,
781,781.0,46674.0,256.0,0.0071844362745098036,469.0,
782,782.0,53036.0,256.0,0.007153799019607843,467.0,
783,783.0,64600.0,256.0,0.007169117647058823,468.0,
784,784.0,51909.0,256.0,0.0070925245098039215,463.0,
785,785.0,51482.0,256.0,0.007107843137254902,464.0,
786,786.0,54597.0,256.0,0.007061887254901961,461.0,
787,787.0,48847.0,256.0,0.006954656862745098,454.0,
788,788.0,51775.0,256.0,0.00703125,459.0,
789,789.0,61557.0,256.0,0.007153799019607843,467.0,
790,790.0,53992.0,256.0,0.007123161764705882,465.0,
791,791.0,56651.0,256.0,0.0071844362745098036,469.0,
792,792.0,61727.0,256.0,0.0073223039215686275,478.0,
793,793.0,44890.0,256.0,0.0072763480392156864,475.0,
794,794.0,48106.0,256.0,0.007552083333333333,493.0,
795,795.0,53354.0,256.0,0.00744485294117647,486.0,
796,796.0,54306.0,256.0,0.007352941176470588,480.0,
797,797.0,49275.0,256.0,0.0070925245098039215,463.0,
798,798.0,46331.0,256.0,0.006969975490196079,455.0,
799,799.0,51976.0,256.0,0.006816789215686275,445.0,
800,800.0,53590.0,256.0,0.006878063725490196,449.0,
801,801.0,43183.0,256.0,0.0067248774509803926,439.0,
802,802.0,53903.0,256.0,0.006847426470588235,447.0,
803,803.0,50384.0,256.0,0.006893382352941176,450.0,
804,804.0,46859.0,256.0,0.006801470588235294,444.0,
805,805.0,47257.0,256.0,0.006709558823529411,438.0,
806,806.0,45064.0,256.0,0.006709558823529411,438.0,
807,807.0,54687.0,256.0,0.006862745098039216,448.0,
808,808.0,45698.0,256.0,0.006678921568627451,436.0,
809,809.0,41444.0,256.0,0.006541053921568628,427.0,
810,810.0,51923.0,256.0,0.006709558823529411,438.0,
811,811.0,53708.0,256.0,0.00666360294117647,435.0,
812,812.0,52764.0,256.0,0.006740196078431373,440.0,
813,813.0,57059.0,256.0,0.006786151960784314,443.0,
814,814.0,51691.0,256.0,0.006602328431372549,431.0,
815,815.0,56191.0,256.0,0.006893382352941176,450.0,
816,816.0,59751.0,256.0,0.006969975490196079,455.0,
817,817.0,51936.0,256.0,0.006878063725490196,449.0,
818,818.0,65196.0,256.0,0.006786151960784314,443.0,
819,819.0,56233.0,256.0,0.006847426470588235,447.0,
820,820.0,67887.0,256.0,0.006847426470588235,447.0,
821,821.0,59148.0,256.0,0.00701593137254902,458.0,
822,822.0,59761.0,256.0,0.007230392156862745,472.0,
823,823.0,62891.0,256.0,0.007383578431372549,482.0,
824,824.0,60377.0,256.0,0.007398897058823529,483.0,
825,825.0,56398.0,256.0,0.007490808823529412,489.0,
826,826.0,53736.0,256.0,0.007398897058823529,483.0,
827,827.0,62316.0,256.0,0.00744485294117647,486.0,
828,828.0,70210.0,256.0,0.007643995098039215,499.0,
829,829.0,57097.0,256.0,0.007689950980392156,502.0,
830,830.0,51811.0,256.0,0.007904411764705882,516.0,
831,831.0,55406.0,256.0,0.007858455882352941,513.0,
832,832.0,63533.0,256.0,0.007628676470588235,498.0,
833,833.0,55389.0,256.0,0.007552083333333333,493.0,
834,834.0,51743.0,256.0,0.007169117647058823,468.0,
835,835.0,56914.0,256.0,0.006893382352941176,450.0,
836,836.0,50532.0,256.0,0.006786151960784314,443.0,
837,837.0,42265.0,256.0,0.006678921568627451,436.0,
838,838.0,53757.0,256.0,0.006617647058823529,432.0,
839,839.0,56390.0,256.0,0.006954656862745098,454.0,
840,840.0,61517.0,256.0,0.006985294117647059,456.0,
841,841.0,54995.0,256.0,0.007169117647058823,468.0,
842,842.0,51214.0,256.0,0.007383578431372549,482.0,
843,843.0,56309.0,256.0,0.007261029411764706,474.0,
844,844.0,50996.0,256.0,0.007245710784313726,473.0,
845,845.0,52090.0,256.0,0.007398897058823529,483.0,
846,846.0,51816.0,256.0,0.0071384803921568625,466.0,
847,847.0,51093.0,256.0,0.0071844362745098036,469.0,
848,848.0,53399.0,256.0,0.007077205882352941,462.0,
849,849.0,59580.0,256.0,0.007077205882352941,462.0,
850,850.0,52313.0,256.0,0.007306985294117647,477.0,
851,851.0,55953.0,256.0,0.007337622549019608,479.0,
852,852.0,50252.0,256.0,0.007337622549019608,479.0,
853,853.0,62240.0,256.0,0.00744485294117647,486.0,
854,854.0,42318.0,256.0,0.00742953431372549,485.0,
855,855.0,57672.0,256.0,0.0073223039215686275,478.0,
856,856.0,56281.0,256.0,0.00744485294117647,486.0,
857,857.0,51054.0,256.0,0.007169117647058823,468.0,
858,858.0,52085.0,256.0,0.007169117647058823,468.0,
859,859.0,46767.0,256.0,0.0072763480392156864,475.0,
860,860.0,47461.0,256.0,0.007352941176470588,480.0,
861,861.0,50269.0,256.0,0.0071844362745098036,469.0,
862,862.0,45478.0,256.0,0.007261029411764706,474.0,
863,863.0,44371.0,256.0,0.006969975490196079,455.0,
864,864.0,48462.0,256.0,0.006893382352941176,450.0,
865,865.0,50824.0,256.0,0.006816789215686275,445.0,
866,866.0,53199.0,256.0,0.006939338235294117,453.0,
867,867.0,56370.0,256.0,0.0071384803921568625,466.0,
868,868.0,51961.0,256.0,0.006939338235294117,453.0,
869,869.0,49064.0,256.0,0.006924019607843137,452.0,
870,870.0,48512.0,256.0,0.0067248774509803926,439.0,
871,871.0,48466.0,256.0,0.006924019607843137,452.0,
872,872.0,46083.0,256.0,0.006969975490196079,455.0,
873,873.0,51763.0,256.0,0.006985294117647059,456.0,
874,874.0,47828.0,256.0,0.0070006127450980395,457.0,
875,875.0,49762.0,256.0,0.00701593137254902,458.0,
876,876.0,50202.0,256.0,0.007107843137254902,464.0,
877,877.0,55273.0,256.0,0.0071844362745098036,469.0,
878,878.0,47218.0,256.0,0.0071844362745098036,469.0,
879,879.0,49580.0,256.0,0.007169117647058823,468.0,
880,880.0,47265.0,256.0,0.0070006127450980395,457.0,
881,881.0,41428.0,256.0,0.006954656862745098,454.0,
882,882.0,50613.0,256.0,0.006985294117647059,456.0,
883,883.0,47926.0,256.0,0.006878063725490196,449.0,
884,884.0,48820.0,256.0,0.006862745098039216,448.0,
885,885.0,48312.0,256.0,0.006847426470588235,447.0,
886,886.0,49170.0,256.0,0.006954656862745098,454.0,
887,887.0,45945.0,256.0,0.006832107843137255,446.0,
888,888.0,43400.0,256.0,0.006709558823529411,438.0,
889,889.0,44916.0,256.0,0.006755514705882353,441.0,
890,890.0,42200.0,256.0,0.00664828431372549,434.0,
891,891.0,42750.0,256.0,0.006495098039215687,424.0,
892,892.0,44162.0,256.0,0.006372549019607843,416.0,
893,893.0,46752.0,256.0,0.006295955882352941,411.0,
894,894.0,51689.0,256.0,0.006387867647058823,417.0,
895,895.0,43995.0,256.0,0.006403186274509804,418.0,
896,896.0,47910.0,256.0,0.006556372549019608,428.0,
897,897.0,56805.0,256.0,0.006541053921568628,427.0,
898,898.0,40447.0,256.0,0.006556372549019608,428.0,
899,899.0,47276.0,256.0,0.006464460784313725,422.0,
900,900.0,47323.0,256.0,0.00663296568627451,433.0,
901,901.0,48093.0,256.0,0.006587009803921569,430.0,
902,902.0,46767.0,256.0,0.006479779411764706,423.0,
903,903.0,44249.0,256.0,0.00666360294117647,435.0,
904,904.0,50896.0,256.0,0.006541053921568628,427.0,
905,905.0,49761.0,256.0,0.006786151960784314,443.0,
906,906.0,54027.0,256.0,0.0067708333333333336,442.0,
907,907.0,51442.0,256.0,0.006709558823529411,438.0,
908,908.0,50454.0,256.0,0.006985294117647059,456.0,
909,909.0,51466.0,256.0,0.006878063725490196,449.0,
910,910.0,49577.0,256.0,0.006878063725490196,449.0,
911,911.0,47900.0,256.0,0.006832107843137255,446.0,
912,912.0,49362.0,256.0,0.0070465686274509805,460.0,
913,913.0,58660.0,256.0,0.006847426470588235,447.0,
914,914.0,54717.0,256.0,0.006893382352941176,450.0,
915,915.0,51915.0,256.0,0.006924019607843137,452.0,
916,916.0,52499.0,256.0,0.0070465686274509805,460.0,
917,917.0,48777.0,256.0,0.007061887254901961,461.0,
918,918.0,54256.0,256.0,0.007398897058823529,483.0,
919,919.0,56790.0,256.0,0.007398897058823529,483.0,
920,920.0,57690.0,256.0,0.007123161764705882,465.0,
921,921.0,57142.0,256.0,0.007230392156862745,472.0,
922,922.0,52116.0,256.0,0.007077205882352941,462.0,
923,923.0,54705.0,256.0,0.007306985294117647,477.0,
924,924.0,57593.0,256.0,0.007306985294117647,477.0,
925,925.0,56756.0,256.0,0.007398897058823529,483.0,
926,926.0,61279.0,256.0,0.0073682598039215685,481.0,
927,927.0,54029.0,256.0,0.007337622549019608,479.0,
928,928.0,44741.0,256.0,0.0070465686274509805,460.0,
929,929.0,44613.0,256.0,0.006924019607843137,452.0,
930,930.0,49122.0,256.0,0.0070006127450980395,457.0,
931,931.0,51613.0,256.0,0.006801470588235294,444.0,
932,932.0,51370.0,256.0,0.00664828431372549,434.0,
933,933.0,52116.0,256.0,0.006617647058823529,432.0,
934,934.0,50487.0,256.0,0.006464460784313725,422.0,
935,935.0,55631.0,256.0,0.00625,408.0,
936,936.0,51572.0,256.0,0.006357230392156863,415.0,
937,937.0,57978.0,256.0,0.006050857843137255,395.0,
938,938.0,52268.0,256.0,0.005897671568627451,385.0,
939,939.0,59714.0,256.0,0.006004901960784314,392.0,
940,940.0,47427.0,256.0,0.006020220588235294,393.0,
941,941.0,52331.0,256.0,0.006035539215686275,394.0,
942,942.0,47747.0,256.0,0.006387867647058823,417.0,
943,943.0,56138.0,256.0,0.006464460784313725,422.0,
944,944.0,61839.0,256.0,0.006678921568627451,436.0,
945,945.0,52646.0,256.0,0.006678921568627451,436.0,
946,946.0,50029.0,256.0,0.00666360294117647,435.0,
947,947.0,55485.0,256.0,0.0067248774509803926,439.0,
948,948.0,53445.0,256.0,0.006816789215686275,445.0,
949,949.0,63948.0,256.0,0.006908700980392157,451.0,
950,950.0,57442.0,256.0,0.006801470588235294,444.0,
951,951.0,48619.0,256.0,0.006862745098039216,448.0,
952,952.0,57035.0,256.0,0.006908700980392157,451.0,
953,953.0,53868.0,256.0,0.0070465686274509805,460.0,
954,954.0,59349.0,256.0,0.007123161764705882,465.0,
955,955.0,47416.0,256.0,0.007460171568627451,487.0,
956,956.0,56166.0,256.0,0.007306985294117647,477.0,
957,957.0,45740.0,256.0,0.0071844362745098036,469.0,
958,958.0,57671.0,256.0,0.007123161764705882,465.0,
959,959.0,57616.0,256.0,0.007230392156862745,472.0,
960,960.0,50820.0,256.0,0.00703125,459.0,
961,961.0,53015.0,256.0,0.006954656862745098,454.0,
962,962.0,52003.0,256.0,0.006954656862745098,454.0,
963,963.0,61081.0,256.0,0.006832107843137255,446.0,
964,964.0,54869.0,256.0,0.0072763480392156864,475.0,
965,965.0,54742.0,256.0,0.007306985294117647,477.0,
966,966.0,55745.0,256.0,0.007291666666666667,476.0,
967,967.0,57896.0,256.0,0.007521446078431373,491.0,
968,968.0,56208.0,256.0,0.007552083333333333,493.0,
969,969.0,53957.0,256.0,0.007567401960784314,494.0,
970,970.0,52557.0,256.0,0.007398897058823529,483.0,
971,971.0,49533.0,256.0,0.00742953431372549,485.0,
972,972.0,53628.0,256.0,0.007337622549019608,479.0,
973,973.0,55425.0,256.0,0.007490808823529412,489.0,
974,974.0,62940.0,256.0,0.007398897058823529,483.0,
975,975.0,62868.0,256.0,0.007521446078431373,491.0,
976,976.0,62354.0,256.0,0.007521446078431373,491.0,
977,977.0,63787.0,256.0,0.007582720588235294,495.0,
978,978.0,66786.0,256.0,0.007582720588235294,495.0,
979,979.0,67736.0,256.0,0.007904411764705882,516.0,
980,980.0,65737.0,256.0,0.007996323529411764,522.0,
981,981.0,59248.0,256.0,0.007935049019607843,518.0,
982,982.0,60975.0,256.0,0.007965686274509803,520.0,
983,983.0,58100.0,256.0,0.007935049019607843,518.0,
984,984.0,57540.0,256.0,0.007598039215686274,496.0,
985,985.0,46214.0,256.0,0.007552083333333333,493.0,
986,986.0,54985.0,256.0,0.0078125,510.0,
987,987.0,55751.0,256.0,0.007506127450980392,490.0,
988,988.0,62663.0,256.0,0.00744485294117647,486.0,
989,989.0,55954.0,256.0,0.0073223039215686275,478.0,
990,990.0,51029.0,256.0,0.0073682598039215685,481.0,
991,991.0,58027.0,256.0,0.007153799019607843,467.0,
992,992.0,63520.0,256.0,0.00703125,459.0,
993,993.0,66711.0,256.0,0.007215073529411765,471.0,
994,994.0,53335.0,256.0,0.007245710784313726,473.0,
995,995.0,64917.0,256.0,0.0072763480392156864,475.0,
996,996.0,49346.0,256.0,0.007245710784313726,473.0,
997,997.0,53386.0,256.0,0.0073682598039215685,481.0,
998,998.0,56505.0,256.0,0.007552083333333333,493.0,
999,999.0,56868.0,256.0,0.007582720588235294,495.0,
