0,0.0,0.0,256.0,0.0015931372549019608,104.0,
1,1.0,5806.0,256.0,0.0016850490196078432,110.0,
2,2.0,5819.0,256.0,0.0017616421568627451,115.0,
3,3.0,4577.0,256.0,0.0017310049019607842,113.0,
4,4.0,5733.0,256.0,0.0017310049019607842,113.0,
5,5.0,4801.0,256.0,0.0016544117647058823,108.0,
6,6.0,5413.0,256.0,0.0016237745098039217,106.0,
7,7.0,6369.0,256.0,0.0016697303921568627,109.0,
8,8.0,6676.0,256.0,0.0017922794117647058,117.0,
9,9.0,5528.0,256.0,0.0017616421568627451,115.0,
10,10.0,5181.0,256.0,0.0017310049019607842,113.0,
11,11.0,5974.0,256.0,0.0017922794117647058,117.0,
12,12.0,6690.0,256.0,0.0019301470588235295,126.0,
13,13.0,7973.0,256.0,0.0019301470588235295,126.0,
14,14.0,8117.0,256.0,0.00196078431372549,128.0,
15,15.0,10694.0,256.0,0.002006740196078431,131.0,
16,16.0,9782.0,256.0,0.002068014705882353,135.0,
17,17.0,9039.0,256.0,0.0020986519607843136,137.0,
18,18.0,6602.0,256.0,0.002113970588235294,138.0,
19,19.0,9490.0,256.0,0.002190563725490196,143.0,
20,20.0,11029.0,256.0,0.002236519607843137,146.0,
21,21.0,9500.0,256.0,0.0022058823529411764,144.0,
22,22.0,10378.0,256.0,0.0022212009803921568,145.0,
23,23.0,7234.0,256.0,0.002236519607843137,146.0,
24,24.0,6617.0,256.0,0.0022212009803921568,145.0,
25,25.0,8146.0,256.0,0.002420343137254902,158.0,
26,26.0,9202.0,256.0,0.002542892156862745,166.0,
27,27.0,9746.0,256.0,0.0024509803921568627,160.0,
28,28.0,10511.0,256.0,0.0025122549019607845,164.0,
29,29.0,11638.0,256.0,0.002527573529411765,165.0,
30,30.0,10396.0,256.0,0.002542892156862745,166.0,
31,31.0,11491.0,256.0,0.0027113970588235293,177.0,
32,32.0,9956.0,256.0,0.00274203431372549,179.0,
33,33.0,11441.0,256.0,0.00274203431372549,179.0,
34,34.0,9729.0,256.0,0.002573529411764706,168.0,
35,35.0,12619.0,256.0,0.0026807598039215686,175.0,
36,36.0,12314.0,256.0,0.002772671568627451,181.0,
37,37.0,12494.0,256.0,0.0028339460784313725,185.0,
38,38.0,11497.0,256.0,0.002772671568627451,181.0,
39,39.0,11361.0,256.0,0.0027879901960784314,182.0,
40,40.0,12315.0,256.0,0.0028339460784313725,185.0,
41,41.0,9771.0,256.0,0.002864583333333333,187.0,
42,42.0,10097.0,256.0,0.0028952205882352942,189.0,
43,43.0,11044.0,256.0,0.003002450980392157,196.0,
44,44.0,11954.0,256.0,0.002971813725490196,194.0,
45,45.0,10963.0,256.0,0.002971813725490196,194.0,
46,46.0,11107.0,256.0,0.0029411764705882353,192.0,
47,47.0,12178.0,256.0,0.0028952205882352942,189.0,
48,48.0,10565.0,256.0,0.0028033088235294118,183.0,
49,49.0,11580.0,256.0,0.002818627450980392,184.0,
50,50.0,10988.0,256.0,0.002864583333333333,187.0,
51,51.0,10428.0,256.0,0.0029564950980392156,193.0,
52,52.0,12439.0,256.0,0.002925857843137255,191.0,
53,53.0,13247.0,256.0,0.0030637254901960784,200.0,
54,54.0,13795.0,256.0,0.0031403186274509805,205.0,
55,55.0,14468.0,256.0,0.003324142156862745,217.0,
56,56.0,13227.0,256.0,0.0033394607843137253,218.0,
57,57.0,12685.0,256.0,0.0032935049019607843,215.0,
58,58.0,15123.0,256.0,0.003324142156862745,217.0,
59,59.0,16150.0,256.0,0.003477328431372549,227.0,
60,60.0,19292.0,256.0,0.003553921568627451,232.0,
61,61.0,16991.0,256.0,0.0036151960784313727,236.0,
62,62.0,19238.0,256.0,0.003630514705882353,237.0,
63,63.0,16653.0,256.0,0.003722426470588235,243.0,
64,64.0,15124.0,256.0,0.0037683823529411765,246.0,
65,65.0,15996.0,256.0,0.0038143382352941175,249.0,
66,66.0,15131.0,256.0,0.0036917892156862744,241.0,
67,67.0,15747.0,256.0,0.0036917892156862744,241.0,
68,68.0,12151.0,256.0,0.003753063725490196,245.0,
69,69.0,14039.0,256.0,0.003737745098039216,244.0,
70,70.0,13809.0,256.0,0.003753063725490196,245.0,
71,71.0,13506.0,256.0,0.003753063725490196,245.0,
72,72.0,20579.0,256.0,0.003783700980392157,247.0,
73,73.0,18868.0,256.0,0.0038909313725490197,254.0,
74,74.0,16776.0,256.0,0.003799019607843137,248.0,
75,75.0,14486.0,256.0,0.003936887254901961,257.0,
76,76.0,18916.0,256.0,0.004028799019607844,263.0,
77,77.0,16974.0,256.0,0.003982843137254902,260.0,
78,78.0,17851.0,256.0,0.004013480392156862,262.0,
79,79.0,18525.0,256.0,0.003952205882352941,258.0,
80,80.0,20629.0,256.0,0.00392156862745098,256.0,
81,81.0,20250.0,256.0,0.003860294117647059,252.0,
82,82.0,17184.0,256.0,0.0038756127450980393,253.0,
83,83.0,16523.0,256.0,0.0038756127450980393,253.0,
84,84.0,17296.0,256.0,0.003844975490196078,251.0,
85,85.0,20556.0,256.0,0.00392156862745098,256.0,
86,86.0,19907.0,256.0,0.003952205882352941,258.0,
87,87.0,15908.0,256.0,0.003967524509803921,259.0,
88,88.0,16685.0,256.0,0.004028799019607844,263.0,
89,89.0,17486.0,256.0,0.004090073529411765,267.0,
90,90.0,13290.0,256.0,0.003967524509803921,259.0,
91,91.0,16684.0,256.0,0.004136029411764706,270.0,
92,92.0,13068.0,256.0,0.004197303921568627,274.0,
93,93.0,14962.0,256.0,0.00428921568627451,280.0,
94,94.0,14649.0,256.0,0.004227941176470588,276.0,
95,95.0,15752.0,256.0,0.004166666666666667,272.0,
96,96.0,14762.0,256.0,0.004090073529411765,267.0,
97,97.0,13042.0,256.0,0.004074754901960785,266.0,
98,98.0,15586.0,256.0,0.004028799019607844,263.0,
99,99.0,16194.0,256.0,0.00392156862745098,256.0,
100,100.0,17450.0,256.0,0.0038909313725490197,254.0,
101,101.0,14262.0,256.0,0.003676470588235294,240.0,
102,102.0,14062.0,256.0,0.003753063725490196,245.0,
103,103.0,14343.0,256.0,0.003783700980392157,247.0,
104,104.0,16407.0,256.0,0.003676470588235294,240.0,
105,105.0,12357.0,256.0,0.003722426470588235,243.0,
106,106.0,14921.0,256.0,0.0036611519607843137,239.0,
107,107.0,17217.0,256.0,0.0035845588235294116,234.0,
108,108.0,16237.0,256.0,0.0037071078431372547,242.0,
109,109.0,13785.0,256.0,0.003630514705882353,237.0,
110,110.0,13803.0,256.0,0.0035232843137254903,230.0,
111,111.0,12223.0,256.0,0.0037071078431372547,242.0,
112,112.0,14832.0,256.0,0.0036917892156862744,241.0,
113,113.0,17583.0,256.0,0.003829656862745098,250.0,
114,114.0,16824.0,256.0,0.003844975490196078,251.0,
115,115.0,13476.0,256.0,0.003936887254901961,257.0,
116,116.0,18571.0,256.0,0.004074754901960785,266.0,
117,117.0,20972.0,256.0,0.004136029411764706,270.0,
118,118.0,18694.0,256.0,0.004028799019607844,263.0,
119,119.0,18356.0,256.0,0.004074754901960785,266.0,
120,120.0,15150.0,256.0,0.003982843137254902,260.0,
121,121.0,14900.0,256.0,0.004059436274509804,265.0,
122,122.0,17548.0,256.0,0.004028799019607844,263.0,
123,123.0,13444.0,256.0,0.004044117647058824,264.0,
124,124.0,18425.0,256.0,0.004151348039215686,271.0,
125,125.0,17244.0,256.0,0.004105392156862745,268.0,
126,126.0,19044.0,256.0,0.004166666666666667,272.0,
127,127.0,19047.0,256.0,0.004151348039215686,271.0,
128,128.0,19281.0,256.0,0.004243259803921568,277.0,
129,129.0,18544.0,256.0,0.0043504901960784315,284.0,
130,130.0,23508.0,256.0,0.0045802696078431375,299.0,
131,131.0,21673.0,256.0,0.004595588235294118,300.0,
132,132.0,23117.0,256.0,0.0046721813725490195,305.0,
133,133.0,23610.0,256.0,0.004810049019607843,314.0,
134,134.0,20992.0,256.0,0.004779411764705883,312.0,
135,135.0,19287.0,256.0,0.004871323529411765,318.0,
136,136.0,22818.0,256.0,0.004886642156862745,319.0,
137,137.0,22032.0,256.0,0.004794730392156863,313.0,
138,138.0,21597.0,256.0,0.004917279411764706,321.0,
139,139.0,20657.0,256.0,0.0049938725490196074,326.0,
140,140.0,20784.0,256.0,0.004856004901960784,317.0,
141,141.0,19311.0,256.0,0.004764093137254902,311.0,
142,142.0,17188.0,256.0,0.004748774509803921,310.0,
143,143.0,19692.0,256.0,0.004825367647058824,315.0,
144,144.0,19919.0,256.0,0.0046875,306.0,
145,145.0,21703.0,256.0,0.0046721813725490195,305.0,
146,146.0,18857.0,256.0,0.0046262254901960785,302.0,
147,147.0,18275.0,256.0,0.004564950980392157,298.0,
148,148.0,16758.0,256.0,0.0045802696078431375,299.0,
149,149.0,17532.0,256.0,0.0046875,306.0,
150,150.0,17831.0,256.0,0.0046721813725490195,305.0,
151,151.0,15881.0,256.0,0.004610906862745098,301.0,
152,152.0,18082.0,256.0,0.0045802696078431375,299.0,
153,153.0,16082.0,256.0,0.0045343137254901964,296.0,
154,154.0,16060.0,256.0,0.004473039215686274,292.0,
155,155.0,21182.0,256.0,0.0043964460784313725,287.0,
156,156.0,15998.0,256.0,0.00428921568627451,280.0,
157,157.0,16103.0,256.0,0.004365808823529412,285.0,
158,158.0,19042.0,256.0,0.004457720588235294,291.0,
159,159.0,22466.0,256.0,0.004473039215686274,292.0,
160,160.0,20944.0,256.0,0.0043504901960784315,284.0,
161,161.0,16079.0,256.0,0.004335171568627451,283.0,
162,162.0,12799.0,256.0,0.0043045343137254905,281.0,
163,163.0,14411.0,256.0,0.004319852941176471,282.0,
164,164.0,17038.0,256.0,0.0043964460784313725,287.0,
165,165.0,17622.0,256.0,0.004212622549019608,275.0,
166,166.0,14969.0,256.0,0.004166666666666667,272.0,
167,167.0,17791.0,256.0,0.004044117647058824,264.0,
168,168.0,15093.0,256.0,0.003998161764705882,261.0,
169,169.0,14272.0,256.0,0.004044117647058824,264.0,
170,170.0,15464.0,256.0,0.004105392156862745,268.0,
171,171.0,17478.0,256.0,0.004136029411764706,270.0,
172,172.0,18093.0,256.0,0.00392156862745098,256.0,
173,173.0,13420.0,256.0,0.003952205882352941,258.0,
174,174.0,19394.0,256.0,0.003967524509803921,259.0,
175,175.0,15069.0,256.0,0.003982843137254902,260.0,
176,176.0,13922.0,256.0,0.004059436274509804,265.0,
177,177.0,16934.0,256.0,0.003952205882352941,258.0,
178,178.0,15132.0,256.0,0.003982843137254902,260.0,
179,179.0,18039.0,256.0,0.004074754901960785,266.0,
180,180.0,14076.0,256.0,0.004044117647058824,264.0,
181,181.0,16120.0,256.0,0.004074754901960785,266.0,
182,182.0,14815.0,256.0,0.004090073529411765,267.0,
183,183.0,17009.0,256.0,0.003982843137254902,260.0,
184,184.0,16804.0,256.0,0.004013480392156862,262.0,
185,185.0,16916.0,256.0,0.004028799019607844,263.0,
186,186.0,20923.0,256.0,0.004074754901960785,266.0,
187,187.0,16440.0,256.0,0.0043504901960784315,284.0,
188,188.0,17542.0,256.0,0.00428921568627451,280.0,
189,189.0,19214.0,256.0,0.0043504901960784315,284.0,
190,190.0,22942.0,256.0,0.0043504901960784315,284.0,
191,191.0,20241.0,256.0,0.004319852941176471,282.0,
192,192.0,20244.0,256.0,0.0045343137254901964,296.0,
193,193.0,20005.0,256.0,0.004656862745098039,304.0,
194,194.0,22649.0,256.0,0.004610906862745098,301.0,
195,195.0,22371.0,256.0,0.004549632352941177,297.0,
196,196.0,16993.0,256.0,0.004595588235294118,300.0,
197,197.0,18857.0,256.0,0.004610906862745098,301.0,
198,198.0,19529.0,256.0,0.0046875,306.0,
199,199.0,21764.0,256.0,0.004503676470588235,294.0,
200,200.0,20031.0,256.0,0.004564950980392157,298.0,
201,201.0,21158.0,256.0,0.004595588235294118,300.0,
202,202.0,23783.0,256.0,0.004656862745098039,304.0,
203,203.0,20800.0,256.0,0.004779411764705883,312.0,
204,204.0,19344.0,256.0,0.004810049019607843,314.0,
205,205.0,20132.0,256.0,0.004748774509803921,310.0,
206,206.0,18941.0,256.0,0.004794730392156863,313.0,
207,207.0,20906.0,256.0,0.004549632352941177,297.0,
208,208.0,17909.0,256.0,0.004610906862745098,301.0,
209,209.0,18867.0,256.0,0.004610906862745098,301.0,
210,210.0,19500.0,256.0,0.0045343137254901964,296.0,
211,211.0,20863.0,256.0,0.004457720588235294,291.0,
212,212.0,17405.0,256.0,0.0043964460784313725,287.0,
213,213.0,18047.0,256.0,0.004411764705882353,288.0,
214,214.0,18233.0,256.0,0.004427083333333333,289.0,
215,215.0,17566.0,256.0,0.0045343137254901964,296.0,
216,216.0,20145.0,256.0,0.004610906862745098,301.0,
217,217.0,19690.0,256.0,0.004641544117647059,303.0,
218,218.0,17414.0,256.0,0.004656862745098039,304.0,
219,219.0,20062.0,256.0,0.0046875,306.0,
220,220.0,18874.0,256.0,0.004610906862745098,301.0,
221,221.0,20773.0,256.0,0.0045802696078431375,299.0,
222,222.0,13799.0,256.0,0.004564950980392157,298.0,
223,223.0,20948.0,256.0,0.004610906862745098,301.0,
224,224.0,17151.0,256.0,0.0045802696078431375,299.0,
225,225.0,16042.0,256.0,0.0045802696078431375,299.0,
226,226.0,18513.0,256.0,0.004641544117647059,303.0,
227,227.0,21507.0,256.0,0.004794730392156863,313.0,
228,228.0,18282.0,256.0,0.0046875,306.0,
229,229.0,23297.0,256.0,0.00470281862745098,307.0,
230,230.0,17593.0,256.0,0.004457720588235294,291.0,
231,231.0,17540.0,256.0,0.004473039215686274,292.0,
232,232.0,16080.0,256.0,0.004365808823529412,285.0,
233,233.0,17465.0,256.0,0.004381127450980392,286.0,
234,234.0,18038.0,256.0,0.0043964460784313725,287.0,
235,235.0,17421.0,256.0,0.004319852941176471,282.0,
236,236.0,17337.0,256.0,0.004227941176470588,276.0,
237,237.0,17857.0,256.0,0.004335171568627451,283.0,
238,238.0,19522.0,256.0,0.004258578431372549,278.0,
239,239.0,21969.0,256.0,0.004151348039215686,271.0,
240,240.0,19935.0,256.0,0.004120710784313726,269.0,
241,241.0,16577.0,256.0,0.003967524509803921,259.0,
242,242.0,15089.0,256.0,0.004044117647058824,264.0,
243,243.0,19389.0,256.0,0.004028799019607844,263.0,
244,244.0,18558.0,256.0,0.004074754901960785,266.0,
245,245.0,17598.0,256.0,0.004059436274509804,265.0,
246,246.0,16423.0,256.0,0.004136029411764706,270.0,
247,247.0,18841.0,256.0,0.004151348039215686,271.0,
248,248.0,16829.0,256.0,0.004166666666666667,272.0,
249,249.0,16520.0,256.0,0.004120710784313726,269.0,
250,250.0,14503.0,256.0,0.003967524509803921,259.0,
251,251.0,14632.0,256.0,0.003860294117647059,252.0,
252,252.0,13027.0,256.0,0.003844975490196078,251.0,
253,253.0,13636.0,256.0,0.003783700980392157,247.0,
254,254.0,14430.0,256.0,0.003753063725490196,245.0,
255,255.0,12305.0,256.0,0.0036611519607843137,239.0,
256,256.0,13914.0,256.0,0.0036151960784313727,236.0,
257,257.0,11383.0,256.0,0.003477328431372549,227.0,
258,258.0,11771.0,256.0,0.0033854166666666668,221.0,
259,259.0,13564.0,256.0,0.003324142156862745,217.0,
260,260.0,12559.0,256.0,0.003278186274509804,214.0,
261,261.0,8722.0,256.0,0.003170955882352941,207.0,
262,262.0,15354.0,256.0,0.0031403186274509805,205.0,
263,263.0,13181.0,256.0,0.003155637254901961,206.0,
264,264.0,15846.0,256.0,0.003155637254901961,206.0,
265,265.0,13318.0,256.0,0.0030637254901960784,200.0,
266,266.0,12626.0,256.0,0.003002450980392157,196.0,
267,267.0,15252.0,256.0,0.0029105392156862746,190.0,
268,268.0,13832.0,256.0,0.00274203431372549,179.0,
269,269.0,13163.0,256.0,0.0026654411764705883,174.0,
270,270.0,12934.0,256.0,0.0026041666666666665,170.0,
271,271.0,11529.0,256.0,0.0025122549019607845,164.0,
272,272.0,12877.0,256.0,0.0026041666666666665,170.0,
273,273.0,13751.0,256.0,0.0025122549019607845,164.0,
274,274.0,15898.0,256.0,0.0025582107843137255,167.0,
275,275.0,11074.0,256.0,0.002527573529411765,165.0,
276,276.0,13134.0,256.0,0.002573529411764706,168.0,
277,277.0,12558.0,256.0,0.002527573529411765,165.0,
278,278.0,13538.0,256.0,0.0025582107843137255,167.0,
279,279.0,13644.0,256.0,0.002527573529411765,165.0,
280,280.0,13470.0,256.0,0.0024969362745098037,163.0,
281,281.0,13599.0,256.0,0.0025122549019607845,164.0,
282,282.0,14864.0,256.0,0.0024356617647058824,159.0,
283,283.0,14812.0,256.0,0.002420343137254902,158.0,
284,284.0,15368.0,256.0,0.0024969362745098037,163.0,
285,285.0,10046.0,256.0,0.0024816176470588234,162.0,
286,286.0,13320.0,256.0,0.002466299019607843,161.0,
287,287.0,11448.0,256.0,0.0024969362745098037,163.0,
288,288.0,15645.0,256.0,0.0024816176470588234,162.0,
289,289.0,16148.0,256.0,0.0026041666666666665,170.0,
290,290.0,14900.0,256.0,0.0025122549019607845,164.0,
291,291.0,16897.0,256.0,0.0024816176470588234,162.0,
292,292.0,15499.0,256.0,0.0024356617647058824,159.0,
293,293.0,15436.0,256.0,0.0024816176470588234,162.0,
294,294.0,15711.0,256.0,0.0024356617647058824,159.0,
295,295.0,16269.0,256.0,0.0024509803921568627,160.0,
296,296.0,12797.0,256.0,0.0024356617647058824,159.0,
297,297.0,14159.0,256.0,0.0025122549019607845,164.0,
298,298.0,17284.0,256.0,0.0024816176470588234,162.0,
299,299.0,14772.0,256.0,0.002420343137254902,158.0,
300,300.0,15437.0,256.0,0.0023743872549019606,155.0,
301,301.0,14432.0,256.0,0.0023897058823529414,156.0,
302,302.0,14997.0,256.0,0.002297794117647059,150.0,
303,303.0,14668.0,256.0,0.0022671568627450982,148.0,
304,304.0,14616.0,256.0,0.0022058823529411764,144.0,
305,305.0,13543.0,256.0,0.0022058823529411764,144.0,
306,306.0,15535.0,256.0,0.002144607843137255,140.0,
307,307.0,13054.0,256.0,0.0020526960784313726,134.0,
308,308.0,16096.0,256.0,0.0020373774509803923,133.0,
309,309.0,16866.0,256.0,0.0020373774509803923,133.0,
310,310.0,17628.0,256.0,0.001991421568627451,130.0,
311,311.0,16774.0,256.0,0.0019301470588235295,126.0,
312,312.0,16571.0,256.0,0.0019454656862745098,127.0,
313,313.0,16854.0,256.0,0.0018535539215686274,121.0,
314,314.0,15871.0,256.0,0.001868872549019608,122.0,
315,315.0,15721.0,256.0,0.0018075980392156864,118.0,
316,316.0,17249.0,256.0,0.0017922794117647058,117.0,
317,317.0,17134.0,256.0,0.0017616421568627451,115.0,
318,318.0,14658.0,256.0,0.0018075980392156864,118.0,
319,319.0,17318.0,256.0,0.0018229166666666667,119.0,
320,320.0,21418.0,256.0,0.0018841911764705883,123.0,
321,321.0,16280.0,256.0,0.0018995098039215686,124.0,
322,322.0,14637.0,256.0,0.001914828431372549,125.0,
323,323.0,19418.0,256.0,0.0019454656862745098,127.0,
324,324.0,20441.0,256.0,0.0020373774509803923,133.0,
325,325.0,17596.0,256.0,0.0020986519607843136,137.0,
326,326.0,20017.0,256.0,0.0020986519607843136,137.0,
327,327.0,17832.0,256.0,0.0019301470588235295,126.0,
328,328.0,17314.0,256.0,0.001991421568627451,130.0,
329,329.0,16082.0,256.0,0.00196078431372549,128.0,
330,330.0,14851.0,256.0,0.00196078431372549,128.0,
331,331.0,17214.0,256.0,0.001991421568627451,130.0,
332,332.0,17500.0,256.0,0.00196078431372549,128.0,
333,333.0,15606.0,256.0,0.001991421568627451,130.0,
334,334.0,19052.0,256.0,0.002068014705882353,135.0,
335,335.0,16954.0,256.0,0.0020373774509803923,133.0,
336,336.0,20324.0,256.0,0.002022058823529412,132.0,
337,337.0,18248.0,256.0,0.002022058823529412,132.0,
338,338.0,19319.0,256.0,0.002022058823529412,132.0,
339,339.0,15715.0,256.0,0.001991421568627451,130.0,
340,340.0,18386.0,256.0,0.0019301470588235295,126.0,
341,341.0,17511.0,256.0,0.001838235294117647,120.0,
342,342.0,17714.0,256.0,0.0018995098039215686,124.0,
343,343.0,21531.0,256.0,0.0018995098039215686,124.0,
344,344.0,18945.0,256.0,0.0018229166666666667,119.0,
345,345.0,18531.0,256.0,0.0017922794117647058,117.0,
346,346.0,19634.0,256.0,0.0018995098039215686,124.0,
347,347.0,21123.0,256.0,0.0019301470588235295,126.0,
348,348.0,20275.0,256.0,0.00196078431372549,128.0,
349,349.0,19496.0,256.0,0.002022058823529412,132.0,
350,350.0,21638.0,256.0,0.0019761029411764705,129.0,
351,351.0,17663.0,256.0,0.002022058823529412,132.0,
352,352.0,20303.0,256.0,0.002022058823529412,132.0,
353,353.0,18653.0,256.0,0.0019454656862745098,127.0,
354,354.0,20898.0,256.0,0.0019454656862745098,127.0,
355,355.0,20000.0,256.0,0.0019761029411764705,129.0,
356,356.0,16890.0,256.0,0.00196078431372549,128.0,
357,357.0,20987.0,256.0,0.001914828431372549,125.0,
358,358.0,21017.0,256.0,0.001914828431372549,125.0,
359,359.0,19202.0,256.0,0.00196078431372549,128.0,
360,360.0,22408.0,256.0,0.0019301470588235295,126.0,
361,361.0,19056.0,256.0,0.0019761029411764705,129.0,
362,362.0,19567.0,256.0,0.0019454656862745098,127.0,
363,363.0,19654.0,256.0,0.0019761029411764705,129.0,
364,364.0,19955.0,256.0,0.0019301470588235295,126.0,
365,365.0,16093.0,256.0,0.00196078431372549,128.0,
366,366.0,19911.0,256.0,0.0020373774509803923,133.0,
367,367.0,18991.0,256.0,0.0019761029411764705,129.0,
368,368.0,19394.0,256.0,0.0020526960784313726,134.0,
369,369.0,19365.0,256.0,0.002068014705882353,135.0,
370,370.0,17035.0,256.0,0.0020986519607843136,137.0,
371,371.0,19473.0,256.0,0.002113970588235294,138.0,
372,372.0,19279.0,256.0,0.002144607843137255,140.0,
373,373.0,22925.0,256.0,0.002144607843137255,140.0,
374,374.0,22508.0,256.0,0.002190563725490196,143.0,
375,375.0,17061.0,256.0,0.0021752450980392158,142.0,
376,376.0,17601.0,256.0,0.0021599264705882354,141.0,
377,377.0,20622.0,256.0,0.0022212009803921568,145.0,
378,378.0,19590.0,256.0,0.0022671568627450982,148.0,
379,379.0,23170.0,256.0,0.0022824754901960786,149.0,
380,380.0,21923.0,256.0,0.0022824754901960786,149.0,
381,381.0,22090.0,256.0,0.0022212009803921568,145.0,
382,382.0,22625.0,256.0,0.002144607843137255,140.0,
383,383.0,20272.0,256.0,0.002144607843137255,140.0,
384,384.0,18688.0,256.0,0.0021292892156862743,139.0,
385,385.0,19132.0,256.0,0.0021292892156862743,139.0,
386,386.0,22326.0,256.0,0.002190563725490196,143.0,
387,387.0,18909.0,256.0,0.002144607843137255,140.0,
388,388.0,19247.0,256.0,0.0021599264705882354,141.0,
389,389.0,20470.0,256.0,0.0021752450980392158,142.0,
390,390.0,22349.0,256.0,0.002144607843137255,140.0,
391,391.0,23726.0,256.0,0.0021752450980392158,142.0,
392,392.0,25008.0,256.0,0.0020986519607843136,137.0,
393,393.0,18720.0,256.0,0.0020833333333333333,136.0,
394,394.0,20341.0,256.0,0.0020526960784313726,134.0,
395,395.0,24266.0,256.0,0.0020986519607843136,137.0,
396,396.0,20085.0,256.0,0.0020526960784313726,134.0,
397,397.0,25468.0,256.0,0.0020526960784313726,134.0,
398,398.0,24648.0,256.0,0.002022058823529412,132.0,
399,399.0,25626.0,256.0,0.001991421568627451,130.0,
400,400.0,21183.0,256.0,0.001991421568627451,130.0,
401,401.0,22022.0,256.0,0.0020526960784313726,134.0,
402,402.0,22277.0,256.0,0.001991421568627451,130.0,
403,403.0,19745.0,256.0,0.0020526960784313726,134.0,
404,404.0,23690.0,256.0,0.0020526960784313726,134.0,
405,405.0,22229.0,256.0,0.002144607843137255,140.0,
406,406.0,23703.0,256.0,0.0021599264705882354,141.0,
407,407.0,24030.0,256.0,0.002068014705882353,135.0,
408,408.0,23370.0,256.0,0.0019761029411764705,129.0,
409,409.0,21803.0,256.0,0.001991421568627451,130.0,
410,410.0,22162.0,256.0,0.0019454656862745098,127.0,
411,411.0,22473.0,256.0,0.001914828431372549,125.0,
412,412.0,21527.0,256.0,0.00196078431372549,128.0,
413,413.0,23276.0,256.0,0.001914828431372549,125.0,
414,414.0,20786.0,256.0,0.002022058823529412,132.0,
415,415.0,24997.0,256.0,0.00196078431372549,128.0,
416,416.0,21893.0,256.0,0.001991421568627451,130.0,
417,417.0,27007.0,256.0,0.001991421568627451,130.0,
418,418.0,22498.0,256.0,0.001991421568627451,130.0,
419,419.0,17046.0,256.0,0.001991421568627451,130.0,
420,420.0,21325.0,256.0,0.0019301470588235295,126.0,
421,421.0,18638.0,256.0,0.00196078431372549,128.0,
422,422.0,21911.0,256.0,0.0019454656862745098,127.0,
423,423.0,21944.0,256.0,0.0019761029411764705,129.0,
424,424.0,21082.0,256.0,0.001991421568627451,130.0,
425,425.0,25088.0,256.0,0.001991421568627451,130.0,
426,426.0,21712.0,256.0,0.0019454656862745098,127.0,
427,427.0,19159.0,256.0,0.001991421568627451,130.0,
428,428.0,24946.0,256.0,0.002006740196078431,131.0,
429,429.0,20708.0,256.0,0.002022058823529412,132.0,
430,430.0,22134.0,256.0,0.00196078431372549,128.0,
431,431.0,19966.0,256.0,0.0019454656862745098,127.0,
432,432.0,20134.0,256.0,0.0019761029411764705,129.0,
433,433.0,22013.0,256.0,0.001914828431372549,125.0,
434,434.0,23945.0,256.0,0.0019454656862745098,127.0,
435,435.0,25186.0,256.0,0.0018841911764705883,123.0,
436,436.0,26328.0,256.0,0.0019301470588235295,126.0,
437,437.0,19244.0,256.0,0.0018841911764705883,123.0,
438,438.0,20000.0,256.0,0.001868872549019608,122.0,
439,439.0,19991.0,256.0,0.0017616421568627451,115.0,
440,440.0,21169.0,256.0,0.0017310049019607842,113.0,
441,441.0,26679.0,256.0,0.0017310049019607842,113.0,
442,442.0,28061.0,256.0,0.001715686274509804,112.0,
443,443.0,25038.0,256.0,0.0017463235294117648,114.0,
444,444.0,22836.0,256.0,0.0017616421568627451,115.0,
445,445.0,27666.0,256.0,0.0017310049019607842,113.0,
446,446.0,23172.0,256.0,0.0016697303921568627,109.0,
447,447.0,22690.0,256.0,0.0016850490196078432,110.0,
448,448.0,28580.0,256.0,0.001715686274509804,112.0,
449,449.0,24438.0,256.0,0.0016544117647058823,108.0,
450,450.0,21036.0,256.0,0.0015778186274509804,103.0,
451,451.0,25237.0,256.0,0.0015931372549019608,104.0,
452,452.0,27210.0,256.0,0.0016237745098039217,106.0,
453,453.0,26550.0,256.0,0.001639093137254902,107.0,
454,454.0,25438.0,256.0,0.0016697303921568627,109.0,
455,455.0,26556.0,256.0,0.0017310049019607842,113.0,
456,456.0,26439.0,256.0,0.0018229166666666667,119.0,
457,457.0,25624.0,256.0,0.001914828431372549,125.0,
458,458.0,26240.0,256.0,0.0018841911764705883,123.0,
459,459.0,24254.0,256.0,0.001991421568627451,130.0,
460,460.0,24649.0,256.0,0.002006740196078431,131.0,
461,461.0,25828.0,256.0,0.001991421568627451,130.0,
462,462.0,21742.0,256.0,0.0019761029411764705,129.0,
463,463.0,24083.0,256.0,0.0019761029411764705,129.0,
464,464.0,24153.0,256.0,0.002006740196078431,131.0,
465,465.0,26443.0,256.0,0.0020373774509803923,133.0,
466,466.0,26295.0,256.0,0.002022058823529412,132.0,
467,467.0,28647.0,256.0,0.0020986519607843136,137.0,
468,468.0,22483.0,256.0,0.002144607843137255,140.0,
469,469.0,29513.0,256.0,0.0022058823529411764,144.0,
470,470.0,27815.0,256.0,0.0021752450980392158,142.0,
471,471.0,26980.0,256.0,0.0021599264705882354,141.0,
472,472.0,25687.0,256.0,0.0021752450980392158,142.0,
473,473.0,22871.0,256.0,0.002190563725490196,143.0,
474,474.0,21718.0,256.0,0.0021752450980392158,142.0,
475,475.0,26463.0,256.0,0.0022518382352941175,147.0,
476,476.0,28783.0,256.0,0.0022671568627450982,148.0,
477,477.0,22446.0,256.0,0.0022671568627450982,148.0,
478,478.0,27514.0,256.0,0.002297794117647059,150.0,
479,479.0,27490.0,256.0,0.0022212009803921568,145.0,
480,480.0,18747.0,256.0,0.0022212009803921568,145.0,
481,481.0,24923.0,256.0,0.0022212009803921568,145.0,
482,482.0,28606.0,256.0,0.002190563725490196,143.0,
483,483.0,30347.0,256.0,0.0022058823529411764,144.0,
484,484.0,27758.0,256.0,0.0022671568627450982,148.0,
485,485.0,27550.0,256.0,0.002236519607843137,146.0,
486,486.0,22746.0,256.0,0.0022212009803921568,145.0,
487,487.0,25162.0,256.0,0.002113970588235294,138.0,
488,488.0,24822.0,256.0,0.0021752450980392158,142.0,
489,489.0,27669.0,256.0,0.002190563725490196,143.0,
490,490.0,25972.0,256.0,0.002144607843137255,140.0,
491,491.0,25588.0,256.0,0.0021292892156862743,139.0,
492,492.0,21434.0,256.0,0.0021599264705882354,141.0,
493,493.0,26759.0,256.0,0.0021292892156862743,139.0,
494,494.0,27957.0,256.0,0.0021599264705882354,141.0,
495,495.0,26813.0,256.0,0.0021599264705882354,141.0,
496,496.0,26088.0,256.0,0.002144607843137255,140.0,
497,497.0,25365.0,256.0,0.0021752450980392158,142.0,
498,498.0,27653.0,256.0,0.0022212009803921568,145.0,
499,499.0,27367.0,256.0,0.0022212009803921568,145.0,
500,500.0,28184.0,256.0,0.002236519607843137,146.0,
501,501.0,30782.0,256.0,0.0021752450980392158,142.0,
502,502.0,24634.0,256.0,0.0021752450980392158,142.0,
503,503.0,24025.0,256.0,0.0021752450980392158,142.0,
504,504.0,20863.0,256.0,0.0022518382352941175,147.0,
505,505.0,25618.0,256.0,0.0022824754901960786,149.0,
506,506.0,26403.0,256.0,0.0022671568627450982,148.0,
507,507.0,23956.0,256.0,0.002190563725490196,143.0,
508,508.0,26152.0,256.0,0.002190563725490196,143.0,
509,509.0,25372.0,256.0,0.002144607843137255,140.0,
510,510.0,28141.0,256.0,0.002144607843137255,140.0,
511,511.0,24767.0,256.0,0.0021752450980392158,142.0,
512,512.0,24924.0,256.0,0.0022058823529411764,144.0,
513,513.0,25635.0,256.0,0.0022212009803921568,145.0,
514,514.0,26968.0,256.0,0.002190563725490196,143.0,
515,515.0,23984.0,256.0,0.0022824754901960786,149.0,
516,516.0,25955.0,256.0,0.0022518382352941175,147.0,
517,517.0,25396.0,256.0,0.0022671568627450982,148.0,
518,518.0,29818.0,256.0,0.0022518382352941175,147.0,
519,519.0,24196.0,256.0,0.0022824754901960786,149.0,
520,520.0,27114.0,256.0,0.0022518382352941175,147.0,
521,521.0,24042.0,256.0,0.002190563725490196,143.0,
522,522.0,20592.0,256.0,0.0022212009803921568,145.0,
523,523.0,25994.0,256.0,0.002144607843137255,140.0,
524,524.0,24183.0,256.0,0.002113970588235294,138.0,
525,525.0,22004.0,256.0,0.002113970588235294,138.0,
526,526.0,26464.0,256.0,0.002144607843137255,140.0,
527,527.0,31612.0,256.0,0.0021599264705882354,141.0,
528,528.0,27307.0,256.0,0.002113970588235294,138.0,
529,529.0,28458.0,256.0,0.0020833333333333333,136.0,
530,530.0,29911.0,256.0,0.002022058823529412,132.0,
531,531.0,27999.0,256.0,0.002006740196078431,131.0,
532,532.0,31945.0,256.0,0.002006740196078431,131.0,
533,533.0,31346.0,256.0,0.0020526960784313726,134.0,
534,534.0,30158.0,256.0,0.0020833333333333333,136.0,
535,535.0,27124.0,256.0,0.0020833333333333333,136.0,
536,536.0,28307.0,256.0,0.002006740196078431,131.0,
537,537.0,33177.0,256.0,0.002068014705882353,135.0,
538,538.0,25062.0,256.0,0.0020833333333333333,136.0,
539,539.0,33465.0,256.0,0.0020986519607843136,137.0,
540,540.0,29367.0,256.0,0.0020833333333333333,136.0,
541,541.0,29506.0,256.0,0.0020526960784313726,134.0,
542,542.0,32707.0,256.0,0.0020986519607843136,137.0,
543,543.0,32461.0,256.0,0.002068014705882353,135.0,
544,544.0,32152.0,256.0,0.0020833333333333333,136.0,
545,545.0,25645.0,256.0,0.0020986519607843136,137.0,
546,546.0,24084.0,256.0,0.0021292892156862743,139.0,
547,547.0,26548.0,256.0,0.0021292892156862743,139.0,
548,548.0,32905.0,256.0,0.0021292892156862743,139.0,
549,549.0,29503.0,256.0,0.0020986519607843136,137.0,
550,550.0,23628.0,256.0,0.002113970588235294,138.0,
551,551.0,24947.0,256.0,0.0020373774509803923,133.0,
552,552.0,28177.0,256.0,0.002190563725490196,143.0,
553,553.0,33401.0,256.0,0.002190563725490196,143.0,
554,554.0,29780.0,256.0,0.0020833333333333333,136.0,
555,555.0,25956.0,256.0,0.002068014705882353,135.0,
556,556.0,27501.0,256.0,0.0020526960784313726,134.0,
557,557.0,29028.0,256.0,0.0020526960784313726,134.0,
558,558.0,28188.0,256.0,0.002113970588235294,138.0,
559,559.0,25569.0,256.0,0.001991421568627451,130.0,
560,560.0,21452.0,256.0,0.001991421568627451,130.0,
561,561.0,27589.0,256.0,0.00196078431372549,128.0,
562,562.0,26444.0,256.0,0.0019454656862745098,127.0,
563,563.0,29994.0,256.0,0.0019761029411764705,129.0,
564,564.0,31295.0,256.0,0.0020526960784313726,134.0,
565,565.0,29095.0,256.0,0.002006740196078431,131.0,
566,566.0,28601.0,256.0,0.001991421568627451,130.0,
567,567.0,29834.0,256.0,0.001868872549019608,122.0,
568,568.0,30524.0,256.0,0.001914828431372549,125.0,
569,569.0,38867.0,256.0,0.0019301470588235295,126.0,
570,570.0,31852.0,256.0,0.001914828431372549,125.0,
571,571.0,27521.0,256.0,0.001991421568627451,130.0,
572,572.0,29567.0,256.0,0.0019454656862745098,127.0,
573,573.0,30349.0,256.0,0.0019301470588235295,126.0,
574,574.0,30391.0,256.0,0.0019761029411764705,129.0,
575,575.0,32769.0,256.0,0.00196078431372549,128.0,
576,576.0,31044.0,256.0,0.0019301470588235295,126.0,
577,577.0,24699.0,256.0,0.0020373774509803923,133.0,
578,578.0,32525.0,256.0,0.0019761029411764705,129.0,
579,579.0,25945.0,256.0,0.002022058823529412,132.0,
580,580.0,36955.0,256.0,0.0020373774509803923,133.0,
581,581.0,31564.0,256.0,0.002068014705882353,135.0,
582,582.0,29688.0,256.0,0.0020833333333333333,136.0,
583,583.0,33691.0,256.0,0.0020526960784313726,134.0,
584,584.0,29922.0,256.0,0.0020986519607843136,137.0,
585,585.0,34863.0,256.0,0.0020986519607843136,137.0,
586,586.0,31683.0,256.0,0.002068014705882353,135.0,
587,587.0,33071.0,256.0,0.0021599264705882354,141.0,
588,588.0,29747.0,256.0,0.0021752450980392158,142.0,
589,589.0,32420.0,256.0,0.0021292892156862743,139.0,
590,590.0,28907.0,256.0,0.0022212009803921568,145.0,
591,591.0,31820.0,256.0,0.0022824754901960786,149.0,
592,592.0,31563.0,256.0,0.00234375,153.0,
593,593.0,27980.0,256.0,0.0023131127450980392,151.0,
594,594.0,24265.0,256.0,0.0022824754901960786,149.0,
595,595.0,26883.0,256.0,0.0022824754901960786,149.0,
596,596.0,28448.0,256.0,0.002236519607843137,146.0,
597,597.0,28387.0,256.0,0.0022671568627450982,148.0,
598,598.0,30994.0,256.0,0.0021752450980392158,142.0,
599,599.0,28897.0,256.0,0.0021752450980392158,142.0,
600,600.0,26971.0,256.0,0.0021599264705882354,141.0,
601,601.0,28625.0,256.0,0.0020986519607843136,137.0,
602,602.0,24740.0,256.0,0.0021752450980392158,142.0,
603,603.0,35916.0,256.0,0.0022518382352941175,147.0,
604,604.0,32502.0,256.0,0.0022671568627450982,148.0,
605,605.0,36676.0,256.0,0.0022824754901960786,149.0,
606,606.0,29723.0,256.0,0.002236519607843137,146.0,
607,607.0,30967.0,256.0,0.0021599264705882354,141.0,
608,608.0,33275.0,256.0,0.002144607843137255,140.0,
609,609.0,29863.0,256.0,0.002190563725490196,143.0,
610,610.0,34184.0,256.0,0.002236519607843137,146.0,
611,611.0,26952.0,256.0,0.0022671568627450982,148.0,
612,612.0,30581.0,256.0,0.00234375,153.0,
613,613.0,32779.0,256.0,0.002297794117647059,150.0,
614,614.0,30054.0,256.0,0.0023590686274509803,154.0,
615,615.0,30943.0,256.0,0.0024356617647058824,159.0,
616,616.0,29156.0,256.0,0.002420343137254902,158.0,
617,617.0,33345.0,256.0,0.0024969362745098037,163.0,
618,618.0,35392.0,256.0,0.0026041666666666665,170.0,
619,619.0,29349.0,256.0,0.0026654411764705883,174.0,
620,620.0,29754.0,256.0,0.0027113970588235293,177.0,
621,621.0,35152.0,256.0,0.0027267156862745097,178.0,
622,622.0,36048.0,256.0,0.002696078431372549,176.0,
623,623.0,34726.0,256.0,0.002588848039215686,169.0,
624,624.0,34189.0,256.0,0.002542892156862745,166.0,
625,625.0,31663.0,256.0,0.0025582107843137255,167.0,
626,626.0,33508.0,256.0,0.002542892156862745,166.0,
627,627.0,35743.0,256.0,0.002542892156862745,166.0,
628,628.0,37883.0,256.0,0.002573529411764706,168.0,
629,629.0,33995.0,256.0,0.002588848039215686,169.0,
630,630.0,36558.0,256.0,0.0026807598039215686,175.0,
631,631.0,37971.0,256.0,0.002696078431372549,176.0,
632,632.0,35758.0,256.0,0.0026807598039215686,175.0,
633,633.0,40213.0,256.0,0.0026654411764705883,174.0,
634,634.0,33032.0,256.0,0.0028033088235294118,183.0,
635,635.0,31872.0,256.0,0.0028033088235294118,183.0,
636,636.0,35346.0,256.0,0.0027879901960784314,182.0,
637,637.0,35491.0,256.0,0.002818627450980392,184.0,
638,638.0,33165.0,256.0,0.0028952205882352942,189.0,
639,639.0,33762.0,256.0,0.0028952205882352942,189.0,
640,640.0,34955.0,256.0,0.002879901960784314,188.0,
641,641.0,34787.0,256.0,0.0028339460784313725,185.0,
642,642.0,31367.0,256.0,0.0027879901960784314,182.0,
643,643.0,35060.0,256.0,0.0028033088235294118,183.0,
644,644.0,37849.0,256.0,0.002696078431372549,176.0,
645,645.0,35044.0,256.0,0.0027113970588235293,177.0,
646,646.0,34727.0,256.0,0.002650122549019608,173.0,
647,647.0,36653.0,256.0,0.002849264705882353,186.0,
648,648.0,38840.0,256.0,0.002971813725490196,194.0,
649,649.0,37951.0,256.0,0.002925857843137255,191.0,
650,650.0,36038.0,256.0,0.002879901960784314,188.0,
651,651.0,36956.0,256.0,0.002925857843137255,191.0,
652,652.0,26212.0,256.0,0.0029564950980392156,193.0,
653,653.0,37947.0,256.0,0.0029871323529411763,195.0,
654,654.0,30962.0,256.0,0.0030177696078431374,197.0,
655,655.0,39947.0,256.0,0.0031096813725490194,203.0,
656,656.0,34414.0,256.0,0.003170955882352941,207.0,
657,657.0,33253.0,256.0,0.003170955882352941,207.0,
658,658.0,33303.0,256.0,0.003125,204.0,
659,659.0,37369.0,256.0,0.0031096813725490194,203.0,
660,660.0,39501.0,256.0,0.0030790441176470587,201.0,
661,661.0,35542.0,256.0,0.0031862745098039215,208.0,
662,662.0,44413.0,256.0,0.0031862745098039215,208.0,
663,663.0,38656.0,256.0,0.003216911764705882,210.0,
664,664.0,31209.0,256.0,0.0032475490196078433,212.0,
665,665.0,32525.0,256.0,0.0033088235294117647,216.0,
666,666.0,41224.0,256.0,0.0033088235294117647,216.0,
667,667.0,40347.0,256.0,0.0033700980392156864,220.0,
668,668.0,30004.0,256.0,0.0033394607843137253,218.0,
669,669.0,36066.0,256.0,0.0032322303921568625,211.0,
670,670.0,32287.0,256.0,0.0032935049019607843,215.0,
671,671.0,37574.0,256.0,0.003278186274509804,214.0,
672,672.0,35223.0,256.0,0.003324142156862745,217.0,
673,673.0,32485.0,256.0,0.0033394607843137253,218.0,
674,674.0,39900.0,256.0,0.0031862745098039215,208.0,
675,675.0,30393.0,256.0,0.0032475490196078433,212.0,
676,676.0,37769.0,256.0,0.003170955882352941,207.0,
677,677.0,29527.0,256.0,0.0031862745098039215,208.0,
678,678.0,32267.0,256.0,0.0031096813725490194,203.0,
679,679.0,41530.0,256.0,0.003094362745098039,202.0,
680,680.0,33513.0,256.0,0.0031403186274509805,205.0,
681,681.0,33589.0,256.0,0.003155637254901961,206.0,
682,682.0,30498.0,256.0,0.003170955882352941,207.0,
683,683.0,35297.0,256.0,0.003155637254901961,206.0,
684,684.0,37728.0,256.0,0.003155637254901961,206.0,
685,685.0,33565.0,256.0,0.003324142156862745,217.0,
686,686.0,36061.0,256.0,0.0033547794117647057,219.0,
687,687.0,39293.0,256.0,0.0034620098039215685,226.0,
688,688.0,40779.0,256.0,0.0033700980392156864,220.0,
689,689.0,35355.0,256.0,0.003400735294117647,222.0,
690,690.0,36660.0,256.0,0.0033547794117647057,219.0,
691,691.0,37542.0,256.0,0.003400735294117647,222.0,
692,692.0,32944.0,256.0,0.0033394607843137253,218.0,
693,693.0,31068.0,256.0,0.0033547794117647057,219.0,
694,694.0,37889.0,256.0,0.0033394607843137253,218.0,
695,695.0,38033.0,256.0,0.003324142156862745,217.0,
696,696.0,34920.0,256.0,0.003477328431372549,227.0,
697,697.0,37029.0,256.0,0.0033854166666666668,221.0,
698,698.0,41612.0,256.0,0.0033700980392156864,220.0,
699,699.0,37776.0,256.0,0.0033854166666666668,221.0,
700,700.0,41019.0,256.0,0.0034926470588235296,228.0,
701,701.0,38305.0,256.0,0.0035386029411764706,231.0,
702,702.0,39945.0,256.0,0.0035845588235294116,234.0,
703,703.0,34957.0,256.0,0.0035845588235294116,234.0,
704,704.0,26671.0,256.0,0.0035386029411764706,231.0,
705,705.0,33720.0,256.0,0.003477328431372549,227.0,
706,706.0,37691.0,256.0,0.0034160539215686275,223.0,
707,707.0,30819.0,256.0,0.003431372549019608,224.0,
708,708.0,29058.0,256.0,0.003431372549019608,224.0,
709,709.0,41102.0,256.0,0.0034160539215686275,223.0,
710,710.0,34229.0,256.0,0.003446691176470588,225.0,
711,711.0,31379.0,256.0,0.003446691176470588,225.0,
712,712.0,29886.0,256.0,0.003431372549019608,224.0,
713,713.0,38012.0,256.0,0.003431372549019608,224.0,
714,714.0,32581.0,256.0,0.003446691176470588,225.0,
715,715.0,36475.0,256.0,0.0035845588235294116,234.0,
716,716.0,35882.0,256.0,0.003553921568627451,232.0,
717,717.0,38490.0,256.0,0.003553921568627451,232.0,
718,718.0,32304.0,256.0,0.0035845588235294116,234.0,
719,719.0,37231.0,256.0,0.003553921568627451,232.0,
720,720.0,34066.0,256.0,0.003553921568627451,232.0,
721,721.0,33508.0,256.0,0.0036151960784313727,236.0,
722,722.0,29780.0,256.0,0.0036458333333333334,238.0,
723,723.0,33210.0,256.0,0.0036611519607843137,239.0,
724,724.0,38628.0,256.0,0.003630514705882353,237.0,
725,725.0,32665.0,256.0,0.003630514705882353,237.0,
726,726.0,39243.0,256.0,0.003783700980392157,247.0,
727,727.0,32148.0,256.0,0.0037071078431372547,242.0,
728,728.0,30341.0,256.0,0.003599877450980392,235.0,
729,729.0,31878.0,256.0,0.003553921568627451,232.0,
730,730.0,35999.0,256.0,0.003553921568627451,232.0,
731,731.0,33534.0,256.0,0.003553921568627451,232.0,
732,732.0,33281.0,256.0,0.0035845588235294116,234.0,
733,733.0,33782.0,256.0,0.0034926470588235296,228.0,
734,734.0,29097.0,256.0,0.003431372549019608,224.0,
735,735.0,33137.0,256.0,0.0033700980392156864,220.0,
736,736.0,37651.0,256.0,0.00350796568627451,229.0,
737,737.0,34320.0,256.0,0.0035386029411764706,231.0,
738,738.0,30592.0,256.0,0.003553921568627451,232.0,
739,739.0,36633.0,256.0,0.0036458333333333334,238.0,
740,740.0,33927.0,256.0,0.003753063725490196,245.0,
741,741.0,32322.0,256.0,0.003799019607843137,248.0,
742,742.0,33345.0,256.0,0.003799019607843137,248.0,
743,743.0,35062.0,256.0,0.0038756127450980393,253.0,
744,744.0,29517.0,256.0,0.003860294117647059,252.0,
745,745.0,35855.0,256.0,0.003860294117647059,252.0,
746,746.0,35580.0,256.0,0.0038756127450980393,253.0,
747,747.0,31961.0,256.0,0.003860294117647059,252.0,
748,748.0,30180.0,256.0,0.0036151960784313727,236.0,
749,749.0,36764.0,256.0,0.0036611519607843137,239.0,
750,750.0,37235.0,256.0,0.003722426470588235,243.0,
751,751.0,39172.0,256.0,0.003753063725490196,245.0,
752,752.0,37618.0,256.0,0.003737745098039216,244.0,
753,753.0,36773.0,256.0,0.0036917892156862744,241.0,
754,754.0,38475.0,256.0,0.0036917892156862744,241.0,
755,755.0,36431.0,256.0,0.0036611519607843137,239.0,
756,756.0,30643.0,256.0,0.0035386029411764706,231.0,
757,757.0,29253.0,256.0,0.0035232843137254903,230.0,
758,758.0,40133.0,256.0,0.003676470588235294,240.0,
759,759.0,34643.0,256.0,0.0036458333333333334,238.0,
760,760.0,32620.0,256.0,0.0037071078431372547,242.0,
761,761.0,29217.0,256.0,0.003737745098039216,244.0,
762,762.0,33885.0,256.0,0.0036611519607843137,239.0,
763,763.0,33777.0,256.0,0.0035845588235294116,234.0,
764,764.0,34468.0,256.0,0.0035845588235294116,234.0,
765,765.0,36061.0,256.0,0.003630514705882353,237.0,
766,766.0,35734.0,256.0,0.003630514705882353,237.0,
767,767.0,38936.0,256.0,0.003599877450980392,235.0,
768,768.0,31934.0,256.0,0.0034926470588235296,228.0,
769,769.0,37667.0,256.0,0.0034926470588235296,228.0,
770,770.0,35486.0,256.0,0.0034620098039215685,226.0,
771,771.0,38783.0,256.0,0.003477328431372549,227.0,
772,772.0,36541.0,256.0,0.003599877450980392,235.0,
773,773.0,38250.0,256.0,0.003630514705882353,237.0,
774,774.0,38144.0,256.0,0.003722426470588235,243.0,
775,775.0,39470.0,256.0,0.003630514705882353,237.0,
776,776.0,42413.0,256.0,0.0035692401960784313,233.0,
777,777.0,34379.0,256.0,0.0036611519607843137,239.0,
778,778.0,42629.0,256.0,0.0037071078431372547,242.0,
779,779.0,35527.0,256.0,0.0036458333333333334,238.0,
780,780.0,39955.0,256.0,0.003553921568627451,232.0,
781,781.0,34946.0,256.0,0.003599877450980392,235.0,
782,782.0,34708.0,256.0,0.0036458333333333334,238.0,
783,783.0,38149.0,256.0,0.0036458333333333334,238.0,
784,784.0,36715.0,256.0,0.0036458333333333334,238.0,
785,785.0,35717.0,256.0,0.0036151960784313727,236.0,
786,786.0,37500.0,256.0,0.003553921568627451,232.0,
787,787.0,32932.0,256.0,0.003599877450980392,235.0,
788,788.0,38361.0,256.0,0.003630514705882353,237.0,
789,789.0,39139.0,256.0,0.0036458333333333334,238.0,
790,790.0,43072.0,256.0,0.0035692401960784313,233.0,
791,791.0,39979.0,256.0,0.003599877450980392,235.0,
792,792.0,43751.0,256.0,0.003676470588235294,240.0,
793,793.0,39059.0,256.0,0.003737745098039216,244.0,
794,794.0,35104.0,256.0,0.003737745098039216,244.0,
795,795.0,32753.0,256.0,0.0038143382352941175,249.0,
796,796.0,37069.0,256.0,0.003860294117647059,252.0,
797,797.0,40040.0,256.0,0.0038909313725490197,254.0,
798,798.0,37436.0,256.0,0.003844975490196078,251.0,
799,799.0,35681.0,256.0,0.003737745098039216,244.0,
800,800.0,37369.0,256.0,0.003676470588235294,240.0,
801,801.0,40552.0,256.0,0.003737745098039216,244.0,
802,802.0,42279.0,256.0,0.0038756127450980393,253.0,
803,803.0,39150.0,256.0,0.003952205882352941,258.0,
804,804.0,40322.0,256.0,0.004044117647058824,264.0,
805,805.0,37398.0,256.0,0.003936887254901961,257.0,
806,806.0,38584.0,256.0,0.004013480392156862,262.0,
807,807.0,39457.0,256.0,0.004074754901960785,266.0,
808,808.0,42673.0,256.0,0.004212622549019608,275.0,
809,809.0,40197.0,256.0,0.004136029411764706,270.0,
810,810.0,33929.0,256.0,0.004181985294117647,273.0,
811,811.0,31704.0,256.0,0.004181985294117647,273.0,
812,812.0,44275.0,256.0,0.004090073529411765,267.0,
813,813.0,35470.0,256.0,0.004136029411764706,270.0,
814,814.0,40827.0,256.0,0.004028799019607844,263.0,
815,815.0,37590.0,256.0,0.004044117647058824,264.0,
816,816.0,38960.0,256.0,0.003998161764705882,261.0,
817,817.0,35051.0,256.0,0.004105392156862745,268.0,
818,818.0,44641.0,256.0,0.003998161764705882,261.0,
819,819.0,42496.0,256.0,0.004166666666666667,272.0,
820,820.0,35478.0,256.0,0.004212622549019608,275.0,
821,821.0,43675.0,256.0,0.004227941176470588,276.0,
822,822.0,35881.0,256.0,0.004197303921568627,274.0,
823,823.0,41948.0,256.0,0.004243259803921568,277.0,
824,824.0,44479.0,256.0,0.00428921568627451,280.0,
825,825.0,43136.0,256.0,0.004335171568627451,283.0,
826,826.0,44942.0,256.0,0.004151348039215686,271.0,
827,827.0,39317.0,256.0,0.004227941176470588,276.0,
828,828.0,37331.0,256.0,0.004181985294117647,273.0,
829,829.0,39638.0,256.0,0.004197303921568627,274.0,
830,830.0,44159.0,256.0,0.0043045343137254905,281.0,
831,831.0,41787.0,256.0,0.0043964460784313725,287.0,
832,832.0,41532.0,256.0,0.004381127450980392,286.0,
833,833.0,36660.0,256.0,0.004335171568627451,283.0,
834,834.0,40498.0,256.0,0.004197303921568627,274.0,
835,835.0,45290.0,256.0,0.004166666666666667,272.0,
836,836.0,36779.0,256.0,0.004166666666666667,272.0,
837,837.0,44044.0,256.0,0.004335171568627451,283.0,
838,838.0,43970.0,256.0,0.004335171568627451,283.0,
839,839.0,41275.0,256.0,0.00428921568627451,280.0,
840,840.0,34596.0,256.0,0.00427389705882353,279.0,
841,841.0,35123.0,256.0,0.0043045343137254905,281.0,
842,842.0,45265.0,256.0,0.004319852941176471,282.0,
843,843.0,37858.0,256.0,0.004427083333333333,289.0,
844,844.0,39608.0,256.0,0.004411764705882353,288.0,
845,845.0,44756.0,256.0,0.0043964460784313725,287.0,
846,846.0,45639.0,256.0,0.004381127450980392,286.0,
847,847.0,34536.0,256.0,0.0044424019607843136,290.0,
848,848.0,42675.0,256.0,0.004381127450980392,286.0,
849,849.0,42804.0,256.0,0.004457720588235294,291.0,
850,850.0,41005.0,256.0,0.0046262254901960785,302.0,
851,851.0,44203.0,256.0,0.004549632352941177,297.0,
852,852.0,47408.0,256.0,0.0044424019607843136,290.0,
853,853.0,41360.0,256.0,0.00428921568627451,280.0,
854,854.0,42685.0,256.0,0.004319852941176471,282.0,
855,855.0,43734.0,256.0,0.004319852941176471,282.0,
856,856.0,45093.0,256.0,0.004212622549019608,275.0,
857,857.0,39689.0,256.0,0.004212622549019608,275.0,
858,858.0,41767.0,256.0,0.004181985294117647,273.0,
859,859.0,41817.0,256.0,0.004243259803921568,277.0,
860,860.0,46677.0,256.0,0.004227941176470588,276.0,
861,861.0,41242.0,256.0,0.00428921568627451,280.0,
862,862.0,41115.0,256.0,0.004319852941176471,282.0,
863,863.0,45295.0,256.0,0.0044424019607843136,290.0,
864,864.0,49957.0,256.0,0.004488357843137255,293.0,
865,865.0,44021.0,256.0,0.004457720588235294,291.0,
866,866.0,41001.0,256.0,0.004564950980392157,298.0,
867,867.0,40858.0,256.0,0.004656862745098039,304.0,
868,868.0,47815.0,256.0,0.004764093137254902,311.0,
869,869.0,36098.0,256.0,0.004764093137254902,311.0,
870,870.0,46868.0,256.0,0.0047181372549019605,308.0,
871,871.0,45647.0,256.0,0.004856004901960784,317.0,
872,872.0,42789.0,256.0,0.004810049019607843,314.0,
873,873.0,40539.0,256.0,0.00470281862745098,307.0,
874,874.0,48264.0,256.0,0.0046262254901960785,302.0,
875,875.0,46133.0,256.0,0.0046875,306.0,
876,876.0,45009.0,256.0,0.00470281862745098,307.0,
877,877.0,38290.0,256.0,0.004610906862745098,301.0,
878,878.0,43001.0,256.0,0.004595588235294118,300.0,
879,879.0,47736.0,256.0,0.004564950980392157,298.0,
880,880.0,39077.0,256.0,0.0044424019607843136,290.0,
881,881.0,42998.0,256.0,0.004518995098039216,295.0,
882,882.0,41863.0,256.0,0.004365808823529412,285.0,
883,883.0,46483.0,256.0,0.004503676470588235,294.0,
884,884.0,44297.0,256.0,0.004595588235294118,300.0,
885,885.0,43287.0,256.0,0.0045343137254901964,296.0,
886,886.0,43960.0,256.0,0.00470281862745098,307.0,
887,887.0,44108.0,256.0,0.004810049019607843,314.0,
888,888.0,43726.0,256.0,0.004840686274509804,316.0,
889,889.0,41438.0,256.0,0.004917279411764706,321.0,
890,890.0,38778.0,256.0,0.0049479166666666664,323.0,
891,891.0,40289.0,256.0,0.00505514705882353,330.0,
892,892.0,43345.0,256.0,0.005147058823529412,336.0,
893,893.0,29572.0,256.0,0.005238970588235294,342.0,
894,894.0,35954.0,256.0,0.005131740196078431,335.0,
895,895.0,42236.0,256.0,0.00505514705882353,330.0,
896,896.0,41524.0,256.0,0.005208333333333333,340.0,
897,897.0,46857.0,256.0,0.005162377450980392,337.0,
898,898.0,49474.0,256.0,0.00507046568627451,331.0,
899,899.0,45568.0,256.0,0.005177696078431372,338.0,
900,900.0,37039.0,256.0,0.005039828431372549,329.0,
901,901.0,40631.0,256.0,0.005101102941176471,333.0,
902,902.0,42354.0,256.0,0.00508578431372549,332.0,
903,903.0,40485.0,256.0,0.00508578431372549,332.0,
904,904.0,41372.0,256.0,0.005193014705882353,339.0,
905,905.0,42141.0,256.0,0.005039828431372549,329.0,
906,906.0,40288.0,256.0,0.005039828431372549,329.0,
907,907.0,43991.0,256.0,0.005101102941176471,333.0,
908,908.0,41866.0,256.0,0.005177696078431372,338.0,
909,909.0,42860.0,256.0,0.00508578431372549,332.0,
910,910.0,41709.0,256.0,0.005254289215686275,343.0,
911,911.0,42228.0,256.0,0.00508578431372549,332.0,
912,912.0,44026.0,256.0,0.00507046568627451,331.0,
913,913.0,49004.0,256.0,0.005101102941176471,333.0,
914,914.0,40838.0,256.0,0.005254289215686275,343.0,
915,915.0,44536.0,256.0,0.005193014705882353,339.0,
916,916.0,48667.0,256.0,0.005147058823529412,336.0,
917,917.0,47873.0,256.0,0.005039828431372549,329.0,
918,918.0,43831.0,256.0,0.005177696078431372,338.0,
919,919.0,45058.0,256.0,0.005269607843137255,344.0,
920,920.0,37427.0,256.0,0.005147058823529412,336.0,
921,921.0,34996.0,256.0,0.005269607843137255,344.0,
922,922.0,45436.0,256.0,0.00507046568627451,331.0,
923,923.0,36596.0,256.0,0.00508578431372549,332.0,
924,924.0,42601.0,256.0,0.00507046568627451,331.0,
925,925.0,35666.0,256.0,0.004963235294117647,324.0,
926,926.0,36398.0,256.0,0.005024509803921569,328.0,
927,927.0,45234.0,256.0,0.004779411764705883,312.0,
928,928.0,31233.0,256.0,0.004886642156862745,319.0,
929,929.0,37725.0,256.0,0.004917279411764706,321.0,
930,930.0,38647.0,256.0,0.004840686274509804,316.0,
931,931.0,29375.0,256.0,0.004733455882352941,309.0,
932,932.0,37608.0,256.0,0.0046721813725490195,305.0,
933,933.0,39109.0,256.0,0.004656862745098039,304.0,
934,934.0,45808.0,256.0,0.004656862745098039,304.0,
935,935.0,39578.0,256.0,0.004610906862745098,301.0,
936,936.0,28909.0,256.0,0.004641544117647059,303.0,
937,937.0,34649.0,256.0,0.004549632352941177,297.0,
938,938.0,40324.0,256.0,0.0046262254901960785,302.0,
939,939.0,42732.0,256.0,0.004656862745098039,304.0,
940,940.0,41810.0,256.0,0.004748774509803921,310.0,
941,941.0,41220.0,256.0,0.004779411764705883,312.0,
942,942.0,43957.0,256.0,0.004748774509803921,310.0,
943,943.0,43814.0,256.0,0.004656862745098039,304.0,
944,944.0,37597.0,256.0,0.004656862745098039,304.0,
945,945.0,40123.0,256.0,0.004641544117647059,303.0,
946,946.0,43183.0,256.0,0.0045802696078431375,299.0,
947,947.0,36681.0,256.0,0.004503676470588235,294.0,
948,948.0,38883.0,256.0,0.004457720588235294,291.0,
949,949.0,39033.0,256.0,0.004457720588235294,291.0,
950,950.0,42226.0,256.0,0.004549632352941177,297.0,
951,951.0,37482.0,256.0,0.004610906862745098,301.0,
952,952.0,41737.0,256.0,0.004779411764705883,312.0,
953,953.0,46349.0,256.0,0.004733455882352941,309.0,
954,954.0,44644.0,256.0,0.00470281862745098,307.0,
955,955.0,38673.0,256.0,0.004810049019607843,314.0,
956,956.0,41914.0,256.0,0.0046721813725490195,305.0,
957,957.0,40556.0,256.0,0.00470281862745098,307.0,
958,958.0,44941.0,256.0,0.004733455882352941,309.0,
959,959.0,41164.0,256.0,0.004825367647058824,315.0,
960,960.0,42052.0,256.0,0.005024509803921569,328.0,
961,961.0,43269.0,256.0,0.0049479166666666664,323.0,
962,962.0,38862.0,256.0,0.004856004901960784,317.0,
963,963.0,37555.0,256.0,0.004856004901960784,317.0,
964,964.0,36296.0,256.0,0.004917279411764706,321.0,
965,965.0,42261.0,256.0,0.005009191176470589,327.0,
966,966.0,40777.0,256.0,0.004932598039215686,322.0,
967,967.0,41076.0,256.0,0.00507046568627451,331.0,
968,968.0,33848.0,256.0,0.005024509803921569,328.0,
969,969.0,40217.0,256.0,0.004886642156862745,319.0,
970,970.0,35706.0,256.0,0.004825367647058824,315.0,
971,971.0,43260.0,256.0,0.004871323529411765,318.0,
972,972.0,44734.0,256.0,0.004886642156862745,319.0,
973,973.0,38388.0,256.0,0.004901960784313725,320.0,
974,974.0,31903.0,256.0,0.004656862745098039,304.0,
975,975.0,36503.0,256.0,0.0046875,306.0,
976,976.0,36548.0,256.0,0.004932598039215686,322.0,
977,977.0,33846.0,256.0,0.0049479166666666664,323.0,
978,978.0,33402.0,256.0,0.004871323529411765,318.0,
979,979.0,37386.0,256.0,0.0049479166666666664,323.0,
980,980.0,33013.0,256.0,0.004810049019607843,314.0,
981,981.0,37869.0,256.0,0.004871323529411765,318.0,
982,982.0,36756.0,256.0,0.004840686274509804,316.0,
983,983.0,39933.0,256.0,0.004840686274509804,316.0,
984,984.0,38745.0,256.0,0.004886642156862745,319.0,
985,985.0,43514.0,256.0,0.004978553921568627,325.0,
986,986.0,37398.0,256.0,0.004932598039215686,322.0,
987,987.0,37883.0,256.0,0.004856004901960784,317.0,
988,988.0,35892.0,256.0,0.004794730392156863,313.0,
989,989.0,35338.0,256.0,0.0047181372549019605,308.0,
990,990.0,29169.0,256.0,0.004779411764705883,312.0,
991,991.0,37948.0,256.0,0.0047181372549019605,308.0,
992,992.0,36003.0,256.0,0.004840686274509804,316.0,
993,993.0,41671.0,256.0,0.004840686274509804,316.0,
994,994.0,48799.0,256.0,0.005101102941176471,333.0,
995,995.0,45858.0,256.0,0.005009191176470589,327.0,
996,996.0,38516.0,256.0,0.005131740196078431,335.0,
997,997.0,42032.0,256.0,0.005101102941176471,333.0,
998,998.0,40464.0,256.0,0.00508578431372549,332.0,
999,999.0,40795.0,256.0,0.005009191176470589,327.0,
