0,0.0,0.0,2.0,0_1,841_0,82
1,1.0,5709.0,2.0,0_1,1051_0,93
2,2.0,4102.0,2.0,0_1,981_0,93
3,3.0,3010.0,2.0,0_1,951_0,80
4,4.0,3073.0,2.0,0_1,931_0,77
5,5.0,3338.0,2.0,0_1,961_0,84
6,6.0,3113.0,2.0,0_1,1011_0,86
7,7.0,2395.0,2.0,0_1,951_0,82
8,8.0,3101.0,2.0,0_1,931_0,86
9,9.0,2863.0,2.0,0_1,881_0,82
10,10.0,3103.0,2.0,0_1,941_0,86
11,11.0,4132.0,2.0,0_1,1031_0,87
12,12.0,3464.0,2.0,0_1,1041_0,89
13,13.0,3683.0,2.0,0_1,1041_0,92
14,14.0,3839.0,2.0,0_1,1171_0,103
15,15.0,4847.0,2.0,0_1,1241_0,110
16,16.0,4773.0,2.0,0_1,1331_0,114
17,17.0,3953.0,2.0,0_1,1331_0,115
18,18.0,4650.0,2.0,0_1,1351_0,117
19,19.0,4133.0,2.0,0_1,1421_0,121
20,20.0,4972.0,2.0,0_1,1451_0,126
21,21.0,4860.0,2.0,0_1,1561_0,128
22,22.0,5475.0,2.0,0_1,1581_0,135
23,23.0,4366.0,2.0,0_1,1591_0,146
24,24.0,5449.0,2.0,0_1,1641_0,153
25,25.0,5249.0,2.0,0_1,1661_0,154
26,26.0,5299.0,2.0,0_1,1691_0,165
27,27.0,6282.0,2.0,0_1,1791_0,167
28,28.0,5947.0,2.0,0_1,1791_0,166
29,29.0,5056.0,2.0,0_1,1851_0,176
30,30.0,7289.0,2.0,0_1,1851_0,183
31,31.0,5772.0,2.0,0_1,1951_0,188
32,32.0,6691.0,2.0,0_1,1961_0,188
33,33.0,7812.0,2.0,0_1,2031_0,193
34,34.0,7346.0,2.0,0_1,2061_0,202
35,35.0,6376.0,2.0,0_1,2171_0,204
36,36.0,7783.0,2.0,0_1,2251_0,209
37,37.0,8233.0,2.0,0_1,2291_0,217
38,38.0,8862.0,2.0,0_1,2301_0,224
39,39.0,8042.0,2.0,0_1,2391_0,217
40,40.0,6955.0,2.0,0_1,2271_0,215
41,41.0,5956.0,2.0,0_1,2381_0,225
42,42.0,8414.0,2.0,0_1,2421_0,220
43,43.0,6819.0,2.0,0_1,2451_0,230
44,44.0,10022.0,2.0,0_1,2421_0,228
45,45.0,9132.0,2.0,0_1,2471_0,236
46,46.0,8881.0,2.0,0_1,2571_0,244
47,47.0,8646.0,2.0,0_1,2711_0,248
48,48.0,10359.0,2.0,0_1,2841_0,258
49,49.0,8476.0,2.0,0_1,2921_0,269
50,50.0,7549.0,2.0,0_1,2931_0,275
51,51.0,8090.0,2.0,0_1,2861_0,284
52,52.0,9568.0,2.0,0_1,2871_0,294
53,53.0,9406.0,2.0,0_1,2961_0,310
54,54.0,11739.0,2.0,0_1,3071_0,316
55,55.0,9977.0,2.0,0_1,3031_0,320
56,56.0,9400.0,2.0,0_1,3201_0,329
57,57.0,11765.0,2.0,0_1,3171_0,332
58,58.0,10889.0,2.0,0_1,3201_0,338
59,59.0,12423.0,2.0,0_1,3241_0,343
60,60.0,11464.0,2.0,0_1,3221_0,353
61,61.0,11833.0,2.0,0_1,3421_0,362
62,62.0,12157.0,2.0,0_1,3611_0,377
63,63.0,11467.0,2.0,0_1,3781_0,395
64,64.0,11527.0,2.0,0_1,3871_0,395
65,65.0,13899.0,2.0,0_1,3931_0,395
66,66.0,12070.0,2.0,0_1,3991_0,392
67,67.0,14109.0,2.0,0_1,4131_0,404
68,68.0,16015.0,2.0,0_1,4111_0,417
69,69.0,14292.0,2.0,0_1,4321_0,419
70,70.0,12279.0,2.0,0_1,4571_0,427
71,71.0,15362.0,2.0,0_1,4581_0,427
72,72.0,15515.0,2.0,0_1,4611_0,445
73,73.0,14163.0,2.0,0_1,4761_0,471
74,74.0,15934.0,2.0,0_1,4861_0,475
75,75.0,13534.0,2.0,0_1,4841_0,466
76,76.0,13351.0,2.0,0_1,4751_0,464
77,77.0,12969.0,2.0,0_1,4821_0,460
78,78.0,14185.0,2.0,0_1,4991_0,458
79,79.0,16561.0,2.0,0_1,5151_0,468
80,80.0,16809.0,2.0,0_1,5241_0,456
81,81.0,13818.0,2.0,0_1,5291_0,469
82,82.0,17261.0,2.0,0_1,5311_0,470
83,83.0,13663.0,2.0,0_1,5271_0,475
84,84.0,15930.0,2.0,0_1,5281_0,477
85,85.0,17445.0,2.0,0_1,5271_0,501
86,86.0,17169.0,2.0,0_1,5101_0,513
87,87.0,16750.0,2.0,0_1,5241_0,534
88,88.0,18404.0,2.0,0_1,5091_0,545
89,89.0,18508.0,2.0,0_1,5311_0,557
90,90.0,18098.0,2.0,0_1,5481_0,571
91,91.0,18739.0,2.0,0_1,5571_0,589
92,92.0,18008.0,2.0,0_1,5631_0,585
93,93.0,17607.0,2.0,0_1,5791_0,608
94,94.0,21216.0,2.0,0_1,5971_0,615
95,95.0,17902.0,2.0,0_1,6061_0,644
96,96.0,24134.0,2.0,0_1,6271_0,653
97,97.0,24848.0,2.0,0_1,6321_0,675
98,98.0,19276.0,2.0,0_1,6581_0,700
99,99.0,25295.0,2.0,0_1,6631_0,699
100,100.0,17359.0,2.0,0_1,6761_0,711
101,101.0,25921.0,2.0,0_1,6971_0,704
102,102.0,24771.0,2.0,0_1,7331_0,724
103,103.0,24913.0,2.0,0_1,7261_0,738
104,104.0,22807.0,2.0,0_1,7241_0,755
105,105.0,18361.0,2.0,0_1,7491_0,754
106,106.0,24743.0,2.0,0_1,7561_0,771
107,107.0,24799.0,2.0,0_1,7301_0,764
108,108.0,18726.0,2.0,0_1,7271_0,762
109,109.0,21839.0,2.0,0_1,7351_0,757
110,110.0,19774.0,2.0,0_1,7331_0,753
111,111.0,23877.0,2.0,0_1,7431_0,758
112,112.0,21550.0,2.0,0_1,7621_0,779
113,113.0,22771.0,2.0,0_1,7751_0,777
114,114.0,24812.0,2.0,0_1,7981_0,789
115,115.0,23587.0,2.0,0_1,7981_0,809
116,116.0,22390.0,2.0,0_1,8181_0,805
117,117.0,25650.0,2.0,0_1,8381_0,785
118,118.0,24044.0,2.0,0_1,8611_0,783
119,119.0,23321.0,2.0,0_1,8501_0,764
120,120.0,22003.0,2.0,0_1,8481_0,758
121,121.0,28337.0,2.0,0_1,8311_0,767
122,122.0,26885.0,2.0,0_1,8231_0,780
123,123.0,25012.0,2.0,0_1,8241_0,806
124,124.0,22166.0,2.0,0_1,7991_0,803
125,125.0,29628.0,2.0,0_1,8341_0,815
126,126.0,30042.0,2.0,0_1,8681_0,859
127,127.0,32789.0,2.0,0_1,9061_0,907
128,128.0,31427.0,2.0,0_1,9261_0,931
129,129.0,28184.0,2.0,0_1,9391_0,945
130,130.0,28975.0,2.0,0_1,9371_0,936
131,131.0,27391.0,2.0,0_1,9471_0,967
132,132.0,28738.0,2.0,0_1,9381_0,954
133,133.0,23348.0,2.0,0_1,9601_0,962
134,134.0,34216.0,2.0,0_1,9811_0,975
135,135.0,29086.0,2.0,0_1,9831_0,957
136,136.0,23369.0,2.0,0_1,9881_0,957
137,137.0,30115.0,2.0,0_1,10011_0,974
138,138.0,34437.0,2.0,0_1,9991_0,977
139,139.0,26542.0,2.0,0_1,10081_0,967
140,140.0,31853.0,2.0,0_1,10181_0,978
141,141.0,29322.0,2.0,0_1,10311_0,995
142,142.0,33163.0,2.0,0_1,10321_0,1019
143,143.0,27901.0,2.0,0_1,10361_0,1029
144,144.0,33854.0,2.0,0_1,10491_0,1029
145,145.0,30436.0,2.0,0_1,10421_0,1047
146,146.0,26913.0,2.0,0_1,10441_0,1038
147,147.0,32143.0,2.0,0_1,10641_0,1030
148,148.0,33291.0,2.0,0_1,10291_0,1025
149,149.0,30491.0,2.0,0_1,10551_0,1039
150,150.0,39815.0,2.0,0_1,10971_0,1059
151,151.0,36609.0,2.0,0_1,10981_0,1052
152,152.0,30179.0,2.0,0_1,11191_0,1075
153,153.0,39815.0,2.0,0_1,11241_0,1081
154,154.0,32445.0,2.0,0_1,11301_0,1109
155,155.0,36289.0,2.0,0_1,11191_0,1152
156,156.0,27906.0,2.0,0_1,10841_0,1154
157,157.0,34896.0,2.0,0_1,10941_0,1164
158,158.0,32757.0,2.0,0_1,11091_0,1166
159,159.0,34007.0,2.0,0_1,10981_0,1133
160,160.0,32199.0,2.0,0_1,10991_0,1129
161,161.0,31357.0,2.0,0_1,11001_0,1122
162,162.0,36057.0,2.0,0_1,10961_0,1132
163,163.0,29308.0,2.0,0_1,11161_0,1115
164,164.0,35772.0,2.0,0_1,11201_0,1116
165,165.0,31794.0,2.0,0_1,11131_0,1143
166,166.0,33133.0,2.0,0_1,11211_0,1159
167,167.0,35199.0,2.0,0_1,11141_0,1168
168,168.0,37705.0,2.0,0_1,11451_0,1194
169,169.0,38197.0,2.0,0_1,11791_0,1219
170,170.0,34414.0,2.0,0_1,11731_0,1259
171,171.0,39740.0,2.0,0_1,11971_0,1249
172,172.0,39096.0,2.0,0_1,12251_0,1278
173,173.0,41011.0,2.0,0_1,12581_0,1294
174,174.0,39845.0,2.0,0_1,12801_0,1324
175,175.0,47266.0,2.0,0_1,13021_0,1333
176,176.0,42207.0,2.0,0_1,13211_0,1313
177,177.0,33834.0,2.0,0_1,13261_0,1287
178,178.0,37183.0,2.0,0_1,13381_0,1286
179,179.0,41243.0,2.0,0_1,13281_0,1283
180,180.0,38056.0,2.0,0_1,12891_0,1283
181,181.0,31945.0,2.0,0_1,13081_0,1276
182,182.0,36405.0,2.0,0_1,13241_0,1282
183,183.0,34296.0,2.0,0_1,13271_0,1317
184,184.0,38583.0,2.0,0_1,13011_0,1323
185,185.0,44063.0,2.0,0_1,13201_0,1330
186,186.0,42785.0,2.0,0_1,13311_0,1308
187,187.0,34592.0,2.0,0_1,13271_0,1311
188,188.0,39034.0,2.0,0_1,13251_0,1304
189,189.0,34617.0,2.0,0_1,12961_0,1298
190,190.0,37634.0,2.0,0_1,12811_0,1291
191,191.0,37692.0,2.0,0_1,12831_0,1299
192,192.0,35888.0,2.0,0_1,13041_0,1280
193,193.0,44386.0,2.0,0_1,13211_0,1260
194,194.0,40470.0,2.0,0_1,14071_0,1342
195,195.0,50929.0,2.0,0_1,14681_0,1354
196,196.0,43948.0,2.0,0_1,14711_0,1386
197,197.0,43349.0,2.0,0_1,14401_0,1377
198,198.0,35301.0,2.0,0_1,14341_0,1371
199,199.0,40853.0,2.0,0_1,14561_0,1392
200,200.0,44746.0,2.0,0_1,14301_0,1404
201,201.0,40771.0,2.0,0_1,14101_0,1419
202,202.0,40088.0,2.0,0_1,13951_0,1410
203,203.0,41607.0,2.0,0_1,13861_0,1391
204,204.0,38103.0,2.0,0_1,14221_0,1438
205,205.0,47292.0,2.0,0_1,14451_0,1467
206,206.0,42465.0,2.0,0_1,14411_0,1499
207,207.0,44325.0,2.0,0_1,14721_0,1498
208,208.0,42824.0,2.0,0_1,14751_0,1516
209,209.0,46844.0,2.0,0_1,15071_0,1562
210,210.0,50553.0,2.0,0_1,14931_0,1563
211,211.0,44776.0,2.0,0_1,15051_0,1535
212,212.0,41397.0,2.0,0_1,15251_0,1549
213,213.0,47827.0,2.0,0_1,15211_0,1569
214,214.0,45267.0,2.0,0_1,15221_0,1552
215,215.0,45217.0,2.0,0_1,15211_0,1561
216,216.0,44253.0,2.0,0_1,15311_0,1527
217,217.0,44210.0,2.0,0_1,15171_0,1532
218,218.0,48137.0,2.0,0_1,15161_0,1507
219,219.0,42246.0,2.0,0_1,15011_0,1475
220,220.0,43900.0,2.0,0_1,14751_0,1481
221,221.0,48645.0,2.0,0_1,15011_0,1469
222,222.0,46924.0,2.0,0_1,14961_0,1475
223,223.0,42700.0,2.0,0_1,14561_0,1466
224,224.0,39775.0,2.0,0_1,14761_0,1486
225,225.0,43125.0,2.0,0_1,14761_0,1485
226,226.0,43291.0,2.0,0_1,14791_0,1494
227,227.0,43683.0,2.0,0_1,14681_0,1472
228,228.0,45508.0,2.0,0_1,14931_0,1504
229,229.0,42051.0,2.0,0_1,15231_0,1512
230,230.0,46016.0,2.0,0_1,15491_0,1549
231,231.0,53148.0,2.0,0_1,16211_0,1614
232,232.0,55780.0,2.0,0_1,16201_0,1633
233,233.0,49465.0,2.0,0_1,16431_0,1645
234,234.0,47801.0,2.0,0_1,16521_0,1618
235,235.0,49208.0,2.0,0_1,16141_0,1630
236,236.0,44081.0,2.0,0_1,16001_0,1651
237,237.0,46086.0,2.0,0_1,15831_0,1615
238,238.0,39882.0,2.0,0_1,15371_0,1561
239,239.0,49245.0,2.0,0_1,15501_0,1596
240,240.0,48212.0,2.0,0_1,15531_0,1600
241,241.0,52054.0,2.0,0_1,15631_0,1576
242,242.0,52593.0,2.0,0_1,15831_0,1592
243,243.0,53496.0,2.0,0_1,16271_0,1640
244,244.0,57259.0,2.0,0_1,17021_0,1689
245,245.0,51317.0,2.0,0_1,17231_0,1689
246,246.0,50081.0,2.0,0_1,17431_0,1694
247,247.0,44064.0,2.0,0_1,16911_0,1635
248,248.0,42056.0,2.0,0_1,16801_0,1663
249,249.0,47011.0,2.0,0_1,16611_0,1689
250,250.0,47734.0,2.0,0_1,16421_0,1686
251,251.0,50929.0,2.0,0_1,16481_0,1697
252,252.0,49407.0,2.0,0_1,16901_0,1694
253,253.0,50764.0,2.0,0_1,17091_0,1744
254,254.0,56678.0,2.0,0_1,17071_0,1730
255,255.0,52008.0,2.0,0_1,17281_0,1737
256,256.0,55540.0,2.0,0_1,17281_0,1735
257,257.0,55558.0,2.0,0_1,17731_0,1775
258,258.0,58740.0,2.0,0_1,17661_0,1812
259,259.0,47748.0,2.0,0_1,17391_0,1795
260,260.0,52230.0,2.0,0_1,17271_0,1780
261,261.0,49244.0,2.0,0_1,17421_0,1837
262,262.0,60090.0,2.0,0_1,17851_0,1826
263,263.0,58127.0,2.0,0_1,18211_0,1824
264,264.0,50043.0,2.0,0_1,18041_0,1804
265,265.0,55408.0,2.0,0_1,17791_0,1822
266,266.0,56061.0,2.0,0_1,17871_0,1803
267,267.0,51944.0,2.0,0_1,17581_0,1801
268,268.0,56868.0,2.0,0_1,17841_0,1816
269,269.0,56752.0,2.0,0_1,18001_0,1846
270,270.0,53924.0,2.0,0_1,18161_0,1876
271,271.0,59151.0,2.0,0_1,18531_0,1871
272,272.0,56006.0,2.0,0_1,18291_0,1867
273,273.0,54397.0,2.0,0_1,18491_0,1884
274,274.0,61317.0,2.0,0_1,18661_0,1903
275,275.0,63390.0,2.0,0_1,19201_0,1958
276,276.0,59023.0,2.0,0_1,19031_0,2004
277,277.0,61148.0,2.0,0_1,19151_0,2019
278,278.0,60301.0,2.0,0_1,19021_0,1996
279,279.0,53182.0,2.0,0_1,18941_0,1975
280,280.0,56790.0,2.0,0_1,19231_0,1965
281,281.0,61216.0,2.0,0_1,19311_0,1956
282,282.0,58008.0,2.0,0_1,19261_0,1927
283,283.0,52912.0,2.0,0_1,19551_0,1955
284,284.0,63205.0,2.0,0_1,19731_0,1980
285,285.0,63262.0,2.0,0_1,19781_0,1985
286,286.0,59489.0,2.0,0_1,20141_0,1993
287,287.0,64725.0,2.0,0_1,20831_0,2038
288,288.0,70998.0,2.0,0_1,21231_0,2099
289,289.0,63029.0,2.0,0_1,21001_0,2132
290,290.0,61994.0,2.0,0_1,21101_0,2136
291,291.0,63480.0,2.0,0_1,20701_0,2114
292,292.0,60310.0,2.0,0_1,20191_0,2124
293,293.0,51975.0,2.0,0_1,19891_0,2132
294,294.0,61620.0,2.0,0_1,20111_0,2082
295,295.0,56568.0,2.0,0_1,20141_0,2076
296,296.0,64909.0,2.0,0_1,20351_0,2067
297,297.0,61956.0,2.0,0_1,20521_0,2089
298,298.0,60954.0,2.0,0_1,20891_0,2063
299,299.0,59691.0,2.0,0_1,21111_0,2084
300,300.0,64939.0,2.0,0_1,21191_0,2087
301,301.0,58375.0,2.0,0_1,21201_0,2099
302,302.0,70267.0,2.0,0_1,21161_0,2083
303,303.0,60588.0,2.0,0_1,21231_0,2084
304,304.0,63232.0,2.0,0_1,21171_0,2098
305,305.0,61733.0,2.0,0_1,20991_0,2059
306,306.0,55196.0,2.0,0_1,20811_0,2011
307,307.0,51532.0,2.0,0_1,20401_0,1955
308,308.0,54713.0,2.0,0_1,20041_0,1939
309,309.0,61679.0,2.0,0_1,19521_0,1877
310,310.0,47023.0,2.0,0_1,19501_0,1911
311,311.0,64829.0,2.0,0_1,19641_0,1984
312,312.0,69063.0,2.0,0_1,20031_0,2048
313,313.0,66742.0,2.0,0_1,19841_0,2026
314,314.0,55867.0,2.0,0_1,20201_0,2077
315,315.0,56745.0,2.0,0_1,20701_0,2031
316,316.0,58715.0,2.0,0_1,20491_0,2012
317,317.0,58598.0,2.0,0_1,20541_0,2056
318,318.0,67227.0,2.0,0_1,20581_0,2090
319,319.0,56653.0,2.0,0_1,20661_0,2107
320,320.0,68630.0,2.0,0_1,21431_0,2131
321,321.0,77520.0,2.0,0_1,21391_0,2154
322,322.0,60540.0,2.0,0_1,21981_0,2163
323,323.0,70909.0,2.0,0_1,21641_0,2164
324,324.0,55979.0,2.0,0_1,21751_0,2176
325,325.0,78748.0,2.0,0_1,21881_0,2200
326,326.0,70331.0,2.0,0_1,22351_0,2239
327,327.0,65032.0,2.0,0_1,22631_0,2310
328,328.0,72434.0,2.0,0_1,22691_0,2334
329,329.0,56459.0,2.0,0_1,22351_0,2346
330,330.0,67668.0,2.0,0_1,22291_0,2314
331,331.0,69165.0,2.0,0_1,22231_0,2293
332,332.0,62267.0,2.0,0_1,22211_0,2284
333,333.0,68162.0,2.0,0_1,22051_0,2261
334,334.0,60836.0,2.0,0_1,21781_0,2169
335,335.0,53461.0,2.0,0_1,21281_0,2111
336,336.0,59399.0,2.0,0_1,21351_0,2135
337,337.0,72533.0,2.0,0_1,21571_0,2166
338,338.0,69962.0,2.0,0_1,21831_0,2163
339,339.0,63928.0,2.0,0_1,21621_0,2183
340,340.0,64440.0,2.0,0_1,21711_0,2185
341,341.0,64948.0,2.0,0_1,22131_0,2230
342,342.0,68696.0,2.0,0_1,22691_0,2245
343,343.0,71029.0,2.0,0_1,22921_0,2305
344,344.0,72800.0,2.0,0_1,22981_0,2327
345,345.0,63444.0,2.0,0_1,23191_0,2308
346,346.0,56887.0,2.0,0_1,23251_0,2292
347,347.0,69233.0,2.0,0_1,22781_0,2280
348,348.0,62317.0,2.0,0_1,22911_0,2255
349,349.0,61059.0,2.0,0_1,22461_0,2164
350,350.0,63538.0,2.0,0_1,21951_0,2164
351,351.0,61277.0,2.0,0_1,21621_0,2167
352,352.0,64247.0,2.0,0_1,21461_0,2146
353,353.0,58734.0,2.0,0_1,21301_0,2138
354,354.0,61233.0,2.0,0_1,20991_0,2143
355,355.0,61871.0,2.0,0_1,20781_0,2139
356,356.0,71078.0,2.0,0_1,21011_0,2160
357,357.0,61860.0,2.0,0_1,21101_0,2149
358,358.0,65027.0,2.0,0_1,20781_0,2084
359,359.0,54372.0,2.0,0_1,21141_0,2124
360,360.0,71475.0,2.0,0_1,21361_0,2116
361,361.0,61206.0,2.0,0_1,21441_0,2113
362,362.0,63098.0,2.0,0_1,21561_0,2099
363,363.0,65244.0,2.0,0_1,21471_0,2081
364,364.0,66205.0,2.0,0_1,21381_0,2085
365,365.0,56216.0,2.0,0_1,20951_0,2065
366,366.0,59954.0,2.0,0_1,20421_0,2034
367,367.0,54712.0,2.0,0_1,20221_0,1990
368,368.0,54591.0,2.0,0_1,20071_0,1949
369,369.0,55916.0,2.0,0_1,20131_0,1921
370,370.0,65176.0,2.0,0_1,20141_0,1937
371,371.0,57563.0,2.0,0_1,20041_0,1931
372,372.0,59002.0,2.0,0_1,20021_0,1926
373,373.0,60269.0,2.0,0_1,19911_0,1930
374,374.0,58901.0,2.0,0_1,19611_0,1960
375,375.0,59541.0,2.0,0_1,19221_0,1945
376,376.0,58202.0,2.0,0_1,18941_0,1957
377,377.0,59450.0,2.0,0_1,19621_0,2001
378,378.0,66518.0,2.0,0_1,19781_0,2050
379,379.0,61720.0,2.0,0_1,20271_0,2073
380,380.0,62562.0,2.0,0_1,19811_0,2006
381,381.0,45788.0,2.0,0_1,19571_0,1982
382,382.0,64966.0,2.0,0_1,19871_0,1987
383,383.0,55755.0,2.0,0_1,19891_0,1967
384,384.0,58262.0,2.0,0_1,19961_0,1984
385,385.0,50283.0,2.0,0_1,19741_0,1962
386,386.0,61893.0,2.0,0_1,19941_0,1985
387,387.0,57681.0,2.0,0_1,19781_0,1969
388,388.0,63002.0,2.0,0_1,19741_0,1980
389,389.0,56990.0,2.0,0_1,20111_0,2000
390,390.0,62345.0,2.0,0_1,19791_0,2006
391,391.0,59887.0,2.0,0_1,19591_0,2001
392,392.0,56129.0,2.0,0_1,19571_0,1964
393,393.0,54686.0,2.0,0_1,19201_0,1935
394,394.0,55940.0,2.0,0_1,19431_0,1928
395,395.0,65800.0,2.0,0_1,19841_0,1943
396,396.0,61013.0,2.0,0_1,20171_0,1944
397,397.0,61900.0,2.0,0_1,20541_0,1997
398,398.0,66556.0,2.0,0_1,20711_0,2001
399,399.0,60697.0,2.0,0_1,20871_0,2020
400,400.0,72614.0,2.0,0_1,20951_0,2060
401,401.0,67171.0,2.0,0_1,20971_0,2071
402,402.0,62293.0,2.0,0_1,20811_0,2072
403,403.0,59302.0,2.0,0_1,20901_0,2086
404,404.0,66430.0,2.0,0_1,20981_0,2102
405,405.0,56163.0,2.0,0_1,20991_0,2101
406,406.0,58385.0,2.0,0_1,21461_0,2137
407,407.0,64763.0,2.0,0_1,21391_0,2132
408,408.0,64052.0,2.0,0_1,20901_0,2114
409,409.0,54529.0,2.0,0_1,20801_0,2153
410,410.0,64014.0,2.0,0_1,20911_0,2138
411,411.0,70486.0,2.0,0_1,20561_0,2185
412,412.0,75716.0,2.0,0_1,21611_0,2240
413,413.0,71886.0,2.0,0_1,21971_0,2284
414,414.0,76131.0,2.0,0_1,22471_0,2342
415,415.0,76021.0,2.0,0_1,22891_0,2317
416,416.0,68208.0,2.0,0_1,23021_0,2301
417,417.0,68115.0,2.0,0_1,23541_0,2338
418,418.0,68942.0,2.0,0_1,24141_0,2416
419,419.0,89053.0,2.0,0_1,24301_0,2429
420,420.0,71805.0,2.0,0_1,24491_0,2445
421,421.0,79729.0,2.0,0_1,24511_0,2517
422,422.0,77167.0,2.0,0_1,24611_0,2510
423,423.0,62809.0,2.0,0_1,24021_0,2542
424,424.0,66291.0,2.0,0_1,23751_0,2523
425,425.0,61238.0,2.0,0_1,23981_0,2510
426,426.0,71565.0,2.0,0_1,24211_0,2499
427,427.0,73248.0,2.0,0_1,24551_0,2479
428,428.0,72266.0,2.0,0_1,23851_0,2419
429,429.0,54361.0,2.0,0_1,23981_0,2444
430,430.0,77096.0,2.0,0_1,23881_0,2412
431,431.0,77680.0,2.0,0_1,23851_0,2438
432,432.0,57808.0,2.0,0_1,23941_0,2410
433,433.0,71824.0,2.0,0_1,23961_0,2404
434,434.0,70649.0,2.0,0_1,23591_0,2364
435,435.0,72568.0,2.0,0_1,23371_0,2312
436,436.0,62846.0,2.0,0_1,23461_0,2337
437,437.0,70533.0,2.0,0_1,23591_0,2332
438,438.0,61737.0,2.0,0_1,23301_0,2332
439,439.0,70647.0,2.0,0_1,23131_0,2352
440,440.0,64622.0,2.0,0_1,22371_0,2322
441,441.0,62108.0,2.0,0_1,22381_0,2285
442,442.0,65688.0,2.0,0_1,22491_0,2269
443,443.0,74549.0,2.0,0_1,22981_0,2292
444,444.0,81097.0,2.0,0_1,23351_0,2367
445,445.0,82365.0,2.0,0_1,23771_0,2420
446,446.0,81587.0,2.0,0_1,24511_0,2475
447,447.0,85391.0,2.0,0_1,24911_0,2491
448,448.0,72991.0,2.0,0_1,25661_0,2538
449,449.0,81339.0,2.0,0_1,26231_0,2559
450,450.0,83542.0,2.0,0_1,26861_0,2582
451,451.0,84421.0,2.0,0_1,27361_0,2660
452,452.0,87226.0,2.0,0_1,27471_0,2714
453,453.0,89358.0,2.0,0_1,26901_0,2663
454,454.0,63207.0,2.0,0_1,26941_0,2669
455,455.0,76530.0,2.0,0_1,27101_0,2757
456,456.0,79935.0,2.0,0_1,26931_0,2717
457,457.0,69977.0,2.0,0_1,26151_0,2671
458,458.0,67810.0,2.0,0_1,25991_0,2637
459,459.0,77453.0,2.0,0_1,26011_0,2668
460,460.0,82775.0,2.0,0_1,26391_0,2702
461,461.0,81624.0,2.0,0_1,26471_0,2682
462,462.0,69887.0,2.0,0_1,26081_0,2635
463,463.0,83033.0,2.0,0_1,25641_0,2616
464,464.0,89303.0,2.0,0_1,26591_0,2719
465,465.0,101744.0,2.0,0_1,26971_0,2769
466,466.0,85244.0,2.0,0_1,27281_0,2803
467,467.0,84776.0,2.0,0_1,27321_0,2758
468,468.0,81266.0,2.0,0_1,27451_0,2877
469,469.0,82936.0,2.0,0_1,27971_0,2873
470,470.0,86762.0,2.0,0_1,28081_0,2862
471,471.0,80603.0,2.0,0_1,28311_0,2831
472,472.0,78581.0,2.0,0_1,28111_0,2848
473,473.0,73441.0,2.0,0_1,27881_0,2833
474,474.0,72493.0,2.0,0_1,27591_0,2755
475,475.0,81251.0,2.0,0_1,27581_0,2767
476,476.0,71823.0,2.0,0_1,26581_0,2714
477,477.0,71151.0,2.0,0_1,26411_0,2710
478,478.0,72916.0,2.0,0_1,26301_0,2626
479,479.0,72750.0,2.0,0_1,26321_0,2572
480,480.0,76036.0,2.0,0_1,26021_0,2537
481,481.0,77607.0,2.0,0_1,26661_0,2536
482,482.0,85627.0,2.0,0_1,26981_0,2558
483,483.0,88117.0,2.0,0_1,26761_0,2645
484,484.0,70947.0,2.0,0_1,26921_0,2665
485,485.0,75006.0,2.0,0_1,26571_0,2644
486,486.0,85500.0,2.0,0_1,26081_0,2608
487,487.0,84713.0,2.0,0_1,26031_0,2606
488,488.0,75379.0,2.0,0_1,26131_0,2632
489,489.0,81005.0,2.0,0_1,26041_0,2621
490,490.0,74103.0,2.0,0_1,26161_0,2652
491,491.0,80400.0,2.0,0_1,26001_0,2659
492,492.0,78168.0,2.0,0_1,26411_0,2693
493,493.0,77227.0,2.0,0_1,26671_0,2697
494,494.0,83342.0,2.0,0_1,26411_0,2695
495,495.0,69881.0,2.0,0_1,26581_0,2683
496,496.0,82655.0,2.0,0_1,26921_0,2673
497,497.0,87622.0,2.0,0_1,27351_0,2764
498,498.0,99633.0,2.0,0_1,28081_0,2787
499,499.0,89663.0,2.0,0_1,28141_0,2817
500,500.0,84807.0,2.0,0_1,27891_0,2821
501,501.0,79467.0,2.0,0_1,28161_0,2892
502,502.0,83956.0,2.0,0_1,28081_0,2915
503,503.0,82640.0,2.0,0_1,28181_0,2964
504,504.0,91050.0,2.0,0_1,28071_0,2923
505,505.0,84156.0,2.0,0_1,28271_0,2905
506,506.0,94428.0,2.0,0_1,27771_0,2921
507,507.0,84267.0,2.0,0_1,28081_0,2964
508,508.0,95255.0,2.0,0_1,28221_0,3006
509,509.0,88865.0,2.0,0_1,28921_0,3016
510,510.0,83852.0,2.0,0_1,29331_0,3006
511,511.0,83128.0,2.0,0_1,29611_0,3013
512,512.0,89636.0,2.0,0_1,29531_0,3011
513,513.0,86805.0,2.0,0_1,29781_0,2960
514,514.0,81751.0,2.0,0_1,29811_0,2952
515,515.0,93576.0,2.0,0_1,29931_0,2970
516,516.0,80212.0,2.0,0_1,29971_0,2930
517,517.0,87568.0,2.0,0_1,29551_0,2885
518,518.0,81481.0,2.0,0_1,29751_0,2940
519,519.0,78292.0,2.0,0_1,29071_0,2912
520,520.0,82105.0,2.0,0_1,28771_0,2816
521,521.0,78583.0,2.0,0_1,28461_0,2781
522,522.0,82057.0,2.0,0_1,28191_0,2761
523,523.0,79474.0,2.0,0_1,28331_0,2821
524,524.0,87331.0,2.0,0_1,28911_0,2863
525,525.0,98359.0,2.0,0_1,29241_0,2920
526,526.0,85212.0,2.0,0_1,29721_0,2924
527,527.0,83764.0,2.0,0_1,29841_0,2916
528,528.0,83965.0,2.0,0_1,29821_0,2918
529,529.0,93770.0,2.0,0_1,28161_0,2876
530,530.0,69451.0,2.0,0_1,27041_0,2798
531,531.0,63178.0,2.0,0_1,27021_0,2761
532,532.0,89374.0,2.0,0_1,26931_0,2748
533,533.0,75563.0,2.0,0_1,26911_0,2773
534,534.0,76333.0,2.0,0_1,27041_0,2728
535,535.0,74098.0,2.0,0_1,26411_0,2731
536,536.0,69180.0,2.0,0_1,26101_0,2716
537,537.0,72523.0,2.0,0_1,25761_0,2740
538,538.0,80753.0,2.0,0_1,25501_0,2674
539,539.0,78654.0,2.0,0_1,25331_0,2678
540,540.0,84279.0,2.0,0_1,26361_0,2655
541,541.0,88547.0,2.0,0_1,26231_0,2656
542,542.0,68279.0,2.0,0_1,25721_0,2624
543,543.0,76009.0,2.0,0_1,26321_0,2607
544,544.0,87669.0,2.0,0_1,26651_0,2648
545,545.0,82722.0,2.0,0_1,27381_0,2688
546,546.0,82546.0,2.0,0_1,27331_0,2729
547,547.0,77463.0,2.0,0_1,27991_0,2774
548,548.0,94244.0,2.0,0_1,28531_0,2805
549,549.0,86857.0,2.0,0_1,28681_0,2813
550,550.0,75723.0,2.0,0_1,28681_0,2802
551,551.0,90599.0,2.0,0_1,28861_0,2774
552,552.0,89660.0,2.0,0_1,28111_0,2794
553,553.0,71438.0,2.0,0_1,27831_0,2831
554,554.0,90032.0,2.0,0_1,28241_0,2840
555,555.0,94675.0,2.0,0_1,28191_0,2844
556,556.0,79024.0,2.0,0_1,27861_0,2877
557,557.0,85768.0,2.0,0_1,27771_0,2803
558,558.0,73836.0,2.0,0_1,27841_0,2790
559,559.0,77905.0,2.0,0_1,27271_0,2703
560,560.0,70532.0,2.0,0_1,27271_0,2678
561,561.0,78748.0,2.0,0_1,26921_0,2681
562,562.0,79512.0,2.0,0_1,26611_0,2714
563,563.0,88256.0,2.0,0_1,27241_0,2757
564,564.0,79354.0,2.0,0_1,27541_0,2732
565,565.0,87145.0,2.0,0_1,27511_0,2702
566,566.0,86553.0,2.0,0_1,27431_0,2690
567,567.0,77730.0,2.0,0_1,26891_0,2638
568,568.0,85337.0,2.0,0_1,26761_0,2632
569,569.0,74077.0,2.0,0_1,27061_0,2676
570,570.0,81060.0,2.0,0_1,26781_0,2661
571,571.0,73097.0,2.0,0_1,27261_0,2730
572,572.0,90544.0,2.0,0_1,27821_0,2834
573,573.0,87238.0,2.0,0_1,28561_0,2914
574,574.0,90435.0,2.0,0_1,28431_0,2946
575,575.0,84782.0,2.0,0_1,28711_0,2951
576,576.0,92002.0,2.0,0_1,28471_0,2952
577,577.0,86721.0,2.0,0_1,28501_0,2992
578,578.0,85340.0,2.0,0_1,28331_0,2932
579,579.0,86858.0,2.0,0_1,28211_0,2926
580,580.0,95483.0,2.0,0_1,28561_0,2950
581,581.0,86912.0,2.0,0_1,28161_0,2922
582,582.0,86870.0,2.0,0_1,27301_0,2869
583,583.0,72736.0,2.0,0_1,27581_0,2846
584,584.0,81351.0,2.0,0_1,28121_0,2816
585,585.0,84354.0,2.0,0_1,29071_0,2857
586,586.0,89551.0,2.0,0_1,29421_0,2873
587,587.0,78848.0,2.0,0_1,29201_0,2869
588,588.0,81044.0,2.0,0_1,29321_0,2890
589,589.0,79102.0,2.0,0_1,28691_0,2831
590,590.0,74302.0,2.0,0_1,28331_0,2799
591,591.0,89411.0,2.0,0_1,27431_0,2722
592,592.0,80648.0,2.0,0_1,27761_0,2705
593,593.0,90695.0,2.0,0_1,27471_0,2696
594,594.0,81561.0,2.0,0_1,27031_0,2634
595,595.0,69983.0,2.0,0_1,27281_0,2684
596,596.0,83407.0,2.0,0_1,27401_0,2713
597,597.0,80030.0,2.0,0_1,27041_0,2741
598,598.0,86015.0,2.0,0_1,27031_0,2715
599,599.0,80444.0,2.0,0_1,27631_0,2773
600,600.0,94206.0,2.0,0_1,27341_0,2800
601,601.0,85103.0,2.0,0_1,27441_0,2825
602,602.0,84619.0,2.0,0_1,27691_0,2874
603,603.0,90718.0,2.0,0_1,28241_0,2920
604,604.0,85605.0,2.0,0_1,28121_0,2937
605,605.0,85118.0,2.0,0_1,28661_0,2959
606,606.0,84057.0,2.0,0_1,28711_0,2960
607,607.0,92638.0,2.0,0_1,29031_0,2925
608,608.0,84047.0,2.0,0_1,29221_0,2980
609,609.0,89790.0,2.0,0_1,29271_0,2969
610,610.0,89446.0,2.0,0_1,29341_0,2968
611,611.0,97154.0,2.0,0_1,29591_0,3063
612,612.0,92427.0,2.0,0_1,30001_0,3048
613,613.0,98319.0,2.0,0_1,29931_0,3040
614,614.0,94063.0,2.0,0_1,30151_0,3090
615,615.0,93787.0,2.0,0_1,30731_0,3108
616,616.0,94370.0,2.0,0_1,31171_0,3125
617,617.0,92338.0,2.0,0_1,31241_0,3105
618,618.0,85102.0,2.0,0_1,30801_0,3081
619,619.0,89028.0,2.0,0_1,30851_0,3028
620,620.0,93057.0,2.0,0_1,30081_0,3055
621,621.0,84536.0,2.0,0_1,30501_0,3083
622,622.0,94090.0,2.0,0_1,30461_0,3051
623,623.0,95591.0,2.0,0_1,30851_0,3062
624,624.0,94403.0,2.0,0_1,31021_0,3138
625,625.0,101819.0,2.0,0_1,30991_0,3182
626,626.0,88587.0,2.0,0_1,30901_0,3165
627,627.0,88148.0,2.0,0_1,30881_0,3118
628,628.0,87089.0,2.0,0_1,29841_0,3055
629,629.0,85934.0,2.0,0_1,30061_0,3069
630,630.0,87380.0,2.0,0_1,30271_0,3099
631,631.0,94940.0,2.0,0_1,31211_0,3097
632,632.0,83541.0,2.0,0_1,31411_0,3122
633,633.0,94496.0,2.0,0_1,31111_0,3129
634,634.0,92935.0,2.0,0_1,30981_0,3111
635,635.0,90296.0,2.0,0_1,30431_0,3114
636,636.0,89013.0,2.0,0_1,30911_0,3147
637,637.0,100884.0,2.0,0_1,30751_0,3115
638,638.0,82832.0,2.0,0_1,30551_0,3091
639,639.0,89468.0,2.0,0_1,30601_0,3046
640,640.0,93718.0,2.0,0_1,30291_0,3054
641,641.0,95857.0,2.0,0_1,30041_0,3056
642,642.0,78348.0,2.0,0_1,29811_0,3018
643,643.0,79941.0,2.0,0_1,29711_0,3068
644,644.0,86922.0,2.0,0_1,29401_0,3039
645,645.0,81116.0,2.0,0_1,28571_0,2982
646,646.0,82851.0,2.0,0_1,28501_0,2921
647,647.0,80203.0,2.0,0_1,28241_0,2855
648,648.0,84101.0,2.0,0_1,27881_0,2822
649,649.0,85264.0,2.0,0_1,27841_0,2825
650,650.0,86281.0,2.0,0_1,27231_0,2804
651,651.0,73379.0,2.0,0_1,27021_0,2774
652,652.0,89960.0,2.0,0_1,26601_0,2777
653,653.0,79866.0,2.0,0_1,27061_0,2801
654,654.0,96235.0,2.0,0_1,27881_0,2847
655,655.0,87455.0,2.0,0_1,28411_0,2895
656,656.0,85130.0,2.0,0_1,28831_0,2953
657,657.0,95498.0,2.0,0_1,29551_0,3003
658,658.0,94744.0,2.0,0_1,30361_0,3041
659,659.0,89718.0,2.0,0_1,30231_0,3046
660,660.0,84413.0,2.0,0_1,29811_0,2995
661,661.0,86748.0,2.0,0_1,30131_0,3074
662,662.0,100267.0,2.0,0_1,30301_0,3089
663,663.0,86914.0,2.0,0_1,30331_0,3107
664,664.0,89503.0,2.0,0_1,30291_0,3050
665,665.0,87645.0,2.0,0_1,30411_0,3063
666,666.0,93528.0,2.0,0_1,30481_0,3041
667,667.0,84023.0,2.0,0_1,30371_0,3054
668,668.0,96673.0,2.0,0_1,30281_0,3057
669,669.0,93656.0,2.0,0_1,30111_0,3059
670,670.0,76828.0,2.0,0_1,29511_0,3023
671,671.0,94319.0,2.0,0_1,29511_0,3004
672,672.0,88555.0,2.0,0_1,29301_0,2995
673,673.0,81761.0,2.0,0_1,29111_0,2965
674,674.0,78552.0,2.0,0_1,29071_0,2934
675,675.0,93624.0,2.0,0_1,28841_0,2934
676,676.0,78931.0,2.0,0_1,28501_0,2902
677,677.0,81401.0,2.0,0_1,28311_0,2931
678,678.0,79594.0,2.0,0_1,28031_0,2925
679,679.0,91820.0,2.0,0_1,27331_0,2907
680,680.0,80115.0,2.0,0_1,28051_0,2941
681,681.0,95270.0,2.0,0_1,28151_0,2946
682,682.0,81951.0,2.0,0_1,28881_0,2938
683,683.0,86226.0,2.0,0_1,28961_0,2868
684,684.0,73542.0,2.0,0_1,28581_0,2803
685,685.0,76073.0,2.0,0_1,28721_0,2783
686,686.0,80675.0,2.0,0_1,28071_0,2709
687,687.0,79905.0,2.0,0_1,27961_0,2765
688,688.0,90200.0,2.0,0_1,28421_0,2831
689,689.0,80883.0,2.0,0_1,28241_0,2769
690,690.0,75354.0,2.0,0_1,27551_0,2705
691,691.0,69257.0,2.0,0_1,27171_0,2627
692,692.0,71064.0,2.0,0_1,26211_0,2531
693,693.0,70474.0,2.0,0_1,25781_0,2494
694,694.0,72502.0,2.0,0_1,25591_0,2498
695,695.0,82742.0,2.0,0_1,25701_0,2508
696,696.0,83169.0,2.0,0_1,25871_0,2541
697,697.0,77504.0,2.0,0_1,25611_0,2567
698,698.0,81366.0,2.0,0_1,25451_0,2569
699,699.0,79785.0,2.0,0_1,25221_0,2628
700,700.0,69579.0,2.0,0_1,25411_0,2670
701,701.0,81458.0,2.0,0_1,25831_0,2676
702,702.0,81503.0,2.0,0_1,26021_0,2716
703,703.0,85296.0,2.0,0_1,26311_0,2738
704,704.0,80508.0,2.0,0_1,26461_0,2698
705,705.0,84516.0,2.0,0_1,26641_0,2729
706,706.0,77731.0,2.0,0_1,26701_0,2705
707,707.0,86307.0,2.0,0_1,26651_0,2691
708,708.0,75855.0,2.0,0_1,26371_0,2686
709,709.0,81889.0,2.0,0_1,26131_0,2653
710,710.0,76674.0,2.0,0_1,26401_0,2653
711,711.0,84260.0,2.0,0_1,26831_0,2678
712,712.0,85155.0,2.0,0_1,28021_0,2756
713,713.0,94148.0,2.0,0_1,28281_0,2798
714,714.0,87815.0,2.0,0_1,28941_0,2903
715,715.0,77552.0,2.0,0_1,29191_0,2960
716,716.0,93221.0,2.0,0_1,28891_0,2963
717,717.0,79895.0,2.0,0_1,28941_0,2969
718,718.0,94164.0,2.0,0_1,28431_0,2979
719,719.0,93487.0,2.0,0_1,28901_0,2987
720,720.0,95877.0,2.0,0_1,29361_0,3000
721,721.0,97487.0,2.0,0_1,30101_0,3010
722,722.0,90305.0,2.0,0_1,30791_0,3022
723,723.0,86610.0,2.0,0_1,30721_0,2992
724,724.0,75685.0,2.0,0_1,30021_0,2911
725,725.0,73218.0,2.0,0_1,29411_0,2822
726,726.0,77527.0,2.0,0_1,28671_0,2783
727,727.0,72863.0,2.0,0_1,28561_0,2728
728,728.0,72118.0,2.0,0_1,27561_0,2604
729,729.0,74561.0,2.0,0_1,26771_0,2532
730,730.0,73519.0,2.0,0_1,26751_0,2549
731,731.0,81285.0,2.0,0_1,26881_0,2633
732,732.0,97347.0,2.0,0_1,27061_0,2625
733,733.0,86258.0,2.0,0_1,27251_0,2696
734,734.0,84065.0,2.0,0_1,27451_0,2774
735,735.0,85250.0,2.0,0_1,27891_0,2829
736,736.0,93752.0,2.0,0_1,28231_0,2830
737,737.0,80735.0,2.0,0_1,28751_0,2926
738,738.0,93716.0,2.0,0_1,28881_0,2946
739,739.0,76415.0,2.0,0_1,29281_0,3026
740,740.0,98321.0,2.0,0_1,29421_0,3027
741,741.0,87271.0,2.0,0_1,29411_0,3024
742,742.0,96469.0,2.0,0_1,29651_0,3028
743,743.0,92720.0,2.0,0_1,29591_0,3039
744,744.0,87031.0,2.0,0_1,29221_0,3009
745,745.0,75882.0,2.0,0_1,29091_0,2970
746,746.0,79945.0,2.0,0_1,28921_0,2938
747,747.0,87750.0,2.0,0_1,28631_0,2868
748,748.0,76696.0,2.0,0_1,28381_0,2827
749,749.0,79772.0,2.0,0_1,27901_0,2816
750,750.0,77753.0,2.0,0_1,27711_0,2782
751,751.0,82867.0,2.0,0_1,27721_0,2766
752,752.0,92239.0,2.0,0_1,28291_0,2787
753,753.0,89390.0,2.0,0_1,28301_0,2865
754,754.0,93213.0,2.0,0_1,28761_0,2917
755,755.0,88655.0,2.0,0_1,28361_0,2928
756,756.0,96383.0,2.0,0_1,28951_0,2983
757,757.0,89716.0,2.0,0_1,28861_0,3007
758,758.0,90030.0,2.0,0_1,28661_0,2965
759,759.0,75277.0,2.0,0_1,28871_0,3003
760,760.0,86739.0,2.0,0_1,28821_0,2955
761,761.0,87223.0,2.0,0_1,29151_0,2956
762,762.0,80268.0,2.0,0_1,28221_0,2891
763,763.0,77937.0,2.0,0_1,28331_0,2861
764,764.0,85924.0,2.0,0_1,28951_0,2859
765,765.0,92216.0,2.0,0_1,28431_0,2853
766,766.0,81996.0,2.0,0_1,27841_0,2806
767,767.0,69404.0,2.0,0_1,27691_0,2766
768,768.0,86882.0,2.0,0_1,27741_0,2758
769,769.0,81104.0,2.0,0_1,27181_0,2729
770,770.0,73328.0,2.0,0_1,26861_0,2668
771,771.0,79004.0,2.0,0_1,26661_0,2650
772,772.0,80170.0,2.0,0_1,27081_0,2660
773,773.0,80907.0,2.0,0_1,26711_0,2641
774,774.0,79264.0,2.0,0_1,27001_0,2607
775,775.0,86777.0,2.0,0_1,27691_0,2642
776,776.0,88647.0,2.0,0_1,27881_0,2661
777,777.0,83682.0,2.0,0_1,27831_0,2709
778,778.0,86013.0,2.0,0_1,28071_0,2708
779,779.0,79285.0,2.0,0_1,28481_0,2734
780,780.0,84728.0,2.0,0_1,28771_0,2762
781,781.0,90451.0,2.0,0_1,28461_0,2830
782,782.0,88253.0,2.0,0_1,28851_0,2859
783,783.0,91086.0,2.0,0_1,29121_0,2856
784,784.0,79717.0,2.0,0_1,28811_0,2889
785,785.0,81196.0,2.0,0_1,28631_0,2885
786,786.0,94628.0,2.0,0_1,28411_0,2880
787,787.0,74122.0,2.0,0_1,28111_0,2880
788,788.0,75515.0,2.0,0_1,27991_0,2881
789,789.0,77613.0,2.0,0_1,27291_0,2850
790,790.0,76549.0,2.0,0_1,26831_0,2794
791,791.0,75425.0,2.0,0_1,26511_0,2723
792,792.0,79239.0,2.0,0_1,26471_0,2721
793,793.0,76581.0,2.0,0_1,25821_0,2657
794,794.0,78541.0,2.0,0_1,26601_0,2663
795,795.0,87850.0,2.0,0_1,26741_0,2692
796,796.0,88126.0,2.0,0_1,27231_0,2730
797,797.0,88047.0,2.0,0_1,27871_0,2784
798,798.0,85711.0,2.0,0_1,27861_0,2770
799,799.0,84525.0,2.0,0_1,28261_0,2801
800,800.0,85508.0,2.0,0_1,28901_0,2848
801,801.0,89147.0,2.0,0_1,29471_0,2855
802,802.0,87420.0,2.0,0_1,29641_0,2899
803,803.0,93848.0,2.0,0_1,29951_0,2974
804,804.0,87490.0,2.0,0_1,30001_0,3023
805,805.0,93383.0,2.0,0_1,29591_0,3053
806,806.0,91249.0,2.0,0_1,29891_0,3058
807,807.0,100414.0,2.0,0_1,30271_0,3076
808,808.0,93708.0,2.0,0_1,30401_0,3124
809,809.0,95853.0,2.0,0_1,30481_0,3183
810,810.0,91694.0,2.0,0_1,30341_0,3183
811,811.0,92584.0,2.0,0_1,30941_0,3189
812,812.0,96226.0,2.0,0_1,31331_0,3202
813,813.0,86815.0,2.0,0_1,31711_0,3193
814,814.0,96471.0,2.0,0_1,31661_0,3143
815,815.0,93618.0,2.0,0_1,31431_0,3131
816,816.0,96004.0,2.0,0_1,31001_0,3144
817,817.0,90676.0,2.0,0_1,30671_0,3180
818,818.0,80993.0,2.0,0_1,30471_0,3105
819,819.0,79142.0,2.0,0_1,30011_0,3025
820,820.0,84422.0,2.0,0_1,30171_0,3038
821,821.0,92204.0,2.0,0_1,29821_0,2990
822,822.0,93825.0,2.0,0_1,29681_0,2992
823,823.0,88505.0,2.0,0_1,30311_0,2995
824,824.0,97777.0,2.0,0_1,30791_0,3043
825,825.0,84011.0,2.0,0_1,30641_0,3000
826,826.0,73359.0,2.0,0_1,30471_0,2965
827,827.0,87856.0,2.0,0_1,30311_0,2911
828,828.0,90247.0,2.0,0_1,30171_0,2902
829,829.0,86860.0,2.0,0_1,29811_0,2892
830,830.0,98973.0,2.0,0_1,30401_0,2992
831,831.0,100187.0,2.0,0_1,30271_0,2997
832,832.0,87716.0,2.0,0_1,29411_0,2992
833,833.0,84047.0,2.0,0_1,29691_0,2975
834,834.0,89594.0,2.0,0_1,29921_0,3035
835,835.0,98103.0,2.0,0_1,30081_0,3061
836,836.0,88234.0,2.0,0_1,30091_0,3090
837,837.0,89359.0,2.0,0_1,30051_0,3096
838,838.0,89210.0,2.0,0_1,30251_0,3132
839,839.0,98400.0,2.0,0_1,30391_0,3085
840,840.0,91415.0,2.0,0_1,30531_0,3077
841,841.0,99946.0,2.0,0_1,31081_0,3137
842,842.0,91819.0,2.0,0_1,31101_0,3153
843,843.0,94468.0,2.0,0_1,31021_0,3145
844,844.0,88685.0,2.0,0_1,31141_0,3156
845,845.0,81841.0,2.0,0_1,31281_0,3121
846,846.0,92700.0,2.0,0_1,30721_0,3124
847,847.0,86131.0,2.0,0_1,30781_0,3090
848,848.0,90957.0,2.0,0_1,30741_0,3116
849,849.0,102111.0,2.0,0_1,31041_0,3111
850,850.0,87111.0,2.0,0_1,30881_0,3073
851,851.0,92797.0,2.0,0_1,31311_0,3029
852,852.0,93326.0,2.0,0_1,31621_0,3082
853,853.0,94073.0,2.0,0_1,31191_0,3116
854,854.0,99975.0,2.0,0_1,31081_0,3111
855,855.0,94250.0,2.0,0_1,31351_0,3112
856,856.0,83836.0,2.0,0_1,30791_0,3035
857,857.0,79444.0,2.0,0_1,30971_0,3094
858,858.0,89546.0,2.0,0_1,30801_0,3091
859,859.0,81747.0,2.0,0_1,30821_0,2997
860,860.0,79316.0,2.0,0_1,29941_0,2943
861,861.0,81266.0,2.0,0_1,29461_0,2935
862,862.0,86274.0,2.0,0_1,28871_0,2876
863,863.0,86684.0,2.0,0_1,28781_0,2858
864,864.0,88734.0,2.0,0_1,28331_0,2827
865,865.0,87660.0,2.0,0_1,27921_0,2794
866,866.0,76323.0,2.0,0_1,27651_0,2761
867,867.0,73786.0,2.0,0_1,27141_0,2666
868,868.0,58883.0,2.0,0_1,26441_0,2570
869,869.0,79558.0,2.0,0_1,26331_0,2584
870,870.0,82737.0,2.0,0_1,26271_0,2567
871,871.0,82411.0,2.0,0_1,26231_0,2617
872,872.0,75933.0,2.0,0_1,26401_0,2660
873,873.0,79784.0,2.0,0_1,26281_0,2696
874,874.0,85939.0,2.0,0_1,26661_0,2664
875,875.0,82884.0,2.0,0_1,26751_0,2651
876,876.0,75091.0,2.0,0_1,26741_0,2653
877,877.0,77924.0,2.0,0_1,26541_0,2615
878,878.0,75158.0,2.0,0_1,26371_0,2610
879,879.0,78197.0,2.0,0_1,26211_0,2622
880,880.0,73241.0,2.0,0_1,26421_0,2613
881,881.0,79750.0,2.0,0_1,25751_0,2592
882,882.0,69597.0,2.0,0_1,26481_0,2642
883,883.0,89420.0,2.0,0_1,26811_0,2599
884,884.0,80303.0,2.0,0_1,26541_0,2550
885,885.0,69424.0,2.0,0_1,26241_0,2605
886,886.0,78160.0,2.0,0_1,26281_0,2567
887,887.0,78165.0,2.0,0_1,25811_0,2571
888,888.0,70832.0,2.0,0_1,25761_0,2533
889,889.0,76335.0,2.0,0_1,25561_0,2513
890,890.0,62990.0,2.0,0_1,25281_0,2508
891,891.0,73127.0,2.0,0_1,24911_0,2481
892,892.0,73354.0,2.0,0_1,25171_0,2491
893,893.0,89017.0,2.0,0_1,25271_0,2470
894,894.0,62981.0,2.0,0_1,24691_0,2499
895,895.0,75362.0,2.0,0_1,24531_0,2494
896,896.0,64949.0,2.0,0_1,24141_0,2475
897,897.0,76561.0,2.0,0_1,24081_0,2426
898,898.0,73089.0,2.0,0_1,23961_0,2479
899,899.0,78027.0,2.0,0_1,24211_0,2498
900,900.0,75669.0,2.0,0_1,24751_0,2502
901,901.0,74084.0,2.0,0_1,24871_0,2498
902,902.0,78864.0,2.0,0_1,25521_0,2496
903,903.0,84672.0,2.0,0_1,25121_0,2500
904,904.0,66228.0,2.0,0_1,25281_0,2555
905,905.0,76079.0,2.0,0_1,25531_0,2589
906,906.0,83437.0,2.0,0_1,25431_0,2636
907,907.0,82316.0,2.0,0_1,25961_0,2663
908,908.0,79905.0,2.0,0_1,26491_0,2679
909,909.0,72199.0,2.0,0_1,26791_0,2657
910,910.0,84862.0,2.0,0_1,26881_0,2652
911,911.0,78792.0,2.0,0_1,26891_0,2694
912,912.0,82709.0,2.0,0_1,26841_0,2664
913,913.0,74324.0,2.0,0_1,26881_0,2650
914,914.0,69022.0,2.0,0_1,26521_0,2655
915,915.0,79081.0,2.0,0_1,26091_0,2568
916,916.0,69130.0,2.0,0_1,25941_0,2578
917,917.0,83224.0,2.0,0_1,26261_0,2608
918,918.0,82720.0,2.0,0_1,26441_0,2614
919,919.0,74556.0,2.0,0_1,26561_0,2582
920,920.0,80215.0,2.0,0_1,26671_0,2613
921,921.0,82017.0,2.0,0_1,27231_0,2631
922,922.0,88181.0,2.0,0_1,27401_0,2643
923,923.0,88163.0,2.0,0_1,26871_0,2688
924,924.0,81466.0,2.0,0_1,26651_0,2653
925,925.0,63184.0,2.0,0_1,26531_0,2640
926,926.0,77049.0,2.0,0_1,26601_0,2624
927,927.0,79310.0,2.0,0_1,26371_0,2604
928,928.0,69104.0,2.0,0_1,26161_0,2611
929,929.0,73985.0,2.0,0_1,26371_0,2658
930,930.0,83926.0,2.0,0_1,26391_0,2633
931,931.0,73708.0,2.0,0_1,25991_0,2597
932,932.0,70926.0,2.0,0_1,25821_0,2592
933,933.0,83755.0,2.0,0_1,25681_0,2597
934,934.0,76283.0,2.0,0_1,25701_0,2569
935,935.0,74167.0,2.0,0_1,25751_0,2527
936,936.0,70940.0,2.0,0_1,25921_0,2536
937,937.0,76018.0,2.0,0_1,25331_0,2526
938,938.0,60847.0,2.0,0_1,24841_0,2525
939,939.0,80176.0,2.0,0_1,24561_0,2536
940,940.0,73302.0,2.0,0_1,24641_0,2536
941,941.0,73699.0,2.0,0_1,24751_0,2560
942,942.0,78326.0,2.0,0_1,24601_0,2495
943,943.0,81005.0,2.0,0_1,24881_0,2492
944,944.0,76467.0,2.0,0_1,24871_0,2504
945,945.0,65505.0,2.0,0_1,24671_0,2491
946,946.0,72724.0,2.0,0_1,24521_0,2491
947,947.0,81169.0,2.0,0_1,24921_0,2517
948,948.0,76394.0,2.0,0_1,24941_0,2481
949,949.0,68120.0,2.0,0_1,25101_0,2468
950,950.0,74753.0,2.0,0_1,25371_0,2482
951,951.0,73471.0,2.0,0_1,25351_0,2504
952,952.0,71418.0,2.0,0_1,24791_0,2488
953,953.0,79894.0,2.0,0_1,24781_0,2487
954,954.0,68213.0,2.0,0_1,24721_0,2512
955,955.0,71835.0,2.0,0_1,24531_0,2531
956,956.0,72635.0,2.0,0_1,24541_0,2558
957,957.0,76971.0,2.0,0_1,24401_0,2554
958,958.0,69229.0,2.0,0_1,24171_0,2515
959,959.0,76538.0,2.0,0_1,24141_0,2486
960,960.0,74478.0,2.0,0_1,24261_0,2498
961,961.0,75257.0,2.0,0_1,24221_0,2494
962,962.0,73066.0,2.0,0_1,24681_0,2469
963,963.0,75467.0,2.0,0_1,24351_0,2480
964,964.0,78918.0,2.0,0_1,24331_0,2480
965,965.0,74990.0,2.0,0_1,24401_0,2525
966,966.0,81550.0,2.0,0_1,24651_0,2529
967,967.0,74536.0,2.0,0_1,25281_0,2610
968,968.0,83289.0,2.0,0_1,25371_0,2652
969,969.0,75633.0,2.0,0_1,25511_0,2672
970,970.0,86236.0,2.0,0_1,25871_0,2701
971,971.0,75764.0,2.0,0_1,26021_0,2664
972,972.0,77194.0,2.0,0_1,26501_0,2637
973,973.0,73478.0,2.0,0_1,26681_0,2646
974,974.0,80270.0,2.0,0_1,26741_0,2685
975,975.0,74876.0,2.0,0_1,26251_0,2653
976,976.0,74157.0,2.0,0_1,25701_0,2658
977,977.0,66352.0,2.0,0_1,25121_0,2610
978,978.0,65172.0,2.0,0_1,24301_0,2556
979,979.0,66551.0,2.0,0_1,23901_0,2545
980,980.0,77232.0,2.0,0_1,23211_0,2523
981,981.0,71203.0,2.0,0_1,22661_0,2485
982,982.0,64197.0,2.0,0_1,22241_0,2415
983,983.0,62444.0,2.0,0_1,21961_0,2396
984,984.0,76672.0,2.0,0_1,22101_0,2381
985,985.0,66972.0,2.0,0_1,22601_0,2373
986,986.0,65118.0,2.0,0_1,22621_0,2338
987,987.0,74437.0,2.0,0_1,22781_0,2386
988,988.0,78443.0,2.0,0_1,23351_0,2438
989,989.0,75033.0,2.0,0_1,23851_0,2401
990,990.0,58162.0,2.0,0_1,23751_0,2405
991,991.0,65384.0,2.0,0_1,23311_0,2383
992,992.0,66674.0,2.0,0_1,23351_0,2410
993,993.0,69455.0,2.0,0_1,23321_0,2341
994,994.0,71668.0,2.0,0_1,23091_0,2300
995,995.0,65091.0,2.0,0_1,23271_0,2234
996,996.0,61607.0,2.0,0_1,23121_0,2262
997,997.0,71937.0,2.0,0_1,22811_0,2248
998,998.0,60358.0,2.0,0_1,22551_0,2229
999,999.0,71424.0,2.0,0_1,22651_0,2192
