0,0.0,0.0,2.0,0_1,721_0,99
1,1.0,6228.0,2.0,0_1,941_0,119
2,2.0,4093.0,2.0,0_1,881_0,116
3,3.0,3255.0,2.0,0_1,921_0,107
4,4.0,4174.0,2.0,0_1,1041_0,104
5,5.0,5090.0,2.0,0_1,1041_0,113
6,6.0,3652.0,2.0,0_1,1051_0,110
7,7.0,4338.0,2.0,0_1,1161_0,106
8,8.0,5399.0,2.0,0_1,1311_0,111
9,9.0,5079.0,2.0,0_1,1381_0,114
10,10.0,5224.0,2.0,0_1,1391_0,126
11,11.0,4571.0,2.0,0_1,1441_0,130
12,12.0,5139.0,2.0,0_1,1491_0,136
13,13.0,6653.0,2.0,0_1,1591_0,142
14,14.0,6929.0,2.0,0_1,1671_0,152
15,15.0,5981.0,2.0,0_1,1771_0,157
16,16.0,6657.0,2.0,0_1,1751_0,161
17,17.0,6780.0,2.0,0_1,1751_0,171
18,18.0,5898.0,2.0,0_1,1811_0,179
19,19.0,7101.0,2.0,0_1,1801_0,186
20,20.0,5127.0,2.0,0_1,1831_0,181
21,21.0,6367.0,2.0,0_1,1901_0,183
22,22.0,8010.0,2.0,0_1,1891_0,188
23,23.0,8070.0,2.0,0_1,1921_0,192
24,24.0,7120.0,2.0,0_1,1991_0,208
25,25.0,8921.0,2.0,0_1,1991_0,223
26,26.0,7552.0,2.0,0_1,2081_0,232
27,27.0,7998.0,2.0,0_1,2161_0,245
28,28.0,8707.0,2.0,0_1,2281_0,256
29,29.0,7675.0,2.0,0_1,2351_0,253
30,30.0,10226.0,2.0,0_1,2401_0,266
31,31.0,9753.0,2.0,0_1,2541_0,287
32,32.0,9913.0,2.0,0_1,2611_0,293
33,33.0,9385.0,2.0,0_1,2581_0,288
34,34.0,7740.0,2.0,0_1,2601_0,290
35,35.0,8850.0,2.0,0_1,2611_0,293
36,36.0,11547.0,2.0,0_1,2761_0,299
37,37.0,9907.0,2.0,0_1,2841_0,305
38,38.0,10209.0,2.0,0_1,2911_0,298
39,39.0,8025.0,2.0,0_1,3001_0,300
40,40.0,11298.0,2.0,0_1,3131_0,315
41,41.0,11929.0,2.0,0_1,3261_0,331
42,42.0,14653.0,2.0,0_1,3411_0,340
43,43.0,12817.0,2.0,0_1,3611_0,344
44,44.0,11940.0,2.0,0_1,3731_0,360
45,45.0,11407.0,2.0,0_1,3731_0,366
46,46.0,10655.0,2.0,0_1,3801_0,373
47,47.0,12710.0,2.0,0_1,3851_0,372
48,48.0,12642.0,2.0,0_1,3961_0,365
49,49.0,15395.0,2.0,0_1,4111_0,379
50,50.0,15290.0,2.0,0_1,4171_0,383
51,51.0,12606.0,2.0,0_1,4161_0,382
52,52.0,12411.0,2.0,0_1,4171_0,392
53,53.0,13239.0,2.0,0_1,4311_0,391
54,54.0,15050.0,2.0,0_1,4381_0,395
55,55.0,15875.0,2.0,0_1,4511_0,411
56,56.0,16323.0,2.0,0_1,4711_0,418
57,57.0,15168.0,2.0,0_1,4801_0,429
58,58.0,13540.0,2.0,0_1,4911_0,438
59,59.0,17077.0,2.0,0_1,5061_0,462
60,60.0,16088.0,2.0,0_1,5171_0,466
61,61.0,15134.0,2.0,0_1,5271_0,484
62,62.0,18018.0,2.0,0_1,5361_0,502
63,63.0,16867.0,2.0,0_1,5421_0,492
64,64.0,15769.0,2.0,0_1,5381_0,492
65,65.0,15240.0,2.0,0_1,5301_0,501
66,66.0,15761.0,2.0,0_1,5311_0,521
67,67.0,18114.0,2.0,0_1,5211_0,513
68,68.0,14485.0,2.0,0_1,5221_0,515
69,69.0,15393.0,2.0,0_1,5141_0,511
70,70.0,16769.0,2.0,0_1,5131_0,515
71,71.0,14749.0,2.0,0_1,5231_0,536
72,72.0,17192.0,2.0,0_1,5301_0,541
73,73.0,15847.0,2.0,0_1,5391_0,543
74,74.0,14977.0,2.0,0_1,5331_0,562
75,75.0,15095.0,2.0,0_1,5351_0,561
76,76.0,13719.0,2.0,0_1,5341_0,570
77,77.0,17547.0,2.0,0_1,5301_0,574
78,78.0,15062.0,2.0,0_1,5331_0,573
79,79.0,17030.0,2.0,0_1,5491_0,571
80,80.0,15214.0,2.0,0_1,5441_0,568
81,81.0,17281.0,2.0,0_1,5551_0,563
82,82.0,21376.0,2.0,0_1,5681_0,566
83,83.0,17326.0,2.0,0_1,5801_0,567
84,84.0,19469.0,2.0,0_1,5871_0,578
85,85.0,21025.0,2.0,0_1,6021_0,596
86,86.0,20509.0,2.0,0_1,6121_0,606
87,87.0,20056.0,2.0,0_1,6251_0,630
88,88.0,21184.0,2.0,0_1,6331_0,663
89,89.0,22963.0,2.0,0_1,6331_0,667
90,90.0,22918.0,2.0,0_1,6541_0,667
91,91.0,20525.0,2.0,0_1,6691_0,673
92,92.0,22521.0,2.0,0_1,6811_0,679
93,93.0,20215.0,2.0,0_1,6881_0,702
94,94.0,22930.0,2.0,0_1,7031_0,702
95,95.0,18929.0,2.0,0_1,7051_0,712
96,96.0,20813.0,2.0,0_1,7311_0,687
97,97.0,21784.0,2.0,0_1,7441_0,682
98,98.0,26305.0,2.0,0_1,7531_0,680
99,99.0,19188.0,2.0,0_1,7591_0,684
100,100.0,22087.0,2.0,0_1,7541_0,708
101,101.0,22720.0,2.0,0_1,7641_0,720
102,102.0,21822.0,2.0,0_1,7671_0,735
103,103.0,24410.0,2.0,0_1,7831_0,727
104,104.0,21217.0,2.0,0_1,8101_0,709
105,105.0,25173.0,2.0,0_1,7961_0,714
106,106.0,20310.0,2.0,0_1,8031_0,722
107,107.0,19454.0,2.0,0_1,7901_0,718
108,108.0,26583.0,2.0,0_1,8101_0,727
109,109.0,22505.0,2.0,0_1,7931_0,734
110,110.0,22877.0,2.0,0_1,7971_0,764
111,111.0,24141.0,2.0,0_1,8181_0,785
112,112.0,27070.0,2.0,0_1,8251_0,800
113,113.0,27026.0,2.0,0_1,8271_0,816
114,114.0,27094.0,2.0,0_1,8321_0,840
115,115.0,26295.0,2.0,0_1,8381_0,851
116,116.0,28036.0,2.0,0_1,8641_0,855
117,117.0,30341.0,2.0,0_1,8521_0,868
118,118.0,24079.0,2.0,0_1,8391_0,886
119,119.0,24891.0,2.0,0_1,8391_0,897
120,120.0,24070.0,2.0,0_1,8601_0,892
121,121.0,28421.0,2.0,0_1,8721_0,914
122,122.0,25664.0,2.0,0_1,8981_0,931
123,123.0,31803.0,2.0,0_1,9021_0,920
124,124.0,26827.0,2.0,0_1,9031_0,929
125,125.0,24540.0,2.0,0_1,9241_0,926
126,126.0,27303.0,2.0,0_1,9121_0,928
127,127.0,26140.0,2.0,0_1,9521_0,939
128,128.0,31045.0,2.0,0_1,9661_0,956
129,129.0,31651.0,2.0,0_1,9751_0,936
130,130.0,27468.0,2.0,0_1,9811_0,930
131,131.0,30857.0,2.0,0_1,9641_0,928
132,132.0,23362.0,2.0,0_1,9601_0,921
133,133.0,29543.0,2.0,0_1,9581_0,922
134,134.0,27647.0,2.0,0_1,9671_0,921
135,135.0,30440.0,2.0,0_1,9801_0,932
136,136.0,30491.0,2.0,0_1,9941_0,920
137,137.0,31366.0,2.0,0_1,9991_0,927
138,138.0,33984.0,2.0,0_1,9851_0,944
139,139.0,33492.0,2.0,0_1,10031_0,970
140,140.0,29274.0,2.0,0_1,10251_0,969
141,141.0,30135.0,2.0,0_1,10501_0,994
142,142.0,26343.0,2.0,0_1,10361_0,992
143,143.0,29127.0,2.0,0_1,10501_0,978
144,144.0,34167.0,2.0,0_1,10421_0,1004
145,145.0,31703.0,2.0,0_1,10601_0,1009
146,146.0,34336.0,2.0,0_1,10711_0,1004
147,147.0,28088.0,2.0,0_1,10761_0,1032
148,148.0,31172.0,2.0,0_1,10681_0,1069
149,149.0,35361.0,2.0,0_1,10541_0,1052
150,150.0,28345.0,2.0,0_1,10491_0,1059
151,151.0,33503.0,2.0,0_1,10701_0,1060
152,152.0,30498.0,2.0,0_1,10681_0,1048
153,153.0,31831.0,2.0,0_1,10771_0,1036
154,154.0,28968.0,2.0,0_1,11011_0,1034
155,155.0,31128.0,2.0,0_1,10881_0,1035
156,156.0,32664.0,2.0,0_1,10841_0,1026
157,157.0,28472.0,2.0,0_1,10741_0,1057
158,158.0,31867.0,2.0,0_1,10511_0,1053
159,159.0,29627.0,2.0,0_1,10511_0,1035
160,160.0,30425.0,2.0,0_1,10761_0,1054
161,161.0,36441.0,2.0,0_1,10641_0,1056
162,162.0,37761.0,2.0,0_1,10601_0,1057
163,163.0,31463.0,2.0,0_1,10471_0,1082
164,164.0,30853.0,2.0,0_1,10311_0,1100
165,165.0,35088.0,2.0,0_1,10481_0,1102
166,166.0,33314.0,2.0,0_1,10791_0,1127
167,167.0,33805.0,2.0,0_1,10961_0,1131
168,168.0,33378.0,2.0,0_1,10851_0,1131
169,169.0,26576.0,2.0,0_1,10501_0,1141
170,170.0,39622.0,2.0,0_1,10861_0,1132
171,171.0,34439.0,2.0,0_1,11041_0,1157
172,172.0,35046.0,2.0,0_1,11051_0,1145
173,173.0,28523.0,2.0,0_1,10971_0,1141
174,174.0,34640.0,2.0,0_1,11141_0,1128
175,175.0,37894.0,2.0,0_1,11191_0,1133
176,176.0,35846.0,2.0,0_1,11261_0,1140
177,177.0,36359.0,2.0,0_1,11581_0,1150
178,178.0,38372.0,2.0,0_1,11491_0,1122
179,179.0,32844.0,2.0,0_1,11621_0,1134
180,180.0,33171.0,2.0,0_1,11971_0,1130
181,181.0,31553.0,2.0,0_1,12051_0,1135
182,182.0,33816.0,2.0,0_1,11941_0,1128
183,183.0,37348.0,2.0,0_1,11831_0,1129
184,184.0,36445.0,2.0,0_1,11661_0,1130
185,185.0,35108.0,2.0,0_1,11731_0,1144
186,186.0,38564.0,2.0,0_1,11941_0,1176
187,187.0,37922.0,2.0,0_1,12191_0,1182
188,188.0,39769.0,2.0,0_1,12531_0,1199
189,189.0,39706.0,2.0,0_1,12601_0,1215
190,190.0,37430.0,2.0,0_1,12781_0,1255
191,191.0,42964.0,2.0,0_1,12961_0,1278
192,192.0,37787.0,2.0,0_1,13221_0,1294
193,193.0,40138.0,2.0,0_1,13321_0,1307
194,194.0,41533.0,2.0,0_1,13091_0,1312
195,195.0,39372.0,2.0,0_1,13261_0,1323
196,196.0,37204.0,2.0,0_1,12861_0,1305
197,197.0,36875.0,2.0,0_1,12861_0,1287
198,198.0,38599.0,2.0,0_1,12881_0,1281
199,199.0,43017.0,2.0,0_1,12881_0,1286
200,200.0,39733.0,2.0,0_1,12861_0,1337
201,201.0,40654.0,2.0,0_1,13091_0,1369
202,202.0,39645.0,2.0,0_1,13291_0,1381
203,203.0,39254.0,2.0,0_1,13491_0,1393
204,204.0,44019.0,2.0,0_1,13561_0,1351
205,205.0,36866.0,2.0,0_1,13671_0,1364
206,206.0,37471.0,2.0,0_1,13631_0,1345
207,207.0,43295.0,2.0,0_1,13731_0,1337
208,208.0,42198.0,2.0,0_1,13821_0,1350
209,209.0,41763.0,2.0,0_1,13831_0,1356
210,210.0,42342.0,2.0,0_1,14171_0,1366
211,211.0,48864.0,2.0,0_1,14531_0,1375
212,212.0,42502.0,2.0,0_1,14551_0,1425
213,213.0,47805.0,2.0,0_1,14401_0,1435
214,214.0,36695.0,2.0,0_1,14381_0,1416
215,215.0,37115.0,2.0,0_1,14361_0,1416
216,216.0,42700.0,2.0,0_1,14301_0,1439
217,217.0,44429.0,2.0,0_1,14291_0,1451
218,218.0,36139.0,2.0,0_1,14301_0,1445
219,219.0,42034.0,2.0,0_1,14401_0,1419
220,220.0,45738.0,2.0,0_1,14821_0,1443
221,221.0,49180.0,2.0,0_1,14701_0,1449
222,222.0,39800.0,2.0,0_1,14891_0,1438
223,223.0,44415.0,2.0,0_1,14891_0,1441
224,224.0,45339.0,2.0,0_1,14891_0,1452
225,225.0,39742.0,2.0,0_1,14771_0,1444
226,226.0,38652.0,2.0,0_1,14861_0,1427
227,227.0,38398.0,2.0,0_1,14831_0,1432
228,228.0,44657.0,2.0,0_1,14701_0,1438
229,229.0,40623.0,2.0,0_1,15031_0,1516
230,230.0,46539.0,2.0,0_1,14871_0,1506
231,231.0,36162.0,2.0,0_1,14671_0,1513
232,232.0,41470.0,2.0,0_1,14391_0,1520
233,233.0,46631.0,2.0,0_1,14161_0,1473
234,234.0,37908.0,2.0,0_1,14221_0,1448
235,235.0,46384.0,2.0,0_1,14481_0,1460
236,236.0,52028.0,2.0,0_1,14411_0,1498
237,237.0,39587.0,2.0,0_1,14221_0,1456
238,238.0,43785.0,2.0,0_1,14141_0,1431
239,239.0,39867.0,2.0,0_1,13881_0,1417
240,240.0,44919.0,2.0,0_1,13991_0,1393
241,241.0,39385.0,2.0,0_1,14121_0,1399
242,242.0,38518.0,2.0,0_1,14601_0,1410
243,243.0,44849.0,2.0,0_1,14761_0,1407
244,244.0,43300.0,2.0,0_1,14661_0,1412
245,245.0,43401.0,2.0,0_1,14671_0,1423
246,246.0,35396.0,2.0,0_1,14501_0,1382
247,247.0,37236.0,2.0,0_1,14371_0,1409
248,248.0,42983.0,2.0,0_1,14771_0,1462
249,249.0,48503.0,2.0,0_1,14451_0,1457
250,250.0,37083.0,2.0,0_1,14501_0,1439
251,251.0,45342.0,2.0,0_1,14921_0,1483
252,252.0,51321.0,2.0,0_1,15661_0,1533
253,253.0,53435.0,2.0,0_1,15941_0,1546
254,254.0,48497.0,2.0,0_1,16211_0,1588
255,255.0,52922.0,2.0,0_1,16361_0,1578
256,256.0,53589.0,2.0,0_1,16261_0,1589
257,257.0,45465.0,2.0,0_1,16231_0,1575
258,258.0,40595.0,2.0,0_1,16001_0,1532
259,259.0,43004.0,2.0,0_1,15431_0,1534
260,260.0,41239.0,2.0,0_1,15231_0,1508
261,261.0,46381.0,2.0,0_1,15681_0,1537
262,262.0,52964.0,2.0,0_1,15861_0,1559
263,263.0,49331.0,2.0,0_1,15991_0,1563
264,264.0,45929.0,2.0,0_1,16011_0,1589
265,265.0,49517.0,2.0,0_1,16221_0,1575
266,266.0,56262.0,2.0,0_1,16491_0,1595
267,267.0,53526.0,2.0,0_1,16921_0,1659
268,268.0,58497.0,2.0,0_1,17321_0,1709
269,269.0,53226.0,2.0,0_1,17601_0,1710
270,270.0,54311.0,2.0,0_1,18131_0,1724
271,271.0,54413.0,2.0,0_1,18311_0,1743
272,272.0,47096.0,2.0,0_1,18271_0,1747
273,273.0,52810.0,2.0,0_1,18081_0,1760
274,274.0,49857.0,2.0,0_1,18141_0,1775
275,275.0,51729.0,2.0,0_1,18061_0,1781
276,276.0,57445.0,2.0,0_1,18111_0,1823
277,277.0,51274.0,2.0,0_1,17841_0,1807
278,278.0,47394.0,2.0,0_1,17491_0,1792
279,279.0,48224.0,2.0,0_1,17391_0,1782
280,280.0,56715.0,2.0,0_1,17561_0,1788
281,281.0,56933.0,2.0,0_1,17671_0,1774
282,282.0,42725.0,2.0,0_1,17511_0,1771
283,283.0,53627.0,2.0,0_1,17501_0,1758
284,284.0,47397.0,2.0,0_1,17351_0,1741
285,285.0,47516.0,2.0,0_1,17001_0,1730
286,286.0,44236.0,2.0,0_1,17081_0,1728
287,287.0,52144.0,2.0,0_1,17621_0,1739
288,288.0,52812.0,2.0,0_1,17721_0,1735
289,289.0,47134.0,2.0,0_1,17161_0,1752
290,290.0,53981.0,2.0,0_1,17121_0,1731
291,291.0,55598.0,2.0,0_1,17071_0,1757
292,292.0,51491.0,2.0,0_1,17421_0,1817
293,293.0,49699.0,2.0,0_1,17541_0,1797
294,294.0,56418.0,2.0,0_1,17961_0,1782
295,295.0,53837.0,2.0,0_1,17771_0,1759
296,296.0,52189.0,2.0,0_1,18111_0,1792
297,297.0,59080.0,2.0,0_1,17831_0,1764
298,298.0,50794.0,2.0,0_1,17721_0,1718
299,299.0,50664.0,2.0,0_1,17461_0,1708
300,300.0,51439.0,2.0,0_1,17571_0,1738
301,301.0,51529.0,2.0,0_1,17741_0,1779
302,302.0,59565.0,2.0,0_1,17591_0,1761
303,303.0,52751.0,2.0,0_1,18291_0,1773
304,304.0,60283.0,2.0,0_1,18241_0,1801
305,305.0,54192.0,2.0,0_1,18131_0,1799
306,306.0,54326.0,2.0,0_1,18291_0,1806
307,307.0,56933.0,2.0,0_1,18421_0,1829
308,308.0,54410.0,2.0,0_1,18821_0,1875
309,309.0,62485.0,2.0,0_1,19261_0,1934
310,310.0,62186.0,2.0,0_1,19251_0,1928
311,311.0,53449.0,2.0,0_1,19631_0,1925
312,312.0,59369.0,2.0,0_1,19591_0,1860
313,313.0,54589.0,2.0,0_1,19731_0,1874
314,314.0,61337.0,2.0,0_1,19751_0,1912
315,315.0,61727.0,2.0,0_1,19951_0,1939
316,316.0,61456.0,2.0,0_1,20001_0,1942
317,317.0,51907.0,2.0,0_1,19871_0,1971
318,318.0,54121.0,2.0,0_1,20051_0,2000
319,319.0,56587.0,2.0,0_1,20231_0,2012
320,320.0,60889.0,2.0,0_1,20281_0,2042
321,321.0,61041.0,2.0,0_1,20561_0,2084
322,322.0,69205.0,2.0,0_1,20471_0,2055
323,323.0,53950.0,2.0,0_1,20321_0,2076
324,324.0,60115.0,2.0,0_1,20041_0,2060
325,325.0,58899.0,2.0,0_1,20051_0,2045
326,326.0,57785.0,2.0,0_1,19831_0,2009
327,327.0,52803.0,2.0,0_1,19831_0,1994
328,328.0,57315.0,2.0,0_1,19911_0,1983
329,329.0,52899.0,2.0,0_1,19511_0,1946
330,330.0,53967.0,2.0,0_1,19481_0,1937
331,331.0,56339.0,2.0,0_1,19401_0,1906
332,332.0,53107.0,2.0,0_1,19141_0,1856
333,333.0,53297.0,2.0,0_1,18801_0,1813
334,334.0,51851.0,2.0,0_1,18451_0,1760
335,335.0,53019.0,2.0,0_1,18171_0,1752
336,336.0,49962.0,2.0,0_1,18561_0,1775
337,337.0,58616.0,2.0,0_1,18641_0,1813
338,338.0,55970.0,2.0,0_1,18791_0,1880
339,339.0,56191.0,2.0,0_1,18761_0,1892
340,340.0,60533.0,2.0,0_1,19221_0,1917
341,341.0,63873.0,2.0,0_1,19561_0,1952
342,342.0,68610.0,2.0,0_1,20141_0,1967
343,343.0,57082.0,2.0,0_1,19671_0,1981
344,344.0,57271.0,2.0,0_1,19461_0,1949
345,345.0,46522.0,2.0,0_1,20261_0,1970
346,346.0,62190.0,2.0,0_1,20481_0,2003
347,347.0,67918.0,2.0,0_1,20621_0,2037
348,348.0,63801.0,2.0,0_1,20831_0,2035
349,349.0,66118.0,2.0,0_1,21201_0,2079
350,350.0,68150.0,2.0,0_1,21581_0,2115
351,351.0,70313.0,2.0,0_1,21661_0,2143
352,352.0,63593.0,2.0,0_1,21971_0,2160
353,353.0,68382.0,2.0,0_1,22251_0,2189
354,354.0,64787.0,2.0,0_1,22191_0,2183
355,355.0,63910.0,2.0,0_1,21791_0,2119
356,356.0,57613.0,2.0,0_1,21721_0,2152
357,357.0,63993.0,2.0,0_1,22001_0,2143
358,358.0,61163.0,2.0,0_1,22111_0,2206
359,359.0,71819.0,2.0,0_1,21791_0,2208
360,360.0,65172.0,2.0,0_1,21681_0,2215
361,361.0,64059.0,2.0,0_1,22171_0,2223
362,362.0,61912.0,2.0,0_1,22041_0,2190
363,363.0,60419.0,2.0,0_1,21711_0,2158
364,364.0,60325.0,2.0,0_1,22111_0,2175
365,365.0,72636.0,2.0,0_1,22271_0,2222
366,366.0,76658.0,2.0,0_1,22461_0,2247
367,367.0,65600.0,2.0,0_1,22331_0,2269
368,368.0,64505.0,2.0,0_1,22331_0,2284
369,369.0,65704.0,2.0,0_1,21901_0,2293
370,370.0,63444.0,2.0,0_1,21511_0,2252
371,371.0,62571.0,2.0,0_1,20941_0,2212
372,372.0,56557.0,2.0,0_1,20511_0,2190
373,373.0,55436.0,2.0,0_1,20151_0,2126
374,374.0,55518.0,2.0,0_1,20061_0,2126
375,375.0,64523.0,2.0,0_1,20091_0,2122
376,376.0,61979.0,2.0,0_1,20811_0,2144
377,377.0,60406.0,2.0,0_1,21241_0,2138
378,378.0,66937.0,2.0,0_1,21471_0,2144
379,379.0,60810.0,2.0,0_1,21111_0,2124
380,380.0,51022.0,2.0,0_1,21291_0,2145
381,381.0,62074.0,2.0,0_1,21131_0,2155
382,382.0,64320.0,2.0,0_1,21271_0,2179
383,383.0,70344.0,2.0,0_1,20971_0,2154
384,384.0,59739.0,2.0,0_1,21071_0,2141
385,385.0,63113.0,2.0,0_1,21251_0,2145
386,386.0,63897.0,2.0,0_1,21581_0,2152
387,387.0,69829.0,2.0,0_1,21801_0,2160
388,388.0,60756.0,2.0,0_1,21741_0,2163
389,389.0,62721.0,2.0,0_1,22031_0,2165
390,390.0,70191.0,2.0,0_1,22391_0,2149
391,391.0,70075.0,2.0,0_1,22031_0,2163
392,392.0,69308.0,2.0,0_1,22051_0,2159
393,393.0,66759.0,2.0,0_1,22381_0,2192
394,394.0,73944.0,2.0,0_1,22351_0,2165
395,395.0,60323.0,2.0,0_1,22031_0,2156
396,396.0,63977.0,2.0,0_1,22331_0,2189
397,397.0,66316.0,2.0,0_1,22241_0,2224
398,398.0,63018.0,2.0,0_1,22221_0,2239
399,399.0,65612.0,2.0,0_1,21841_0,2187
400,400.0,53888.0,2.0,0_1,21671_0,2171
401,401.0,63042.0,2.0,0_1,21711_0,2144
402,402.0,65606.0,2.0,0_1,21781_0,2142
403,403.0,59801.0,2.0,0_1,21851_0,2149
404,404.0,59981.0,2.0,0_1,21671_0,2112
405,405.0,51323.0,2.0,0_1,21181_0,2084
406,406.0,57685.0,2.0,0_1,20901_0,2084
407,407.0,63158.0,2.0,0_1,20781_0,2077
408,408.0,55541.0,2.0,0_1,20791_0,2065
409,409.0,58876.0,2.0,0_1,20231_0,2056
410,410.0,58978.0,2.0,0_1,20231_0,2060
411,411.0,56310.0,2.0,0_1,20071_0,2003
412,412.0,53601.0,2.0,0_1,20251_0,2038
413,413.0,65725.0,2.0,0_1,20001_0,2043
414,414.0,66164.0,2.0,0_1,20391_0,2106
415,415.0,65350.0,2.0,0_1,20871_0,2123
416,416.0,68606.0,2.0,0_1,21451_0,2192
417,417.0,72845.0,2.0,0_1,21641_0,2186
418,418.0,66555.0,2.0,0_1,21881_0,2181
419,419.0,55005.0,2.0,0_1,22071_0,2163
420,420.0,63972.0,2.0,0_1,22421_0,2163
421,421.0,66003.0,2.0,0_1,22171_0,2158
422,422.0,70980.0,2.0,0_1,22361_0,2162
423,423.0,65921.0,2.0,0_1,22991_0,2194
424,424.0,71099.0,2.0,0_1,23381_0,2231
425,425.0,67231.0,2.0,0_1,23151_0,2254
426,426.0,73899.0,2.0,0_1,22671_0,2235
427,427.0,66724.0,2.0,0_1,22711_0,2269
428,428.0,68470.0,2.0,0_1,22651_0,2297
429,429.0,74371.0,2.0,0_1,22541_0,2307
430,430.0,68605.0,2.0,0_1,22231_0,2288
431,431.0,68225.0,2.0,0_1,22001_0,2239
432,432.0,48905.0,2.0,0_1,21531_0,2223
433,433.0,57101.0,2.0,0_1,21111_0,2186
434,434.0,60682.0,2.0,0_1,20611_0,2174
435,435.0,63088.0,2.0,0_1,20931_0,2219
436,436.0,61465.0,2.0,0_1,20981_0,2222
437,437.0,68347.0,2.0,0_1,21081_0,2218
438,438.0,65921.0,2.0,0_1,21341_0,2240
439,439.0,63671.0,2.0,0_1,21291_0,2246
440,440.0,58626.0,2.0,0_1,21391_0,2297
441,441.0,73476.0,2.0,0_1,21411_0,2303
442,442.0,65767.0,2.0,0_1,21381_0,2283
443,443.0,65552.0,2.0,0_1,21831_0,2257
444,444.0,61101.0,2.0,0_1,21831_0,2264
445,445.0,65322.0,2.0,0_1,21521_0,2210
446,446.0,62980.0,2.0,0_1,21341_0,2168
447,447.0,58183.0,2.0,0_1,21351_0,2169
448,448.0,62180.0,2.0,0_1,21521_0,2145
449,449.0,65721.0,2.0,0_1,21531_0,2131
450,450.0,64305.0,2.0,0_1,21301_0,2104
451,451.0,59547.0,2.0,0_1,21331_0,2127
452,452.0,68973.0,2.0,0_1,22071_0,2189
453,453.0,73789.0,2.0,0_1,22221_0,2186
454,454.0,63383.0,2.0,0_1,22141_0,2185
455,455.0,69955.0,2.0,0_1,21851_0,2131
456,456.0,58627.0,2.0,0_1,21431_0,2120
457,457.0,55832.0,2.0,0_1,20931_0,2089
458,458.0,55610.0,2.0,0_1,21411_0,2087
459,459.0,64354.0,2.0,0_1,21781_0,2094
460,460.0,61727.0,2.0,0_1,22251_0,2100
461,461.0,64764.0,2.0,0_1,22111_0,2081
462,462.0,62408.0,2.0,0_1,22121_0,2064
463,463.0,63203.0,2.0,0_1,21691_0,2082
464,464.0,67351.0,2.0,0_1,22001_0,2084
465,465.0,73376.0,2.0,0_1,22311_0,2138
466,466.0,71943.0,2.0,0_1,22381_0,2233
467,467.0,71899.0,2.0,0_1,22291_0,2206
468,468.0,68440.0,2.0,0_1,22281_0,2222
469,469.0,62953.0,2.0,0_1,22351_0,2232
470,470.0,54711.0,2.0,0_1,22701_0,2285
471,471.0,68328.0,2.0,0_1,22901_0,2302
472,472.0,62976.0,2.0,0_1,22531_0,2304
473,473.0,67749.0,2.0,0_1,22851_0,2332
474,474.0,78484.0,2.0,0_1,23121_0,2374
475,475.0,66487.0,2.0,0_1,22931_0,2388
476,476.0,73829.0,2.0,0_1,23251_0,2407
477,477.0,76740.0,2.0,0_1,23491_0,2415
478,478.0,74989.0,2.0,0_1,23681_0,2425
479,479.0,81117.0,2.0,0_1,23781_0,2435
480,480.0,73387.0,2.0,0_1,24091_0,2444
481,481.0,77417.0,2.0,0_1,24421_0,2496
482,482.0,75036.0,2.0,0_1,24661_0,2499
483,483.0,70004.0,2.0,0_1,24401_0,2479
484,484.0,63044.0,2.0,0_1,24081_0,2440
485,485.0,71709.0,2.0,0_1,24241_0,2401
486,486.0,70716.0,2.0,0_1,24271_0,2445
487,487.0,79371.0,2.0,0_1,23921_0,2438
488,488.0,76459.0,2.0,0_1,24831_0,2515
489,489.0,85379.0,2.0,0_1,25411_0,2568
490,490.0,73610.0,2.0,0_1,25481_0,2550
491,491.0,63696.0,2.0,0_1,25331_0,2491
492,492.0,64480.0,2.0,0_1,24831_0,2457
493,493.0,70433.0,2.0,0_1,24581_0,2455
494,494.0,68096.0,2.0,0_1,24441_0,2466
495,495.0,78956.0,2.0,0_1,25081_0,2543
496,496.0,85216.0,2.0,0_1,25511_0,2597
497,497.0,82570.0,2.0,0_1,25361_0,2593
498,498.0,65659.0,2.0,0_1,24511_0,2526
499,499.0,69944.0,2.0,0_1,23861_0,2469
500,500.0,64228.0,2.0,0_1,23651_0,2449
501,501.0,64476.0,2.0,0_1,23661_0,2429
502,502.0,80917.0,2.0,0_1,23841_0,2424
503,503.0,73968.0,2.0,0_1,24281_0,2423
504,504.0,82128.0,2.0,0_1,24861_0,2502
505,505.0,82783.0,2.0,0_1,25301_0,2553
506,506.0,78320.0,2.0,0_1,25631_0,2608
507,507.0,83982.0,2.0,0_1,25891_0,2667
508,508.0,87485.0,2.0,0_1,26631_0,2708
509,509.0,75304.0,2.0,0_1,27401_0,2696
510,510.0,82602.0,2.0,0_1,26981_0,2720
511,511.0,84864.0,2.0,0_1,26311_0,2685
512,512.0,72759.0,2.0,0_1,25451_0,2609
513,513.0,73189.0,2.0,0_1,25181_0,2577
514,514.0,86082.0,2.0,0_1,25311_0,2618
515,515.0,67893.0,2.0,0_1,25421_0,2632
516,516.0,79158.0,2.0,0_1,26281_0,2680
517,517.0,83386.0,2.0,0_1,26911_0,2718
518,518.0,80468.0,2.0,0_1,26861_0,2692
519,519.0,87798.0,2.0,0_1,27451_0,2732
520,520.0,97923.0,2.0,0_1,27551_0,2801
521,521.0,84363.0,2.0,0_1,27481_0,2790
522,522.0,75213.0,2.0,0_1,27271_0,2798
523,523.0,80335.0,2.0,0_1,27251_0,2786
524,524.0,73613.0,2.0,0_1,27531_0,2818
525,525.0,92678.0,2.0,0_1,27831_0,2850
526,526.0,81159.0,2.0,0_1,28021_0,2833
527,527.0,81839.0,2.0,0_1,27991_0,2812
528,528.0,67922.0,2.0,0_1,28151_0,2820
529,529.0,81493.0,2.0,0_1,27681_0,2809
530,530.0,77632.0,2.0,0_1,27711_0,2799
531,531.0,84867.0,2.0,0_1,27261_0,2689
532,532.0,80172.0,2.0,0_1,27341_0,2718
533,533.0,88762.0,2.0,0_1,27481_0,2717
534,534.0,76606.0,2.0,0_1,27511_0,2745
535,535.0,73267.0,2.0,0_1,26981_0,2693
536,536.0,68379.0,2.0,0_1,26851_0,2649
537,537.0,80186.0,2.0,0_1,27071_0,2623
538,538.0,79578.0,2.0,0_1,27251_0,2609
539,539.0,86028.0,2.0,0_1,27241_0,2615
540,540.0,68137.0,2.0,0_1,26871_0,2599
541,541.0,81159.0,2.0,0_1,26671_0,2598
542,542.0,80093.0,2.0,0_1,26711_0,2653
543,543.0,78993.0,2.0,0_1,26811_0,2728
544,544.0,98606.0,2.0,0_1,26831_0,2751
545,545.0,86285.0,2.0,0_1,27221_0,2750
546,546.0,77678.0,2.0,0_1,27491_0,2810
547,547.0,83578.0,2.0,0_1,27251_0,2778
548,548.0,88740.0,2.0,0_1,27491_0,2819
549,549.0,77235.0,2.0,0_1,27751_0,2809
550,550.0,78219.0,2.0,0_1,27741_0,2836
551,551.0,92280.0,2.0,0_1,28251_0,2867
552,552.0,92988.0,2.0,0_1,27741_0,2921
553,553.0,74768.0,2.0,0_1,28191_0,2914
554,554.0,84712.0,2.0,0_1,28611_0,2911
555,555.0,86693.0,2.0,0_1,28341_0,2883
556,556.0,74305.0,2.0,0_1,27881_0,2829
557,557.0,92936.0,2.0,0_1,27561_0,2819
558,558.0,95349.0,2.0,0_1,28001_0,2825
559,559.0,74968.0,2.0,0_1,28031_0,2835
560,560.0,76223.0,2.0,0_1,27431_0,2786
561,561.0,79325.0,2.0,0_1,26901_0,2723
562,562.0,75132.0,2.0,0_1,26251_0,2661
563,563.0,76231.0,2.0,0_1,26901_0,2801
564,564.0,86924.0,2.0,0_1,27591_0,2830
565,565.0,82582.0,2.0,0_1,28521_0,2794
566,566.0,75246.0,2.0,0_1,28751_0,2792
567,567.0,86120.0,2.0,0_1,28781_0,2766
568,568.0,89788.0,2.0,0_1,29171_0,2817
569,569.0,95980.0,2.0,0_1,29121_0,2833
570,570.0,87564.0,2.0,0_1,29471_0,2907
571,571.0,101002.0,2.0,0_1,29661_0,2943
572,572.0,88658.0,2.0,0_1,29941_0,2950
573,573.0,97413.0,2.0,0_1,29971_0,2987
574,574.0,90201.0,2.0,0_1,29841_0,2952
575,575.0,83083.0,2.0,0_1,29411_0,2972
576,576.0,76291.0,2.0,0_1,29151_0,2941
577,577.0,81241.0,2.0,0_1,28921_0,2877
578,578.0,86360.0,2.0,0_1,28001_0,2821
579,579.0,83582.0,2.0,0_1,28621_0,2922
580,580.0,95583.0,2.0,0_1,28321_0,2892
581,581.0,85712.0,2.0,0_1,28531_0,2956
582,582.0,93955.0,2.0,0_1,29121_0,3011
583,583.0,91541.0,2.0,0_1,29091_0,3022
584,584.0,85423.0,2.0,0_1,29031_0,3044
585,585.0,87180.0,2.0,0_1,28541_0,2966
586,586.0,82975.0,2.0,0_1,28661_0,2958
587,587.0,81958.0,2.0,0_1,28221_0,2950
588,588.0,82753.0,2.0,0_1,28491_0,2991
589,589.0,84355.0,2.0,0_1,28141_0,3005
590,590.0,74680.0,2.0,0_1,28131_0,2958
591,591.0,87194.0,2.0,0_1,27991_0,2926
592,592.0,78784.0,2.0,0_1,28271_0,2920
593,593.0,94098.0,2.0,0_1,27941_0,2923
594,594.0,92104.0,2.0,0_1,28191_0,2921
595,595.0,90616.0,2.0,0_1,28101_0,2905
596,596.0,85635.0,2.0,0_1,28321_0,2896
597,597.0,80598.0,2.0,0_1,28321_0,2875
598,598.0,78712.0,2.0,0_1,28471_0,2825
599,599.0,85560.0,2.0,0_1,27951_0,2824
600,600.0,84420.0,2.0,0_1,28101_0,2816
601,601.0,85217.0,2.0,0_1,28471_0,2830
602,602.0,83575.0,2.0,0_1,29201_0,2839
603,603.0,90499.0,2.0,0_1,29971_0,2880
604,604.0,89973.0,2.0,0_1,30291_0,2928
605,605.0,84924.0,2.0,0_1,30031_0,2905
606,606.0,97088.0,2.0,0_1,30301_0,2892
607,607.0,89843.0,2.0,0_1,30331_0,2931
608,608.0,87483.0,2.0,0_1,29981_0,2914
609,609.0,82855.0,2.0,0_1,29511_0,2856
610,610.0,83913.0,2.0,0_1,29391_0,2868
611,611.0,88652.0,2.0,0_1,29571_0,2895
612,612.0,88949.0,2.0,0_1,29931_0,2921
613,613.0,97796.0,2.0,0_1,30051_0,2973
614,614.0,89573.0,2.0,0_1,29901_0,2998
615,615.0,86435.0,2.0,0_1,29701_0,3008
616,616.0,85063.0,2.0,0_1,29461_0,3016
617,617.0,87598.0,2.0,0_1,29871_0,3079
618,618.0,99064.0,2.0,0_1,30171_0,3125
619,619.0,91713.0,2.0,0_1,29931_0,3109
620,620.0,86936.0,2.0,0_1,30221_0,3078
621,621.0,81081.0,2.0,0_1,30111_0,3049
622,622.0,98995.0,2.0,0_1,30291_0,3029
623,623.0,90833.0,2.0,0_1,30151_0,3018
624,624.0,88239.0,2.0,0_1,29721_0,3057
625,625.0,85582.0,2.0,0_1,28981_0,2975
626,626.0,79849.0,2.0,0_1,28311_0,2968
627,627.0,86760.0,2.0,0_1,28761_0,2989
628,628.0,92110.0,2.0,0_1,29211_0,2954
629,629.0,83811.0,2.0,0_1,29541_0,2943
630,630.0,80493.0,2.0,0_1,29891_0,2978
631,631.0,91976.0,2.0,0_1,30061_0,3006
632,632.0,99030.0,2.0,0_1,29961_0,3006
633,633.0,87285.0,2.0,0_1,29851_0,3003
634,634.0,83155.0,2.0,0_1,29601_0,2970
635,635.0,83710.0,2.0,0_1,29981_0,2924
636,636.0,95584.0,2.0,0_1,29211_0,2823
637,637.0,80847.0,2.0,0_1,28701_0,2813
638,638.0,83374.0,2.0,0_1,29151_0,2858
639,639.0,94401.0,2.0,0_1,28781_0,2867
640,640.0,80201.0,2.0,0_1,28411_0,2848
641,641.0,70827.0,2.0,0_1,29011_0,2855
642,642.0,95803.0,2.0,0_1,29661_0,2906
643,643.0,84751.0,2.0,0_1,29741_0,2951
644,644.0,84617.0,2.0,0_1,29261_0,2972
645,645.0,84790.0,2.0,0_1,29201_0,2998
646,646.0,88421.0,2.0,0_1,29201_0,2995
647,647.0,90235.0,2.0,0_1,29131_0,2939
648,648.0,78674.0,2.0,0_1,28821_0,2919
649,649.0,86523.0,2.0,0_1,28771_0,2883
650,650.0,78465.0,2.0,0_1,28481_0,2884
651,651.0,86808.0,2.0,0_1,27731_0,2863
652,652.0,71059.0,2.0,0_1,26941_0,2848
653,653.0,77360.0,2.0,0_1,26221_0,2755
654,654.0,87944.0,2.0,0_1,26141_0,2731
655,655.0,83841.0,2.0,0_1,26971_0,2738
656,656.0,94911.0,2.0,0_1,27261_0,2707
657,657.0,81069.0,2.0,0_1,28181_0,2734
658,658.0,78480.0,2.0,0_1,28101_0,2707
659,659.0,75949.0,2.0,0_1,28181_0,2741
660,660.0,82886.0,2.0,0_1,27721_0,2755
661,661.0,76364.0,2.0,0_1,26841_0,2705
662,662.0,70661.0,2.0,0_1,26301_0,2669
663,663.0,85656.0,2.0,0_1,26591_0,2729
664,664.0,88419.0,2.0,0_1,26701_0,2779
665,665.0,87488.0,2.0,0_1,26631_0,2797
666,666.0,84159.0,2.0,0_1,26811_0,2742
667,667.0,71794.0,2.0,0_1,26331_0,2740
668,668.0,70395.0,2.0,0_1,26271_0,2691
669,669.0,76588.0,2.0,0_1,25791_0,2655
670,670.0,66823.0,2.0,0_1,25841_0,2624
671,671.0,82508.0,2.0,0_1,25801_0,2613
672,672.0,69587.0,2.0,0_1,25711_0,2583
673,673.0,76759.0,2.0,0_1,25411_0,2555
674,674.0,84101.0,2.0,0_1,25531_0,2527
675,675.0,74037.0,2.0,0_1,25431_0,2461
676,676.0,74347.0,2.0,0_1,25551_0,2495
677,677.0,82966.0,2.0,0_1,25241_0,2477
678,678.0,76142.0,2.0,0_1,24961_0,2457
679,679.0,76342.0,2.0,0_1,25641_0,2463
680,680.0,65864.0,2.0,0_1,25601_0,2461
681,681.0,69694.0,2.0,0_1,25881_0,2490
682,682.0,77621.0,2.0,0_1,25941_0,2443
683,683.0,63985.0,2.0,0_1,25881_0,2432
684,684.0,83249.0,2.0,0_1,25701_0,2432
685,685.0,82194.0,2.0,0_1,25251_0,2501
686,686.0,82621.0,2.0,0_1,25491_0,2519
687,687.0,85489.0,2.0,0_1,25831_0,2558
688,688.0,88307.0,2.0,0_1,25891_0,2584
689,689.0,81453.0,2.0,0_1,25751_0,2618
690,690.0,71646.0,2.0,0_1,25621_0,2645
691,691.0,69725.0,2.0,0_1,25941_0,2600
692,692.0,85846.0,2.0,0_1,26471_0,2622
693,693.0,87687.0,2.0,0_1,26841_0,2716
694,694.0,88152.0,2.0,0_1,27071_0,2762
695,695.0,80115.0,2.0,0_1,27401_0,2773
696,696.0,77060.0,2.0,0_1,27261_0,2747
697,697.0,82071.0,2.0,0_1,27421_0,2747
698,698.0,85826.0,2.0,0_1,27521_0,2755
699,699.0,81936.0,2.0,0_1,27411_0,2752
700,700.0,78495.0,2.0,0_1,27091_0,2734
701,701.0,80765.0,2.0,0_1,27141_0,2728
702,702.0,82016.0,2.0,0_1,27001_0,2691
703,703.0,86683.0,2.0,0_1,27451_0,2772
704,704.0,72314.0,2.0,0_1,27981_0,2727
705,705.0,80531.0,2.0,0_1,28011_0,2722
706,706.0,73916.0,2.0,0_1,27671_0,2683
707,707.0,86182.0,2.0,0_1,27321_0,2627
708,708.0,72549.0,2.0,0_1,26781_0,2576
709,709.0,73629.0,2.0,0_1,25821_0,2508
710,710.0,72229.0,2.0,0_1,25091_0,2413
711,711.0,63890.0,2.0,0_1,25431_0,2466
712,712.0,73236.0,2.0,0_1,25051_0,2471
713,713.0,71704.0,2.0,0_1,24641_0,2447
714,714.0,73532.0,2.0,0_1,24011_0,2456
715,715.0,72513.0,2.0,0_1,24271_0,2444
716,716.0,73211.0,2.0,0_1,24441_0,2473
717,717.0,76510.0,2.0,0_1,24851_0,2508
718,718.0,76673.0,2.0,0_1,25231_0,2512
719,719.0,79108.0,2.0,0_1,25491_0,2554
720,720.0,78330.0,2.0,0_1,25501_0,2519
721,721.0,69233.0,2.0,0_1,25081_0,2542
722,722.0,82762.0,2.0,0_1,25401_0,2522
723,723.0,83791.0,2.0,0_1,25851_0,2550
724,724.0,85840.0,2.0,0_1,26421_0,2597
725,725.0,82052.0,2.0,0_1,26531_0,2609
726,726.0,77974.0,2.0,0_1,26481_0,2617
727,727.0,68546.0,2.0,0_1,26191_0,2612
728,728.0,74163.0,2.0,0_1,26401_0,2560
729,729.0,73744.0,2.0,0_1,26121_0,2516
730,730.0,68559.0,2.0,0_1,25331_0,2540
731,731.0,72932.0,2.0,0_1,25371_0,2538
732,732.0,78263.0,2.0,0_1,24971_0,2502
733,733.0,68603.0,2.0,0_1,25201_0,2499
734,734.0,87224.0,2.0,0_1,25621_0,2559
735,735.0,86324.0,2.0,0_1,26111_0,2547
736,736.0,67074.0,2.0,0_1,26081_0,2540
737,737.0,81295.0,2.0,0_1,26461_0,2549
738,738.0,85165.0,2.0,0_1,26681_0,2612
739,739.0,81470.0,2.0,0_1,26911_0,2598
740,740.0,86361.0,2.0,0_1,26821_0,2613
741,741.0,69216.0,2.0,0_1,26331_0,2586
742,742.0,75551.0,2.0,0_1,26471_0,2646
743,743.0,81809.0,2.0,0_1,26331_0,2660
744,744.0,75528.0,2.0,0_1,25881_0,2617
745,745.0,74613.0,2.0,0_1,26101_0,2617
746,746.0,78337.0,2.0,0_1,25991_0,2619
747,747.0,75777.0,2.0,0_1,25961_0,2622
748,748.0,73150.0,2.0,0_1,25941_0,2694
749,749.0,88525.0,2.0,0_1,26571_0,2712
750,750.0,86080.0,2.0,0_1,26401_0,2767
751,751.0,76145.0,2.0,0_1,27221_0,2793
752,752.0,90604.0,2.0,0_1,27091_0,2787
753,753.0,87458.0,2.0,0_1,26871_0,2791
754,754.0,93262.0,2.0,0_1,27151_0,2839
755,755.0,80947.0,2.0,0_1,27221_0,2790
756,756.0,82003.0,2.0,0_1,27861_0,2810
757,757.0,92012.0,2.0,0_1,28131_0,2878
758,758.0,94815.0,2.0,0_1,28661_0,2931
759,759.0,89687.0,2.0,0_1,29841_0,3033
760,760.0,102322.0,2.0,0_1,30121_0,3071
761,761.0,94349.0,2.0,0_1,30011_0,3083
762,762.0,82003.0,2.0,0_1,30661_0,3065
763,763.0,89141.0,2.0,0_1,30871_0,3067
764,764.0,90840.0,2.0,0_1,30661_0,3104
765,765.0,79249.0,2.0,0_1,30551_0,3093
766,766.0,92012.0,2.0,0_1,30231_0,3080
767,767.0,89382.0,2.0,0_1,29361_0,2999
768,768.0,75495.0,2.0,0_1,29341_0,2992
769,769.0,94704.0,2.0,0_1,29511_0,2986
770,770.0,83349.0,2.0,0_1,29061_0,2918
771,771.0,85823.0,2.0,0_1,28971_0,2917
772,772.0,86948.0,2.0,0_1,28761_0,2906
773,773.0,81251.0,2.0,0_1,29071_0,2923
774,774.0,91138.0,2.0,0_1,29031_0,2947
775,775.0,86050.0,2.0,0_1,29051_0,2894
776,776.0,85154.0,2.0,0_1,28961_0,2837
777,777.0,76514.0,2.0,0_1,28811_0,2851
778,778.0,94753.0,2.0,0_1,28881_0,2867
779,779.0,89119.0,2.0,0_1,29511_0,2915
780,780.0,87109.0,2.0,0_1,29511_0,2922
781,781.0,95387.0,2.0,0_1,29181_0,2923
782,782.0,79596.0,2.0,0_1,29461_0,2948
783,783.0,88349.0,2.0,0_1,29061_0,2961
784,784.0,79971.0,2.0,0_1,29091_0,2971
785,785.0,89851.0,2.0,0_1,28361_0,2926
786,786.0,85879.0,2.0,0_1,28361_0,2962
787,787.0,93989.0,2.0,0_1,28271_0,3029
788,788.0,89799.0,2.0,0_1,28321_0,3001
789,789.0,86570.0,2.0,0_1,28601_0,3013
790,790.0,89450.0,2.0,0_1,29211_0,3037
791,791.0,97107.0,2.0,0_1,29411_0,3019
792,792.0,90010.0,2.0,0_1,29851_0,3078
793,793.0,92625.0,2.0,0_1,30581_0,3074
794,794.0,87389.0,2.0,0_1,30671_0,3106
795,795.0,92670.0,2.0,0_1,30281_0,3061
796,796.0,83525.0,2.0,0_1,29441_0,2976
797,797.0,75814.0,2.0,0_1,28751_0,2858
798,798.0,63240.0,2.0,0_1,28121_0,2827
799,799.0,86244.0,2.0,0_1,27501_0,2789
800,800.0,76819.0,2.0,0_1,26941_0,2764
801,801.0,87987.0,2.0,0_1,26471_0,2780
802,802.0,88116.0,2.0,0_1,26491_0,2780
803,803.0,81815.0,2.0,0_1,26341_0,2724
804,804.0,75826.0,2.0,0_1,25731_0,2686
805,805.0,77274.0,2.0,0_1,25821_0,2668
806,806.0,80898.0,2.0,0_1,25881_0,2734
807,807.0,85473.0,2.0,0_1,26781_0,2785
808,808.0,93468.0,2.0,0_1,27421_0,2777
809,809.0,79995.0,2.0,0_1,27371_0,2814
810,810.0,83393.0,2.0,0_1,27341_0,2762
811,811.0,82363.0,2.0,0_1,27441_0,2772
812,812.0,89443.0,2.0,0_1,28431_0,2835
813,813.0,87916.0,2.0,0_1,28831_0,2896
814,814.0,85043.0,2.0,0_1,28621_0,2807
815,815.0,73561.0,2.0,0_1,28971_0,2832
816,816.0,79741.0,2.0,0_1,28881_0,2826
817,817.0,72422.0,2.0,0_1,28381_0,2745
818,818.0,82396.0,2.0,0_1,27821_0,2730
819,819.0,80150.0,2.0,0_1,27751_0,2741
820,820.0,80421.0,2.0,0_1,27841_0,2710
821,821.0,83078.0,2.0,0_1,27901_0,2676
822,822.0,90094.0,2.0,0_1,27781_0,2663
823,823.0,89527.0,2.0,0_1,27781_0,2652
824,824.0,75687.0,2.0,0_1,28301_0,2661
825,825.0,78478.0,2.0,0_1,28651_0,2620
826,826.0,89666.0,2.0,0_1,28571_0,2616
827,827.0,83562.0,2.0,0_1,27641_0,2565
828,828.0,69811.0,2.0,0_1,27241_0,2574
829,829.0,74114.0,2.0,0_1,27461_0,2510
830,830.0,79711.0,2.0,0_1,27061_0,2587
831,831.0,86320.0,2.0,0_1,27371_0,2621
832,832.0,82843.0,2.0,0_1,27391_0,2636
833,833.0,78318.0,2.0,0_1,27411_0,2696
834,834.0,86311.0,2.0,0_1,28111_0,2744
835,835.0,89460.0,2.0,0_1,27681_0,2755
836,836.0,76049.0,2.0,0_1,27211_0,2745
837,837.0,77665.0,2.0,0_1,27521_0,2754
838,838.0,82261.0,2.0,0_1,26791_0,2722
839,839.0,68328.0,2.0,0_1,27081_0,2689
840,840.0,75712.0,2.0,0_1,26671_0,2637
841,841.0,74439.0,2.0,0_1,26161_0,2636
842,842.0,71910.0,2.0,0_1,25811_0,2561
843,843.0,73616.0,2.0,0_1,25051_0,2479
844,844.0,63011.0,2.0,0_1,24671_0,2463
845,845.0,72578.0,2.0,0_1,24111_0,2460
846,846.0,78724.0,2.0,0_1,24441_0,2505
847,847.0,82897.0,2.0,0_1,24431_0,2463
848,848.0,74673.0,2.0,0_1,24741_0,2501
849,849.0,79111.0,2.0,0_1,24991_0,2480
850,850.0,76567.0,2.0,0_1,25381_0,2502
851,851.0,78037.0,2.0,0_1,25901_0,2551
852,852.0,80660.0,2.0,0_1,26581_0,2607
853,853.0,75137.0,2.0,0_1,27101_0,2587
854,854.0,75277.0,2.0,0_1,27381_0,2570
855,855.0,87884.0,2.0,0_1,27681_0,2610
856,856.0,91211.0,2.0,0_1,27401_0,2655
857,857.0,81011.0,2.0,0_1,27611_0,2671
858,858.0,77454.0,2.0,0_1,27761_0,2681
859,859.0,72939.0,2.0,0_1,27401_0,2625
860,860.0,67217.0,2.0,0_1,27321_0,2580
861,861.0,75397.0,2.0,0_1,27691_0,2530
862,862.0,77896.0,2.0,0_1,27501_0,2531
863,863.0,72964.0,2.0,0_1,27451_0,2537
864,864.0,76525.0,2.0,0_1,26061_0,2463
865,865.0,71498.0,2.0,0_1,25431_0,2459
866,866.0,75096.0,2.0,0_1,24961_0,2429
867,867.0,72908.0,2.0,0_1,24521_0,2440
868,868.0,70413.0,2.0,0_1,23681_0,2422
869,869.0,65585.0,2.0,0_1,23561_0,2388
870,870.0,74016.0,2.0,0_1,23581_0,2411
871,871.0,69316.0,2.0,0_1,23001_0,2404
872,872.0,69756.0,2.0,0_1,22731_0,2414
873,873.0,66409.0,2.0,0_1,22981_0,2392
874,874.0,76383.0,2.0,0_1,22971_0,2405
875,875.0,71275.0,2.0,0_1,22961_0,2412
876,876.0,75339.0,2.0,0_1,23571_0,2414
877,877.0,78202.0,2.0,0_1,23731_0,2446
878,878.0,75066.0,2.0,0_1,23871_0,2459
879,879.0,75785.0,2.0,0_1,24251_0,2478
880,880.0,74811.0,2.0,0_1,24551_0,2497
881,881.0,80032.0,2.0,0_1,24671_0,2527
882,882.0,81259.0,2.0,0_1,25101_0,2544
883,883.0,74842.0,2.0,0_1,25291_0,2560
884,884.0,79828.0,2.0,0_1,25721_0,2649
885,885.0,86230.0,2.0,0_1,26811_0,2701
886,886.0,85122.0,2.0,0_1,27241_0,2733
887,887.0,89075.0,2.0,0_1,27671_0,2743
888,888.0,75408.0,2.0,0_1,28051_0,2747
889,889.0,81549.0,2.0,0_1,28421_0,2796
890,890.0,93649.0,2.0,0_1,28551_0,2855
891,891.0,92386.0,2.0,0_1,28601_0,2919
892,892.0,95071.0,2.0,0_1,28711_0,2973
893,893.0,91786.0,2.0,0_1,28961_0,3066
894,894.0,82849.0,2.0,0_1,28811_0,3040
895,895.0,81279.0,2.0,0_1,28291_0,2937
896,896.0,84869.0,2.0,0_1,28611_0,2949
897,897.0,95661.0,2.0,0_1,28921_0,3029
898,898.0,92870.0,2.0,0_1,28921_0,2996
899,899.0,78960.0,2.0,0_1,29071_0,2966
900,900.0,82936.0,2.0,0_1,29551_0,2934
901,901.0,82234.0,2.0,0_1,29451_0,2906
902,902.0,91150.0,2.0,0_1,28911_0,2880
903,903.0,77240.0,2.0,0_1,28801_0,2832
904,904.0,76445.0,2.0,0_1,28571_0,2840
905,905.0,94064.0,2.0,0_1,28331_0,2880
906,906.0,95374.0,2.0,0_1,28261_0,2918
907,907.0,86801.0,2.0,0_1,27451_0,2915
908,908.0,68313.0,2.0,0_1,27141_0,2881
909,909.0,82102.0,2.0,0_1,27301_0,2918
910,910.0,89133.0,2.0,0_1,28191_0,2930
911,911.0,97694.0,2.0,0_1,28681_0,2973
912,912.0,87418.0,2.0,0_1,29221_0,2921
913,913.0,79138.0,2.0,0_1,28711_0,2864
914,914.0,86266.0,2.0,0_1,27781_0,2851
915,915.0,74538.0,2.0,0_1,27821_0,2839
916,916.0,78480.0,2.0,0_1,27751_0,2840
917,917.0,93365.0,2.0,0_1,28301_0,2860
918,918.0,94793.0,2.0,0_1,29281_0,2931
919,919.0,102298.0,2.0,0_1,29751_0,2996
920,920.0,97898.0,2.0,0_1,29901_0,3043
921,921.0,100453.0,2.0,0_1,29971_0,3045
922,922.0,93943.0,2.0,0_1,30131_0,3041
923,923.0,87585.0,2.0,0_1,30421_0,3047
924,924.0,78335.0,2.0,0_1,30701_0,3027
925,925.0,78640.0,2.0,0_1,30651_0,3006
926,926.0,84295.0,2.0,0_1,30201_0,2975
927,927.0,90159.0,2.0,0_1,30511_0,2984
928,928.0,99100.0,2.0,0_1,30221_0,3005
929,929.0,79844.0,2.0,0_1,30501_0,2950
930,930.0,91498.0,2.0,0_1,30141_0,2959
931,931.0,96655.0,2.0,0_1,30391_0,2953
932,932.0,97427.0,2.0,0_1,31561_0,3011
933,933.0,96628.0,2.0,0_1,31171_0,3053
934,934.0,94042.0,2.0,0_1,31071_0,3063
935,935.0,85561.0,2.0,0_1,30681_0,3113
936,936.0,95707.0,2.0,0_1,30731_0,3115
937,937.0,88537.0,2.0,0_1,30881_0,3120
938,938.0,90482.0,2.0,0_1,30731_0,3129
939,939.0,91439.0,2.0,0_1,31141_0,3101
940,940.0,90617.0,2.0,0_1,30901_0,3084
941,941.0,78755.0,2.0,0_1,30331_0,3028
942,942.0,83667.0,2.0,0_1,30691_0,3099
943,943.0,107547.0,2.0,0_1,30781_0,3134
944,944.0,93266.0,2.0,0_1,30031_0,3098
945,945.0,90454.0,2.0,0_1,30391_0,3121
946,946.0,101989.0,2.0,0_1,30751_0,3202
947,947.0,93147.0,2.0,0_1,31001_0,3173
948,948.0,89826.0,2.0,0_1,30771_0,3128
949,949.0,84910.0,2.0,0_1,30921_0,3117
950,950.0,83349.0,2.0,0_1,30791_0,3023
951,951.0,74826.0,2.0,0_1,30171_0,2938
952,952.0,85171.0,2.0,0_1,29511_0,2914
953,953.0,81547.0,2.0,0_1,29191_0,2920
954,954.0,94986.0,2.0,0_1,28371_0,2916
955,955.0,83097.0,2.0,0_1,28281_0,2883
956,956.0,78727.0,2.0,0_1,28141_0,2865
957,957.0,91352.0,2.0,0_1,28141_0,2881
958,958.0,86731.0,2.0,0_1,28871_0,2872
959,959.0,94738.0,2.0,0_1,28941_0,2892
960,960.0,71799.0,2.0,0_1,28551_0,2881
961,961.0,85513.0,2.0,0_1,28641_0,2892
962,962.0,82602.0,2.0,0_1,28301_0,2892
963,963.0,76754.0,2.0,0_1,27931_0,2922
964,964.0,95420.0,2.0,0_1,27941_0,2923
965,965.0,83933.0,2.0,0_1,28171_0,2960
966,966.0,95491.0,2.0,0_1,28331_0,2952
967,967.0,77318.0,2.0,0_1,28121_0,2935
968,968.0,80171.0,2.0,0_1,28161_0,2881
969,969.0,80457.0,2.0,0_1,27561_0,2841
970,970.0,73147.0,2.0,0_1,27161_0,2795
971,971.0,73270.0,2.0,0_1,26921_0,2715
972,972.0,71650.0,2.0,0_1,26671_0,2661
973,973.0,78603.0,2.0,0_1,27111_0,2619
974,974.0,77585.0,2.0,0_1,26631_0,2584
975,975.0,75318.0,2.0,0_1,26551_0,2571
976,976.0,83996.0,2.0,0_1,26621_0,2575
977,977.0,80354.0,2.0,0_1,26531_0,2550
978,978.0,86484.0,2.0,0_1,26901_0,2581
979,979.0,80980.0,2.0,0_1,27141_0,2645
980,980.0,88495.0,2.0,0_1,27401_0,2717
981,981.0,75698.0,2.0,0_1,27391_0,2733
982,982.0,83615.0,2.0,0_1,28241_0,2721
983,983.0,91212.0,2.0,0_1,28811_0,2736
984,984.0,87958.0,2.0,0_1,29141_0,2780
985,985.0,80337.0,2.0,0_1,27901_0,2712
986,986.0,79003.0,2.0,0_1,28421_0,2743
987,987.0,85106.0,2.0,0_1,27741_0,2702
988,988.0,65937.0,2.0,0_1,27751_0,2723
989,989.0,82847.0,2.0,0_1,27611_0,2710
990,990.0,73258.0,2.0,0_1,27001_0,2667
991,991.0,74749.0,2.0,0_1,26861_0,2648
992,992.0,80008.0,2.0,0_1,26231_0,2593
993,993.0,71163.0,2.0,0_1,26151_0,2608
994,994.0,74121.0,2.0,0_1,25841_0,2589
995,995.0,78599.0,2.0,0_1,25851_0,2628
996,996.0,75506.0,2.0,0_1,25741_0,2588
997,997.0,82046.0,2.0,0_1,26041_0,2595
998,998.0,95415.0,2.0,0_1,26951_0,2667
999,999.0,93375.0,2.0,0_1,27301_0,2691
