0,0.0,0.0,2.0,0_1,801_0,96
1,1.0,6905.0,2.0,0_1,1011_0,120
2,2.0,4565.0,2.0,0_1,931_0,111
3,3.0,3534.0,2.0,0_1,941_0,106
4,4.0,3766.0,2.0,0_1,961_0,98
5,5.0,3816.0,2.0,0_1,951_0,111
6,6.0,4565.0,2.0,0_1,931_0,114
7,7.0,3987.0,2.0,0_1,1031_0,115
8,8.0,4635.0,2.0,0_1,1051_0,120
9,9.0,4818.0,2.0,0_1,1101_0,121
10,10.0,4145.0,2.0,0_1,1101_0,135
11,11.0,4261.0,2.0,0_1,1121_0,134
12,12.0,4592.0,2.0,0_1,1161_0,134
13,13.0,4088.0,2.0,0_1,1211_0,135
14,14.0,4552.0,2.0,0_1,1331_0,135
15,15.0,5435.0,2.0,0_1,1351_0,138
16,16.0,4011.0,2.0,0_1,1451_0,135
17,17.0,7042.0,2.0,0_1,1501_0,143
18,18.0,5887.0,2.0,0_1,1541_0,148
19,19.0,4222.0,2.0,0_1,1581_0,146
20,20.0,5457.0,2.0,0_1,1631_0,148
21,21.0,4951.0,2.0,0_1,1631_0,143
22,22.0,6706.0,2.0,0_1,1731_0,150
23,23.0,7065.0,2.0,0_1,1821_0,154
24,24.0,6439.0,2.0,0_1,1811_0,153
25,25.0,6060.0,2.0,0_1,1881_0,161
26,26.0,6883.0,2.0,0_1,1961_0,160
27,27.0,8084.0,2.0,0_1,1971_0,170
28,28.0,6070.0,2.0,0_1,1961_0,174
29,29.0,6548.0,2.0,0_1,1981_0,180
30,30.0,8044.0,2.0,0_1,2041_0,184
31,31.0,6466.0,2.0,0_1,2051_0,190
32,32.0,6896.0,2.0,0_1,2101_0,197
33,33.0,6277.0,2.0,0_1,2201_0,214
34,34.0,7498.0,2.0,0_1,2291_0,223
35,35.0,8158.0,2.0,0_1,2371_0,233
36,36.0,8220.0,2.0,0_1,2361_0,248
37,37.0,10277.0,2.0,0_1,2501_0,257
38,38.0,9396.0,2.0,0_1,2511_0,267
39,39.0,7374.0,2.0,0_1,2521_0,279
40,40.0,8954.0,2.0,0_1,2621_0,293
41,41.0,10226.0,2.0,0_1,2651_0,301
42,42.0,10069.0,2.0,0_1,2691_0,301
43,43.0,10387.0,2.0,0_1,2911_0,312
44,44.0,9956.0,2.0,0_1,2941_0,326
45,45.0,11719.0,2.0,0_1,3031_0,333
46,46.0,9135.0,2.0,0_1,3181_0,332
47,47.0,12567.0,2.0,0_1,3381_0,331
48,48.0,13450.0,2.0,0_1,3461_0,344
49,49.0,8683.0,2.0,0_1,3461_0,344
50,50.0,10045.0,2.0,0_1,3451_0,354
51,51.0,12659.0,2.0,0_1,3471_0,367
52,52.0,10636.0,2.0,0_1,3481_0,369
53,53.0,12235.0,2.0,0_1,3481_0,372
54,54.0,12461.0,2.0,0_1,3561_0,363
55,55.0,12528.0,2.0,0_1,3611_0,380
56,56.0,13734.0,2.0,0_1,3641_0,390
57,57.0,13296.0,2.0,0_1,3871_0,395
58,58.0,12361.0,2.0,0_1,4091_0,401
59,59.0,12778.0,2.0,0_1,4131_0,402
60,60.0,13062.0,2.0,0_1,4221_0,412
61,61.0,12871.0,2.0,0_1,4201_0,407
62,62.0,12334.0,2.0,0_1,4251_0,413
63,63.0,14006.0,2.0,0_1,4371_0,419
64,64.0,13441.0,2.0,0_1,4441_0,409
65,65.0,12810.0,2.0,0_1,4521_0,408
66,66.0,14526.0,2.0,0_1,4511_0,419
67,67.0,14839.0,2.0,0_1,4491_0,427
68,68.0,12789.0,2.0,0_1,4621_0,442
69,69.0,14094.0,2.0,0_1,4521_0,463
70,70.0,16077.0,2.0,0_1,4561_0,472
71,71.0,16837.0,2.0,0_1,4621_0,489
72,72.0,15527.0,2.0,0_1,4621_0,500
73,73.0,17799.0,2.0,0_1,4531_0,513
74,74.0,14369.0,2.0,0_1,4461_0,520
75,75.0,16615.0,2.0,0_1,4601_0,535
76,76.0,16145.0,2.0,0_1,4761_0,533
77,77.0,15981.0,2.0,0_1,4941_0,550
78,78.0,19381.0,2.0,0_1,5141_0,558
79,79.0,18197.0,2.0,0_1,5341_0,569
80,80.0,19410.0,2.0,0_1,5481_0,586
81,81.0,17121.0,2.0,0_1,5711_0,605
82,82.0,18767.0,2.0,0_1,5791_0,606
83,83.0,18511.0,2.0,0_1,5861_0,612
84,84.0,18544.0,2.0,0_1,5861_0,611
85,85.0,18157.0,2.0,0_1,6031_0,612
86,86.0,16460.0,2.0,0_1,6001_0,594
87,87.0,18760.0,2.0,0_1,6261_0,612
88,88.0,19411.0,2.0,0_1,6551_0,611
89,89.0,19491.0,2.0,0_1,6571_0,614
90,90.0,20491.0,2.0,0_1,6601_0,628
91,91.0,17848.0,2.0,0_1,6621_0,640
92,92.0,15894.0,2.0,0_1,6451_0,641
93,93.0,19100.0,2.0,0_1,6541_0,633
94,94.0,23605.0,2.0,0_1,6561_0,666
95,95.0,23489.0,2.0,0_1,6751_0,673
96,96.0,19988.0,2.0,0_1,6781_0,698
97,97.0,22929.0,2.0,0_1,6751_0,703
98,98.0,20197.0,2.0,0_1,6641_0,700
99,99.0,20581.0,2.0,0_1,6691_0,698
100,100.0,18245.0,2.0,0_1,6741_0,701
101,101.0,18475.0,2.0,0_1,6771_0,704
102,102.0,19881.0,2.0,0_1,6491_0,694
103,103.0,16749.0,2.0,0_1,6651_0,689
104,104.0,18964.0,2.0,0_1,6721_0,700
105,105.0,22469.0,2.0,0_1,6761_0,713
106,106.0,23064.0,2.0,0_1,6851_0,723
107,107.0,21524.0,2.0,0_1,6931_0,713
108,108.0,19529.0,2.0,0_1,7021_0,725
109,109.0,25116.0,2.0,0_1,7081_0,732
110,110.0,20488.0,2.0,0_1,7211_0,737
111,111.0,25179.0,2.0,0_1,7291_0,745
112,112.0,25989.0,2.0,0_1,7321_0,758
113,113.0,24135.0,2.0,0_1,7321_0,768
114,114.0,24591.0,2.0,0_1,7331_0,784
115,115.0,22408.0,2.0,0_1,7231_0,778
116,116.0,22653.0,2.0,0_1,7331_0,786
117,117.0,19527.0,2.0,0_1,7441_0,783
118,118.0,28049.0,2.0,0_1,7621_0,788
119,119.0,22825.0,2.0,0_1,7711_0,784
120,120.0,21362.0,2.0,0_1,7671_0,794
121,121.0,24518.0,2.0,0_1,7561_0,791
122,122.0,22248.0,2.0,0_1,7601_0,784
123,123.0,22296.0,2.0,0_1,7691_0,802
124,124.0,23260.0,2.0,0_1,7721_0,814
125,125.0,26456.0,2.0,0_1,7901_0,808
126,126.0,28478.0,2.0,0_1,8211_0,823
127,127.0,32089.0,2.0,0_1,8441_0,839
128,128.0,28581.0,2.0,0_1,8441_0,827
129,129.0,26060.0,2.0,0_1,8721_0,849
130,130.0,28900.0,2.0,0_1,8781_0,879
131,131.0,22272.0,2.0,0_1,8821_0,895
132,132.0,25672.0,2.0,0_1,8921_0,895
133,133.0,25640.0,2.0,0_1,9101_0,883
134,134.0,25747.0,2.0,0_1,8941_0,882
135,135.0,23303.0,2.0,0_1,8961_0,885
136,136.0,25219.0,2.0,0_1,9041_0,901
137,137.0,31656.0,2.0,0_1,9191_0,895
138,138.0,27642.0,2.0,0_1,9431_0,921
139,139.0,31779.0,2.0,0_1,9591_0,955
140,140.0,32197.0,2.0,0_1,9981_0,985
141,141.0,31443.0,2.0,0_1,9991_0,987
142,142.0,35006.0,2.0,0_1,9871_0,1012
143,143.0,28969.0,2.0,0_1,9851_0,1038
144,144.0,26561.0,2.0,0_1,10131_0,1031
145,145.0,31621.0,2.0,0_1,10011_0,1042
146,146.0,32550.0,2.0,0_1,10001_0,1041
147,147.0,33507.0,2.0,0_1,10181_0,1077
148,148.0,31948.0,2.0,0_1,10401_0,1076
149,149.0,37489.0,2.0,0_1,10511_0,1106
150,150.0,33863.0,2.0,0_1,10401_0,1150
151,151.0,32534.0,2.0,0_1,10501_0,1170
152,152.0,39885.0,2.0,0_1,10701_0,1190
153,153.0,36979.0,2.0,0_1,10721_0,1183
154,154.0,30902.0,2.0,0_1,10711_0,1181
155,155.0,34135.0,2.0,0_1,10601_0,1201
156,156.0,32682.0,2.0,0_1,10871_0,1197
157,157.0,33195.0,2.0,0_1,11271_0,1175
158,158.0,35509.0,2.0,0_1,11301_0,1192
159,159.0,31391.0,2.0,0_1,11431_0,1187
160,160.0,30862.0,2.0,0_1,11521_0,1171
161,161.0,33538.0,2.0,0_1,11711_0,1145
162,162.0,29755.0,2.0,0_1,11651_0,1119
163,163.0,34332.0,2.0,0_1,11661_0,1111
164,164.0,35813.0,2.0,0_1,11441_0,1127
165,165.0,34291.0,2.0,0_1,11341_0,1142
166,166.0,32649.0,2.0,0_1,11461_0,1158
167,167.0,36801.0,2.0,0_1,11651_0,1164
168,168.0,37798.0,2.0,0_1,11661_0,1170
169,169.0,29740.0,2.0,0_1,11621_0,1152
170,170.0,37888.0,2.0,0_1,11441_0,1148
171,171.0,31588.0,2.0,0_1,11301_0,1158
172,172.0,35657.0,2.0,0_1,11671_0,1165
173,173.0,36487.0,2.0,0_1,12021_0,1146
174,174.0,34614.0,2.0,0_1,12161_0,1170
175,175.0,29926.0,2.0,0_1,11841_0,1174
176,176.0,37253.0,2.0,0_1,11871_0,1182
177,177.0,34903.0,2.0,0_1,12231_0,1201
178,178.0,38802.0,2.0,0_1,12381_0,1221
179,179.0,32959.0,2.0,0_1,12461_0,1228
180,180.0,40031.0,2.0,0_1,12281_0,1238
181,181.0,37100.0,2.0,0_1,12291_0,1235
182,182.0,34181.0,2.0,0_1,12501_0,1237
183,183.0,37631.0,2.0,0_1,12421_0,1223
184,184.0,38587.0,2.0,0_1,12461_0,1196
185,185.0,38532.0,2.0,0_1,12461_0,1198
186,186.0,36012.0,2.0,0_1,12121_0,1218
187,187.0,39743.0,2.0,0_1,12261_0,1211
188,188.0,40157.0,2.0,0_1,12541_0,1209
189,189.0,35410.0,2.0,0_1,12541_0,1182
190,190.0,31623.0,2.0,0_1,12741_0,1193
191,191.0,34063.0,2.0,0_1,12871_0,1238
192,192.0,40120.0,2.0,0_1,12821_0,1284
193,193.0,35720.0,2.0,0_1,13131_0,1287
194,194.0,39800.0,2.0,0_1,12851_0,1335
195,195.0,39103.0,2.0,0_1,12831_0,1307
196,196.0,40322.0,2.0,0_1,13171_0,1329
197,197.0,41184.0,2.0,0_1,13081_0,1353
198,198.0,39465.0,2.0,0_1,13111_0,1358
199,199.0,36540.0,2.0,0_1,13121_0,1336
200,200.0,38011.0,2.0,0_1,13281_0,1321
201,201.0,39636.0,2.0,0_1,12931_0,1318
202,202.0,36640.0,2.0,0_1,12271_0,1303
203,203.0,36012.0,2.0,0_1,12391_0,1279
204,204.0,41819.0,2.0,0_1,12511_0,1272
205,205.0,40837.0,2.0,0_1,13461_0,1326
206,206.0,52962.0,2.0,0_1,13831_0,1372
207,207.0,42984.0,2.0,0_1,14041_0,1379
208,208.0,35419.0,2.0,0_1,13881_0,1363
209,209.0,39073.0,2.0,0_1,13791_0,1368
210,210.0,47412.0,2.0,0_1,13931_0,1366
211,211.0,34244.0,2.0,0_1,14001_0,1384
212,212.0,45901.0,2.0,0_1,14141_0,1376
213,213.0,39497.0,2.0,0_1,14041_0,1371
214,214.0,31067.0,2.0,0_1,13821_0,1372
215,215.0,36968.0,2.0,0_1,13361_0,1326
216,216.0,36381.0,2.0,0_1,13141_0,1287
217,217.0,39530.0,2.0,0_1,13511_0,1314
218,218.0,40592.0,2.0,0_1,13441_0,1358
219,219.0,40352.0,2.0,0_1,13531_0,1388
220,220.0,45599.0,2.0,0_1,13591_0,1399
221,221.0,38617.0,2.0,0_1,13621_0,1380
222,222.0,41562.0,2.0,0_1,13681_0,1368
223,223.0,39490.0,2.0,0_1,13561_0,1379
224,224.0,38258.0,2.0,0_1,14021_0,1407
225,225.0,44055.0,2.0,0_1,14171_0,1449
226,226.0,51516.0,2.0,0_1,13831_0,1436
227,227.0,45777.0,2.0,0_1,13891_0,1439
228,228.0,48103.0,2.0,0_1,14061_0,1433
229,229.0,40473.0,2.0,0_1,13981_0,1429
230,230.0,38658.0,2.0,0_1,14081_0,1436
231,231.0,49212.0,2.0,0_1,14681_0,1482
232,232.0,49661.0,2.0,0_1,14381_0,1463
233,233.0,44481.0,2.0,0_1,14701_0,1459
234,234.0,44299.0,2.0,0_1,14861_0,1475
235,235.0,45610.0,2.0,0_1,15201_0,1495
236,236.0,51448.0,2.0,0_1,15451_0,1531
237,237.0,50429.0,2.0,0_1,15581_0,1553
238,238.0,44195.0,2.0,0_1,15521_0,1521
239,239.0,45335.0,2.0,0_1,15521_0,1470
240,240.0,50876.0,2.0,0_1,15431_0,1453
241,241.0,38409.0,2.0,0_1,15101_0,1441
242,242.0,41878.0,2.0,0_1,15411_0,1448
243,243.0,43164.0,2.0,0_1,15731_0,1503
244,244.0,50441.0,2.0,0_1,15991_0,1530
245,245.0,48380.0,2.0,0_1,16111_0,1527
246,246.0,48757.0,2.0,0_1,16161_0,1567
247,247.0,48909.0,2.0,0_1,15941_0,1582
248,248.0,45287.0,2.0,0_1,15951_0,1564
249,249.0,45426.0,2.0,0_1,15681_0,1530
250,250.0,40932.0,2.0,0_1,15631_0,1541
251,251.0,44134.0,2.0,0_1,15441_0,1528
252,252.0,48154.0,2.0,0_1,15421_0,1534
253,253.0,50705.0,2.0,0_1,15551_0,1525
254,254.0,45704.0,2.0,0_1,15751_0,1513
255,255.0,48335.0,2.0,0_1,16431_0,1567
256,256.0,55633.0,2.0,0_1,16851_0,1653
257,257.0,54776.0,2.0,0_1,17081_0,1671
258,258.0,53875.0,2.0,0_1,16971_0,1732
259,259.0,53374.0,2.0,0_1,17041_0,1757
260,260.0,52163.0,2.0,0_1,16861_0,1809
261,261.0,55719.0,2.0,0_1,17141_0,1777
262,262.0,53589.0,2.0,0_1,17451_0,1795
263,263.0,54505.0,2.0,0_1,17471_0,1803
264,264.0,50410.0,2.0,0_1,17571_0,1820
265,265.0,59707.0,2.0,0_1,17601_0,1865
266,266.0,50387.0,2.0,0_1,17961_0,1866
267,267.0,61372.0,2.0,0_1,18391_0,1852
268,268.0,54809.0,2.0,0_1,18301_0,1867
269,269.0,55133.0,2.0,0_1,18501_0,1865
270,270.0,55534.0,2.0,0_1,18481_0,1857
271,271.0,52803.0,2.0,0_1,18491_0,1839
272,272.0,56260.0,2.0,0_1,18081_0,1813
273,273.0,49239.0,2.0,0_1,18231_0,1795
274,274.0,55337.0,2.0,0_1,18061_0,1782
275,275.0,53092.0,2.0,0_1,18011_0,1779
276,276.0,55521.0,2.0,0_1,17871_0,1738
277,277.0,52293.0,2.0,0_1,18731_0,1821
278,278.0,69572.0,2.0,0_1,18851_0,1868
279,279.0,57001.0,2.0,0_1,19021_0,1839
280,280.0,50661.0,2.0,0_1,19121_0,1897
281,281.0,59549.0,2.0,0_1,18811_0,1913
282,282.0,45229.0,2.0,0_1,19101_0,1910
283,283.0,53141.0,2.0,0_1,18911_0,1901
284,284.0,55518.0,2.0,0_1,19011_0,1913
285,285.0,53148.0,2.0,0_1,18761_0,1925
286,286.0,50913.0,2.0,0_1,18521_0,1898
287,287.0,53517.0,2.0,0_1,18531_0,1854
288,288.0,51926.0,2.0,0_1,18051_0,1832
289,289.0,49355.0,2.0,0_1,18001_0,1806
290,290.0,53803.0,2.0,0_1,18011_0,1795
291,291.0,51460.0,2.0,0_1,18501_0,1834
292,292.0,61220.0,2.0,0_1,18771_0,1883
293,293.0,63704.0,2.0,0_1,19471_0,1846
294,294.0,51410.0,2.0,0_1,19531_0,1884
295,295.0,57837.0,2.0,0_1,19721_0,1921
296,296.0,59817.0,2.0,0_1,19691_0,1898
297,297.0,52439.0,2.0,0_1,19761_0,1931
298,298.0,67157.0,2.0,0_1,19351_0,1917
299,299.0,54738.0,2.0,0_1,19141_0,1919
300,300.0,52391.0,2.0,0_1,19001_0,1937
301,301.0,59357.0,2.0,0_1,18931_0,1951
302,302.0,56427.0,2.0,0_1,18981_0,1992
303,303.0,62447.0,2.0,0_1,19011_0,1958
304,304.0,48147.0,2.0,0_1,18881_0,1958
305,305.0,62428.0,2.0,0_1,19121_0,1937
306,306.0,57632.0,2.0,0_1,19291_0,1949
307,307.0,56881.0,2.0,0_1,19211_0,1937
308,308.0,54942.0,2.0,0_1,19561_0,1949
309,309.0,61475.0,2.0,0_1,20101_0,1933
310,310.0,64066.0,2.0,0_1,19861_0,1893
311,311.0,55689.0,2.0,0_1,19781_0,1880
312,312.0,49202.0,2.0,0_1,19261_0,1843
313,313.0,49619.0,2.0,0_1,18991_0,1797
314,314.0,55707.0,2.0,0_1,19231_0,1795
315,315.0,55806.0,2.0,0_1,19031_0,1822
316,316.0,60169.0,2.0,0_1,19211_0,1855
317,317.0,61603.0,2.0,0_1,19291_0,1854
318,318.0,50284.0,2.0,0_1,19261_0,1875
319,319.0,60968.0,2.0,0_1,19521_0,1908
320,320.0,60417.0,2.0,0_1,19341_0,1959
321,321.0,63776.0,2.0,0_1,19171_0,1925
322,322.0,57492.0,2.0,0_1,19291_0,1944
323,323.0,57631.0,2.0,0_1,19331_0,1911
324,324.0,60899.0,2.0,0_1,19991_0,1955
325,325.0,68501.0,2.0,0_1,20381_0,1982
326,326.0,54187.0,2.0,0_1,20531_0,1994
327,327.0,57595.0,2.0,0_1,20141_0,1980
328,328.0,48382.0,2.0,0_1,19661_0,1975
329,329.0,49820.0,2.0,0_1,19501_0,1995
330,330.0,56446.0,2.0,0_1,18701_0,1920
331,331.0,57170.0,2.0,0_1,18841_0,1921
332,332.0,49658.0,2.0,0_1,18901_0,1946
333,333.0,62121.0,2.0,0_1,18681_0,1887
334,334.0,57360.0,2.0,0_1,18171_0,1836
335,335.0,49618.0,2.0,0_1,18511_0,1871
336,336.0,62121.0,2.0,0_1,18481_0,1898
337,337.0,59691.0,2.0,0_1,18901_0,1942
338,338.0,64397.0,2.0,0_1,19201_0,2006
339,339.0,62927.0,2.0,0_1,19971_0,2038
340,340.0,66176.0,2.0,0_1,19881_0,2063
341,341.0,63163.0,2.0,0_1,20261_0,2067
342,342.0,63280.0,2.0,0_1,20391_0,2073
343,343.0,58788.0,2.0,0_1,20771_0,2041
344,344.0,62596.0,2.0,0_1,21081_0,2072
345,345.0,62997.0,2.0,0_1,20731_0,2027
346,346.0,60867.0,2.0,0_1,20621_0,2058
347,347.0,68578.0,2.0,0_1,21131_0,2097
348,348.0,67121.0,2.0,0_1,21421_0,2101
349,349.0,59461.0,2.0,0_1,20691_0,2091
350,350.0,50453.0,2.0,0_1,20091_0,2034
351,351.0,60320.0,2.0,0_1,20601_0,2047
352,352.0,62196.0,2.0,0_1,20511_0,2057
353,353.0,56920.0,2.0,0_1,20631_0,2055
354,354.0,60259.0,2.0,0_1,20971_0,2082
355,355.0,64317.0,2.0,0_1,21541_0,2135
356,356.0,70940.0,2.0,0_1,21801_0,2159
357,357.0,73915.0,2.0,0_1,22071_0,2168
358,358.0,69941.0,2.0,0_1,21501_0,2158
359,359.0,67036.0,2.0,0_1,21881_0,2175
360,360.0,64050.0,2.0,0_1,21571_0,2129
361,361.0,60510.0,2.0,0_1,21831_0,2133
362,362.0,69834.0,2.0,0_1,22151_0,2186
363,363.0,69862.0,2.0,0_1,23111_0,2233
364,364.0,72937.0,2.0,0_1,23391_0,2222
365,365.0,60579.0,2.0,0_1,23281_0,2237
366,366.0,63677.0,2.0,0_1,22961_0,2265
367,367.0,61412.0,2.0,0_1,22361_0,2223
368,368.0,58527.0,2.0,0_1,22471_0,2237
369,369.0,68368.0,2.0,0_1,21811_0,2226
370,370.0,60812.0,2.0,0_1,21651_0,2128
371,371.0,56816.0,2.0,0_1,21741_0,2109
372,372.0,70295.0,2.0,0_1,21821_0,2155
373,373.0,73752.0,2.0,0_1,21771_0,2191
374,374.0,67032.0,2.0,0_1,22181_0,2216
375,375.0,62442.0,2.0,0_1,22681_0,2292
376,376.0,81602.0,2.0,0_1,22911_0,2335
377,377.0,74670.0,2.0,0_1,23391_0,2336
378,378.0,76637.0,2.0,0_1,23471_0,2361
379,379.0,72923.0,2.0,0_1,23601_0,2377
380,380.0,66883.0,2.0,0_1,23621_0,2384
381,381.0,71047.0,2.0,0_1,23341_0,2363
382,382.0,63894.0,2.0,0_1,23561_0,2362
383,383.0,70417.0,2.0,0_1,23291_0,2362
384,384.0,75442.0,2.0,0_1,23191_0,2347
385,385.0,73715.0,2.0,0_1,23621_0,2377
386,386.0,70182.0,2.0,0_1,24061_0,2405
387,387.0,81824.0,2.0,0_1,24441_0,2457
388,388.0,74803.0,2.0,0_1,24511_0,2429
389,389.0,69607.0,2.0,0_1,24571_0,2451
390,390.0,66529.0,2.0,0_1,24421_0,2475
391,391.0,78288.0,2.0,0_1,24131_0,2441
392,392.0,64635.0,2.0,0_1,24611_0,2442
393,393.0,82228.0,2.0,0_1,24881_0,2492
394,394.0,86791.0,2.0,0_1,24881_0,2547
395,395.0,76137.0,2.0,0_1,24431_0,2545
396,396.0,75861.0,2.0,0_1,24721_0,2548
397,397.0,77895.0,2.0,0_1,24971_0,2585
398,398.0,80062.0,2.0,0_1,25351_0,2640
399,399.0,79317.0,2.0,0_1,25291_0,2662
400,400.0,77948.0,2.0,0_1,25191_0,2605
401,401.0,72911.0,2.0,0_1,25321_0,2635
402,402.0,68508.0,2.0,0_1,25471_0,2668
403,403.0,84120.0,2.0,0_1,25801_0,2668
404,404.0,74329.0,2.0,0_1,25931_0,2688
405,405.0,79593.0,2.0,0_1,26381_0,2633
406,406.0,78653.0,2.0,0_1,27081_0,2616
407,407.0,87852.0,2.0,0_1,26811_0,2619
408,408.0,80345.0,2.0,0_1,26331_0,2646
409,409.0,67243.0,2.0,0_1,26031_0,2617
410,410.0,66946.0,2.0,0_1,26041_0,2585
411,411.0,76023.0,2.0,0_1,25681_0,2571
412,412.0,70231.0,2.0,0_1,26071_0,2595
413,413.0,80593.0,2.0,0_1,26021_0,2652
414,414.0,76696.0,2.0,0_1,25721_0,2660
415,415.0,79727.0,2.0,0_1,25921_0,2702
416,416.0,80384.0,2.0,0_1,25991_0,2692
417,417.0,85148.0,2.0,0_1,26561_0,2698
418,418.0,80360.0,2.0,0_1,27221_0,2684
419,419.0,81460.0,2.0,0_1,27341_0,2685
420,420.0,79576.0,2.0,0_1,26861_0,2697
421,421.0,79047.0,2.0,0_1,26781_0,2650
422,422.0,71162.0,2.0,0_1,26691_0,2650
423,423.0,79837.0,2.0,0_1,26541_0,2618
424,424.0,73895.0,2.0,0_1,26451_0,2584
425,425.0,81380.0,2.0,0_1,26131_0,2545
426,426.0,72745.0,2.0,0_1,26051_0,2574
427,427.0,80171.0,2.0,0_1,26211_0,2586
428,428.0,75100.0,2.0,0_1,25911_0,2616
429,429.0,80410.0,2.0,0_1,26191_0,2644
430,430.0,80846.0,2.0,0_1,25631_0,2586
431,431.0,74808.0,2.0,0_1,25711_0,2619
432,432.0,84995.0,2.0,0_1,25821_0,2559
433,433.0,70527.0,2.0,0_1,25921_0,2525
434,434.0,74406.0,2.0,0_1,26361_0,2533
435,435.0,79669.0,2.0,0_1,26741_0,2560
436,436.0,78403.0,2.0,0_1,27011_0,2609
437,437.0,80703.0,2.0,0_1,26411_0,2620
438,438.0,79415.0,2.0,0_1,26781_0,2702
439,439.0,83862.0,2.0,0_1,26561_0,2718
440,440.0,81933.0,2.0,0_1,27031_0,2698
441,441.0,77053.0,2.0,0_1,26971_0,2714
442,442.0,79629.0,2.0,0_1,26681_0,2673
443,443.0,88180.0,2.0,0_1,26251_0,2649
444,444.0,86599.0,2.0,0_1,26261_0,2623
445,445.0,78625.0,2.0,0_1,26891_0,2640
446,446.0,76792.0,2.0,0_1,26321_0,2627
447,447.0,77296.0,2.0,0_1,26221_0,2623
448,448.0,78411.0,2.0,0_1,26451_0,2624
449,449.0,73151.0,2.0,0_1,26551_0,2675
450,450.0,76292.0,2.0,0_1,25931_0,2654
451,451.0,58407.0,2.0,0_1,25081_0,2563
452,452.0,70255.0,2.0,0_1,24681_0,2556
453,453.0,80465.0,2.0,0_1,24761_0,2549
454,454.0,72703.0,2.0,0_1,25101_0,2572
455,455.0,82217.0,2.0,0_1,25411_0,2600
456,456.0,70981.0,2.0,0_1,25491_0,2577
457,457.0,80400.0,2.0,0_1,25721_0,2647
458,458.0,83116.0,2.0,0_1,26211_0,2704
459,459.0,79243.0,2.0,0_1,25771_0,2662
460,460.0,71388.0,2.0,0_1,24941_0,2626
461,461.0,81580.0,2.0,0_1,24801_0,2592
462,462.0,75929.0,2.0,0_1,25091_0,2599
463,463.0,82542.0,2.0,0_1,25441_0,2625
464,464.0,78726.0,2.0,0_1,26321_0,2685
465,465.0,75296.0,2.0,0_1,26501_0,2743
466,466.0,87631.0,2.0,0_1,26591_0,2726
467,467.0,85042.0,2.0,0_1,26721_0,2738
468,468.0,74117.0,2.0,0_1,26331_0,2730
469,469.0,73463.0,2.0,0_1,26171_0,2685
470,470.0,65536.0,2.0,0_1,26131_0,2618
471,471.0,78336.0,2.0,0_1,26131_0,2622
472,472.0,79929.0,2.0,0_1,25671_0,2620
473,473.0,75456.0,2.0,0_1,25711_0,2653
474,474.0,81654.0,2.0,0_1,25221_0,2631
475,475.0,70811.0,2.0,0_1,24721_0,2566
476,476.0,70405.0,2.0,0_1,24621_0,2568
477,477.0,80799.0,2.0,0_1,24471_0,2514
478,478.0,68554.0,2.0,0_1,23891_0,2442
479,479.0,68965.0,2.0,0_1,24241_0,2472
480,480.0,78963.0,2.0,0_1,24991_0,2497
481,481.0,77660.0,2.0,0_1,25281_0,2488
482,482.0,82334.0,2.0,0_1,25451_0,2507
483,483.0,79988.0,2.0,0_1,25491_0,2581
484,484.0,77175.0,2.0,0_1,25931_0,2632
485,485.0,84563.0,2.0,0_1,26211_0,2650
486,486.0,72800.0,2.0,0_1,26241_0,2653
487,487.0,77143.0,2.0,0_1,26191_0,2693
488,488.0,62920.0,2.0,0_1,25331_0,2611
489,489.0,64615.0,2.0,0_1,25731_0,2586
490,490.0,82160.0,2.0,0_1,25851_0,2562
491,491.0,80153.0,2.0,0_1,26021_0,2584
492,492.0,80976.0,2.0,0_1,26641_0,2587
493,493.0,87060.0,2.0,0_1,26691_0,2622
494,494.0,81642.0,2.0,0_1,26751_0,2637
495,495.0,81562.0,2.0,0_1,26611_0,2629
496,496.0,80338.0,2.0,0_1,26741_0,2621
497,497.0,79973.0,2.0,0_1,26591_0,2597
498,498.0,70778.0,2.0,0_1,26471_0,2576
499,499.0,69579.0,2.0,0_1,26451_0,2573
500,500.0,81420.0,2.0,0_1,26571_0,2559
501,501.0,83407.0,2.0,0_1,26851_0,2590
502,502.0,90041.0,2.0,0_1,27351_0,2658
503,503.0,87783.0,2.0,0_1,27831_0,2679
504,504.0,83428.0,2.0,0_1,27971_0,2694
505,505.0,83465.0,2.0,0_1,28591_0,2764
506,506.0,92130.0,2.0,0_1,28401_0,2743
507,507.0,76576.0,2.0,0_1,28061_0,2758
508,508.0,83266.0,2.0,0_1,28361_0,2788
509,509.0,84618.0,2.0,0_1,28451_0,2816
510,510.0,85099.0,2.0,0_1,28401_0,2854
511,511.0,91148.0,2.0,0_1,28301_0,2843
512,512.0,91025.0,2.0,0_1,28161_0,2810
513,513.0,74176.0,2.0,0_1,27931_0,2793
514,514.0,73168.0,2.0,0_1,27591_0,2782
515,515.0,80829.0,2.0,0_1,28241_0,2841
516,516.0,95990.0,2.0,0_1,28191_0,2829
517,517.0,84114.0,2.0,0_1,28751_0,2891
518,518.0,86713.0,2.0,0_1,28931_0,2926
519,519.0,81846.0,2.0,0_1,28801_0,2866
520,520.0,84569.0,2.0,0_1,28551_0,2859
521,521.0,79180.0,2.0,0_1,28521_0,2789
522,522.0,79596.0,2.0,0_1,29281_0,2816
523,523.0,87182.0,2.0,0_1,29021_0,2829
524,524.0,83683.0,2.0,0_1,28311_0,2797
525,525.0,80034.0,2.0,0_1,27651_0,2766
526,526.0,81695.0,2.0,0_1,26921_0,2748
527,527.0,73212.0,2.0,0_1,27211_0,2749
528,528.0,91553.0,2.0,0_1,27561_0,2773
529,529.0,85147.0,2.0,0_1,27451_0,2814
530,530.0,82571.0,2.0,0_1,27501_0,2827
531,531.0,82413.0,2.0,0_1,27491_0,2840
532,532.0,78140.0,2.0,0_1,27471_0,2797
533,533.0,83452.0,2.0,0_1,27821_0,2842
534,534.0,99333.0,2.0,0_1,28161_0,2857
535,535.0,83340.0,2.0,0_1,27821_0,2826
536,536.0,71598.0,2.0,0_1,27741_0,2855
537,537.0,83711.0,2.0,0_1,27741_0,2864
538,538.0,82747.0,2.0,0_1,28041_0,2887
539,539.0,84575.0,2.0,0_1,27471_0,2882
540,540.0,83134.0,2.0,0_1,27571_0,2913
541,541.0,83649.0,2.0,0_1,27441_0,2922
542,542.0,73913.0,2.0,0_1,27471_0,2836
543,543.0,84459.0,2.0,0_1,26601_0,2722
544,544.0,67497.0,2.0,0_1,25871_0,2699
545,545.0,65900.0,2.0,0_1,25261_0,2637
546,546.0,63843.0,2.0,0_1,25031_0,2596
547,547.0,82141.0,2.0,0_1,25461_0,2626
548,548.0,79990.0,2.0,0_1,25851_0,2655
549,549.0,81629.0,2.0,0_1,25971_0,2635
550,550.0,77989.0,2.0,0_1,25721_0,2528
551,551.0,68904.0,2.0,0_1,25191_0,2476
552,552.0,72940.0,2.0,0_1,25721_0,2529
553,553.0,88212.0,2.0,0_1,25331_0,2521
554,554.0,66656.0,2.0,0_1,25641_0,2616
555,555.0,86742.0,2.0,0_1,25831_0,2658
556,556.0,75519.0,2.0,0_1,25901_0,2677
557,557.0,81757.0,2.0,0_1,25931_0,2688
558,558.0,79902.0,2.0,0_1,26151_0,2645
559,559.0,76334.0,2.0,0_1,26131_0,2600
560,560.0,80078.0,2.0,0_1,25701_0,2565
561,561.0,72457.0,2.0,0_1,26191_0,2590
562,562.0,86643.0,2.0,0_1,26351_0,2615
563,563.0,80484.0,2.0,0_1,26331_0,2635
564,564.0,74516.0,2.0,0_1,25941_0,2600
565,565.0,65024.0,2.0,0_1,25101_0,2483
566,566.0,70594.0,2.0,0_1,25081_0,2500
567,567.0,68213.0,2.0,0_1,25391_0,2517
568,568.0,72421.0,2.0,0_1,25891_0,2467
569,569.0,66987.0,2.0,0_1,26071_0,2444
570,570.0,80397.0,2.0,0_1,25441_0,2484
571,571.0,74631.0,2.0,0_1,25641_0,2531
572,572.0,85296.0,2.0,0_1,25801_0,2549
573,573.0,76309.0,2.0,0_1,24731_0,2550
574,574.0,68851.0,2.0,0_1,24441_0,2536
575,575.0,86119.0,2.0,0_1,24591_0,2580
576,576.0,76245.0,2.0,0_1,24631_0,2545
577,577.0,75013.0,2.0,0_1,25261_0,2578
578,578.0,77900.0,2.0,0_1,25101_0,2536
579,579.0,69824.0,2.0,0_1,25391_0,2520
580,580.0,72301.0,2.0,0_1,25721_0,2487
581,581.0,77933.0,2.0,0_1,25801_0,2550
582,582.0,75983.0,2.0,0_1,25321_0,2502
583,583.0,69907.0,2.0,0_1,25911_0,2549
584,584.0,85456.0,2.0,0_1,26021_0,2487
585,585.0,68264.0,2.0,0_1,25711_0,2469
586,586.0,69701.0,2.0,0_1,26081_0,2493
587,587.0,80731.0,2.0,0_1,25821_0,2550
588,588.0,76810.0,2.0,0_1,25231_0,2543
589,589.0,73507.0,2.0,0_1,24941_0,2600
590,590.0,77914.0,2.0,0_1,24891_0,2610
591,591.0,75245.0,2.0,0_1,24781_0,2551
592,592.0,80854.0,2.0,0_1,24561_0,2542
593,593.0,72310.0,2.0,0_1,25051_0,2594
594,594.0,79363.0,2.0,0_1,25531_0,2649
595,595.0,87227.0,2.0,0_1,26231_0,2672
596,596.0,87709.0,2.0,0_1,26561_0,2730
597,597.0,88755.0,2.0,0_1,27161_0,2721
598,598.0,81462.0,2.0,0_1,27681_0,2805
599,599.0,78404.0,2.0,0_1,28211_0,2820
600,600.0,79552.0,2.0,0_1,28461_0,2843
601,601.0,73709.0,2.0,0_1,28791_0,2794
602,602.0,85608.0,2.0,0_1,28391_0,2787
603,603.0,81458.0,2.0,0_1,27701_0,2721
604,604.0,75610.0,2.0,0_1,27011_0,2727
605,605.0,87324.0,2.0,0_1,26481_0,2719
606,606.0,79078.0,2.0,0_1,27121_0,2762
607,607.0,91717.0,2.0,0_1,27431_0,2787
608,608.0,85533.0,2.0,0_1,27821_0,2770
609,609.0,88756.0,2.0,0_1,28181_0,2828
610,610.0,88600.0,2.0,0_1,28921_0,2865
611,611.0,94921.0,2.0,0_1,28881_0,2869
612,612.0,81531.0,2.0,0_1,29561_0,2874
613,613.0,89319.0,2.0,0_1,30101_0,2943
614,614.0,87069.0,2.0,0_1,29881_0,2985
615,615.0,87537.0,2.0,0_1,29901_0,2983
616,616.0,83980.0,2.0,0_1,29691_0,2960
617,617.0,82151.0,2.0,0_1,29431_0,2939
618,618.0,83915.0,2.0,0_1,29831_0,2908
619,619.0,94975.0,2.0,0_1,29621_0,2885
620,620.0,88281.0,2.0,0_1,30051_0,2879
621,621.0,87082.0,2.0,0_1,29961_0,2868
622,622.0,90887.0,2.0,0_1,30191_0,2911
623,623.0,82399.0,2.0,0_1,30311_0,2867
624,624.0,87905.0,2.0,0_1,30421_0,2947
625,625.0,92471.0,2.0,0_1,30681_0,2961
626,626.0,95968.0,2.0,0_1,31001_0,2988
627,627.0,97693.0,2.0,0_1,31531_0,2971
628,628.0,79161.0,2.0,0_1,31451_0,2941
629,629.0,79443.0,2.0,0_1,30741_0,2906
630,630.0,79757.0,2.0,0_1,30301_0,2892
631,631.0,85242.0,2.0,0_1,29841_0,2893
632,632.0,97116.0,2.0,0_1,29721_0,2914
633,633.0,97090.0,2.0,0_1,29711_0,2907
634,634.0,88797.0,2.0,0_1,30031_0,2929
635,635.0,86781.0,2.0,0_1,29541_0,2961
636,636.0,88184.0,2.0,0_1,29871_0,3006
637,637.0,92175.0,2.0,0_1,30001_0,3064
638,638.0,99370.0,2.0,0_1,30061_0,3072
639,639.0,94131.0,2.0,0_1,30211_0,3065
640,640.0,86465.0,2.0,0_1,29841_0,3060
641,641.0,73306.0,2.0,0_1,29121_0,3001
642,642.0,74963.0,2.0,0_1,29291_0,2993
643,643.0,91968.0,2.0,0_1,29431_0,3022
644,644.0,92532.0,2.0,0_1,29711_0,2993
645,645.0,83901.0,2.0,0_1,29351_0,2960
646,646.0,87353.0,2.0,0_1,29001_0,2908
647,647.0,89202.0,2.0,0_1,28981_0,2922
648,648.0,95356.0,2.0,0_1,29571_0,2974
649,649.0,100105.0,2.0,0_1,30061_0,3035
650,650.0,78720.0,2.0,0_1,29861_0,3006
651,651.0,79312.0,2.0,0_1,29561_0,2999
652,652.0,81508.0,2.0,0_1,29131_0,2954
653,653.0,79301.0,2.0,0_1,28971_0,2919
654,654.0,85847.0,2.0,0_1,27881_0,2848
655,655.0,70874.0,2.0,0_1,27421_0,2800
656,656.0,78499.0,2.0,0_1,26641_0,2739
657,657.0,71102.0,2.0,0_1,25851_0,2687
658,658.0,69863.0,2.0,0_1,25861_0,2687
659,659.0,78004.0,2.0,0_1,25731_0,2719
660,660.0,83248.0,2.0,0_1,25241_0,2680
661,661.0,78283.0,2.0,0_1,25221_0,2706
662,662.0,87258.0,2.0,0_1,25691_0,2720
663,663.0,85115.0,2.0,0_1,26201_0,2721
664,664.0,88174.0,2.0,0_1,26301_0,2753
665,665.0,88226.0,2.0,0_1,27491_0,2817
666,666.0,93533.0,2.0,0_1,28401_0,2956
667,667.0,96076.0,2.0,0_1,28771_0,3016
668,668.0,81034.0,2.0,0_1,28871_0,3044
669,669.0,84968.0,2.0,0_1,28651_0,3053
670,670.0,87212.0,2.0,0_1,28241_0,3013
671,671.0,81339.0,2.0,0_1,28251_0,2926
672,672.0,69439.0,2.0,0_1,27941_0,2887
673,673.0,91658.0,2.0,0_1,28091_0,2897
674,674.0,79542.0,2.0,0_1,27741_0,2847
675,675.0,79789.0,2.0,0_1,27861_0,2831
676,676.0,71966.0,2.0,0_1,27971_0,2826
677,677.0,89860.0,2.0,0_1,27691_0,2875
678,678.0,79432.0,2.0,0_1,27491_0,2854
679,679.0,88423.0,2.0,0_1,27991_0,2848
680,680.0,85398.0,2.0,0_1,28471_0,2853
681,681.0,87010.0,2.0,0_1,28491_0,2867
682,682.0,80418.0,2.0,0_1,28621_0,2877
683,683.0,87814.0,2.0,0_1,28401_0,2854
684,684.0,90452.0,2.0,0_1,28571_0,2871
685,685.0,90680.0,2.0,0_1,29061_0,2934
686,686.0,96044.0,2.0,0_1,29831_0,2976
687,687.0,97943.0,2.0,0_1,30251_0,3000
688,688.0,86465.0,2.0,0_1,30471_0,3034
689,689.0,85418.0,2.0,0_1,30121_0,2992
690,690.0,81677.0,2.0,0_1,29571_0,2932
691,691.0,75824.0,2.0,0_1,29751_0,2909
692,692.0,84132.0,2.0,0_1,29811_0,2916
693,693.0,83403.0,2.0,0_1,28941_0,2874
694,694.0,84815.0,2.0,0_1,27741_0,2826
695,695.0,81082.0,2.0,0_1,28211_0,2826
696,696.0,94728.0,2.0,0_1,28331_0,2825
697,697.0,80279.0,2.0,0_1,27981_0,2820
698,698.0,74605.0,2.0,0_1,28371_0,2842
699,699.0,92028.0,2.0,0_1,28261_0,2831
700,700.0,89379.0,2.0,0_1,28711_0,2872
701,701.0,88881.0,2.0,0_1,28381_0,2861
702,702.0,82610.0,2.0,0_1,28231_0,2849
703,703.0,90984.0,2.0,0_1,29171_0,2845
704,704.0,91461.0,2.0,0_1,29921_0,2867
705,705.0,101622.0,2.0,0_1,30371_0,2916
706,706.0,100056.0,2.0,0_1,30581_0,2996
707,707.0,92311.0,2.0,0_1,31071_0,3020
708,708.0,89162.0,2.0,0_1,31291_0,3056
709,709.0,94748.0,2.0,0_1,31811_0,3143
710,710.0,98449.0,2.0,0_1,32711_0,3198
711,711.0,99862.0,2.0,0_1,32171_0,3199
712,712.0,98484.0,2.0,0_1,31971_0,3254
713,713.0,97673.0,2.0,0_1,31831_0,3225
714,714.0,98233.0,2.0,0_1,31791_0,3271
715,715.0,105945.0,2.0,0_1,32011_0,3274
716,716.0,92901.0,2.0,0_1,31751_0,3220
717,717.0,74201.0,2.0,0_1,31061_0,3134
718,718.0,75218.0,2.0,0_1,30531_0,3086
719,719.0,85408.0,2.0,0_1,30221_0,3026
720,720.0,81230.0,2.0,0_1,30051_0,3011
721,721.0,90834.0,2.0,0_1,29701_0,2942
722,722.0,76021.0,2.0,0_1,29531_0,2873
723,723.0,76974.0,2.0,0_1,29691_0,2882
724,724.0,96060.0,2.0,0_1,29201_0,2834
725,725.0,84109.0,2.0,0_1,29121_0,2824
726,726.0,85613.0,2.0,0_1,29291_0,2855
727,727.0,88753.0,2.0,0_1,29381_0,2853
728,728.0,96191.0,2.0,0_1,28931_0,2892
729,729.0,81457.0,2.0,0_1,28961_0,2832
730,730.0,84384.0,2.0,0_1,29061_0,2804
731,731.0,74399.0,2.0,0_1,28201_0,2699
732,732.0,86562.0,2.0,0_1,28201_0,2705
733,733.0,84920.0,2.0,0_1,28371_0,2754
734,734.0,92600.0,2.0,0_1,28631_0,2798
735,735.0,89675.0,2.0,0_1,28861_0,2826
736,736.0,88450.0,2.0,0_1,29681_0,2893
737,737.0,94990.0,2.0,0_1,29701_0,2920
738,738.0,88335.0,2.0,0_1,30431_0,3052
739,739.0,101394.0,2.0,0_1,31071_0,3065
740,740.0,81720.0,2.0,0_1,31181_0,3105
741,741.0,93916.0,2.0,0_1,31321_0,3136
742,742.0,88237.0,2.0,0_1,30421_0,3094
743,743.0,84492.0,2.0,0_1,30691_0,3107
744,744.0,103160.0,2.0,0_1,31251_0,3151
745,745.0,104768.0,2.0,0_1,31141_0,3177
746,746.0,99341.0,2.0,0_1,31071_0,3153
747,747.0,78874.0,2.0,0_1,31211_0,3155
748,748.0,89581.0,2.0,0_1,30291_0,3059
749,749.0,76263.0,2.0,0_1,29931_0,3054
750,750.0,83806.0,2.0,0_1,29531_0,3041
751,751.0,91274.0,2.0,0_1,29591_0,3087
752,752.0,99192.0,2.0,0_1,29431_0,3045
753,753.0,94800.0,2.0,0_1,29851_0,3115
754,754.0,95405.0,2.0,0_1,30021_0,3124
755,755.0,91672.0,2.0,0_1,30101_0,3136
756,756.0,88279.0,2.0,0_1,30311_0,3149
757,757.0,99223.0,2.0,0_1,30781_0,3119
758,758.0,91768.0,2.0,0_1,30891_0,3089
759,759.0,79480.0,2.0,0_1,31721_0,3101
760,760.0,100686.0,2.0,0_1,31421_0,3043
761,761.0,86346.0,2.0,0_1,31791_0,3041
762,762.0,100304.0,2.0,0_1,31521_0,3008
763,763.0,80652.0,2.0,0_1,31141_0,3010
764,764.0,85294.0,2.0,0_1,31341_0,3009
765,765.0,93319.0,2.0,0_1,31621_0,3013
766,766.0,92380.0,2.0,0_1,31601_0,3036
767,767.0,99690.0,2.0,0_1,31211_0,3065
768,768.0,90196.0,2.0,0_1,31001_0,3120
769,769.0,94242.0,2.0,0_1,31001_0,3116
770,770.0,93193.0,2.0,0_1,30961_0,3139
771,771.0,92829.0,2.0,0_1,30761_0,3140
772,772.0,91006.0,2.0,0_1,30531_0,3150
773,773.0,94013.0,2.0,0_1,30111_0,3151
774,774.0,95528.0,2.0,0_1,30921_0,3166
775,775.0,95234.0,2.0,0_1,30901_0,3137
776,776.0,91417.0,2.0,0_1,31131_0,3105
777,777.0,96397.0,2.0,0_1,31221_0,3109
778,778.0,92549.0,2.0,0_1,31711_0,3113
779,779.0,90446.0,2.0,0_1,31891_0,3098
780,780.0,87184.0,2.0,0_1,31661_0,3103
781,781.0,78996.0,2.0,0_1,31241_0,3124
782,782.0,91879.0,2.0,0_1,30571_0,3009
783,783.0,81919.0,2.0,0_1,29671_0,2989
784,784.0,86213.0,2.0,0_1,28571_0,2944
785,785.0,81552.0,2.0,0_1,28641_0,2928
786,786.0,71819.0,2.0,0_1,28281_0,2891
787,787.0,79127.0,2.0,0_1,28041_0,2813
788,788.0,87603.0,2.0,0_1,27741_0,2788
789,789.0,78196.0,2.0,0_1,27481_0,2737
790,790.0,82857.0,2.0,0_1,26971_0,2693
791,791.0,69258.0,2.0,0_1,26971_0,2674
792,792.0,83405.0,2.0,0_1,26991_0,2646
793,793.0,68521.0,2.0,0_1,26531_0,2601
794,794.0,77048.0,2.0,0_1,25361_0,2575
795,795.0,74741.0,2.0,0_1,25431_0,2571
796,796.0,89308.0,2.0,0_1,25941_0,2647
797,797.0,76998.0,2.0,0_1,25571_0,2624
798,798.0,77718.0,2.0,0_1,25761_0,2625
799,799.0,75453.0,2.0,0_1,25831_0,2641
800,800.0,77972.0,2.0,0_1,25711_0,2632
801,801.0,70734.0,2.0,0_1,25881_0,2650
802,802.0,86075.0,2.0,0_1,26071_0,2677
803,803.0,85804.0,2.0,0_1,26491_0,2706
804,804.0,82067.0,2.0,0_1,26601_0,2678
805,805.0,69042.0,2.0,0_1,26631_0,2670
806,806.0,71688.0,2.0,0_1,26171_0,2589
807,807.0,77335.0,2.0,0_1,26661_0,2575
808,808.0,87410.0,2.0,0_1,26911_0,2602
809,809.0,83739.0,2.0,0_1,27031_0,2601
810,810.0,77253.0,2.0,0_1,27071_0,2609
811,811.0,81112.0,2.0,0_1,26951_0,2636
812,812.0,87027.0,2.0,0_1,27081_0,2666
813,813.0,88795.0,2.0,0_1,27561_0,2721
814,814.0,93470.0,2.0,0_1,27531_0,2742
815,815.0,76821.0,2.0,0_1,27821_0,2720
816,816.0,74940.0,2.0,0_1,28101_0,2709
817,817.0,84783.0,2.0,0_1,28131_0,2773
818,818.0,91234.0,2.0,0_1,27921_0,2792
819,819.0,72012.0,2.0,0_1,27541_0,2774
820,820.0,75494.0,2.0,0_1,27531_0,2695
821,821.0,81320.0,2.0,0_1,27201_0,2679
822,822.0,72089.0,2.0,0_1,27711_0,2672
823,823.0,87418.0,2.0,0_1,27671_0,2681
824,824.0,82697.0,2.0,0_1,27871_0,2692
825,825.0,83086.0,2.0,0_1,27501_0,2705
826,826.0,82134.0,2.0,0_1,27481_0,2716
827,827.0,79880.0,2.0,0_1,27931_0,2788
828,828.0,80420.0,2.0,0_1,28001_0,2749
829,829.0,88666.0,2.0,0_1,27311_0,2741
830,830.0,88384.0,2.0,0_1,27891_0,2793
831,831.0,104923.0,2.0,0_1,28771_0,2895
832,832.0,104899.0,2.0,0_1,29311_0,3025
833,833.0,94982.0,2.0,0_1,29541_0,3059
834,834.0,99405.0,2.0,0_1,30181_0,3088
835,835.0,85454.0,2.0,0_1,30491_0,3117
836,836.0,80890.0,2.0,0_1,30421_0,3087
837,837.0,82460.0,2.0,0_1,30391_0,3077
838,838.0,89761.0,2.0,0_1,30591_0,3068
839,839.0,86477.0,2.0,0_1,30761_0,3089
840,840.0,90266.0,2.0,0_1,30041_0,2993
841,841.0,90864.0,2.0,0_1,30411_0,3027
842,842.0,98112.0,2.0,0_1,30341_0,3049
843,843.0,91888.0,2.0,0_1,30581_0,3006
844,844.0,82406.0,2.0,0_1,30701_0,3004
845,845.0,98171.0,2.0,0_1,30581_0,2994
846,846.0,89561.0,2.0,0_1,30401_0,2985
847,847.0,89249.0,2.0,0_1,29911_0,3007
848,848.0,84495.0,2.0,0_1,30111_0,3015
849,849.0,88353.0,2.0,0_1,30651_0,3040
850,850.0,97072.0,2.0,0_1,30921_0,3047
851,851.0,94219.0,2.0,0_1,30571_0,3035
852,852.0,85327.0,2.0,0_1,29891_0,2978
853,853.0,91039.0,2.0,0_1,30121_0,3014
854,854.0,91685.0,2.0,0_1,30211_0,2985
855,855.0,92299.0,2.0,0_1,29881_0,2983
856,856.0,87711.0,2.0,0_1,29901_0,2939
857,857.0,73557.0,2.0,0_1,29321_0,2958
858,858.0,82841.0,2.0,0_1,28761_0,2916
859,859.0,88954.0,2.0,0_1,29231_0,2920
860,860.0,84165.0,2.0,0_1,29351_0,2880
861,861.0,88470.0,2.0,0_1,29601_0,2932
862,862.0,87397.0,2.0,0_1,29941_0,2954
863,863.0,94191.0,2.0,0_1,30061_0,3056
864,864.0,102042.0,2.0,0_1,30301_0,3111
865,865.0,96332.0,2.0,0_1,30581_0,3146
866,866.0,87711.0,2.0,0_1,30831_0,3162
867,867.0,100034.0,2.0,0_1,30761_0,3137
868,868.0,77839.0,2.0,0_1,30311_0,3114
869,869.0,89094.0,2.0,0_1,30031_0,3088
870,870.0,85247.0,2.0,0_1,29671_0,3100
871,871.0,81935.0,2.0,0_1,29621_0,3067
872,872.0,89245.0,2.0,0_1,29641_0,3029
873,873.0,91793.0,2.0,0_1,30101_0,3012
874,874.0,90105.0,2.0,0_1,30321_0,2998
875,875.0,88500.0,2.0,0_1,30321_0,2991
876,876.0,97391.0,2.0,0_1,30581_0,3002
877,877.0,85931.0,2.0,0_1,30081_0,2923
878,878.0,79936.0,2.0,0_1,29391_0,2848
879,879.0,75341.0,2.0,0_1,28901_0,2791
880,880.0,70258.0,2.0,0_1,28521_0,2799
881,881.0,82521.0,2.0,0_1,28301_0,2814
882,882.0,82044.0,2.0,0_1,28091_0,2832
883,883.0,93492.0,2.0,0_1,28331_0,2847
884,884.0,93256.0,2.0,0_1,27731_0,2790
885,885.0,77272.0,2.0,0_1,28071_0,2795
886,886.0,86824.0,2.0,0_1,28811_0,2829
887,887.0,96911.0,2.0,0_1,28951_0,2874
888,888.0,86323.0,2.0,0_1,28611_0,2892
889,889.0,79150.0,2.0,0_1,28741_0,2866
890,890.0,74553.0,2.0,0_1,27941_0,2797
891,891.0,70402.0,2.0,0_1,28311_0,2795
892,892.0,83086.0,2.0,0_1,27501_0,2752
893,893.0,77166.0,2.0,0_1,27761_0,2746
894,894.0,87912.0,2.0,0_1,28091_0,2701
895,895.0,90569.0,2.0,0_1,27691_0,2687
896,896.0,86990.0,2.0,0_1,27801_0,2760
897,897.0,82625.0,2.0,0_1,28001_0,2845
898,898.0,88111.0,2.0,0_1,27861_0,2860
899,899.0,85404.0,2.0,0_1,27611_0,2818
900,900.0,84976.0,2.0,0_1,27661_0,2839
901,901.0,76130.0,2.0,0_1,27151_0,2835
902,902.0,80136.0,2.0,0_1,27851_0,2821
903,903.0,80706.0,2.0,0_1,27871_0,2833
904,904.0,82976.0,2.0,0_1,27881_0,2849
905,905.0,83894.0,2.0,0_1,28071_0,2850
906,906.0,95413.0,2.0,0_1,28761_0,2902
907,907.0,98934.0,2.0,0_1,29461_0,2984
908,908.0,88705.0,2.0,0_1,29901_0,2992
909,909.0,99876.0,2.0,0_1,30151_0,3031
910,910.0,92954.0,2.0,0_1,29931_0,3043
911,911.0,93406.0,2.0,0_1,30001_0,3055
912,912.0,88759.0,2.0,0_1,30121_0,3079
913,913.0,82901.0,2.0,0_1,29961_0,3097
914,914.0,82989.0,2.0,0_1,29311_0,3001
915,915.0,82419.0,2.0,0_1,29451_0,2947
916,916.0,92527.0,2.0,0_1,30141_0,2963
917,917.0,94390.0,2.0,0_1,30221_0,3006
918,918.0,94384.0,2.0,0_1,30611_0,3081
919,919.0,101690.0,2.0,0_1,30971_0,3102
920,920.0,93569.0,2.0,0_1,30921_0,3127
921,921.0,92303.0,2.0,0_1,31121_0,3123
922,922.0,83417.0,2.0,0_1,31081_0,3109
923,923.0,85217.0,2.0,0_1,30961_0,3121
924,924.0,96339.0,2.0,0_1,30981_0,3143
925,925.0,100387.0,2.0,0_1,30831_0,3099
926,926.0,87640.0,2.0,0_1,31021_0,3099
927,927.0,100118.0,2.0,0_1,31031_0,3178
928,928.0,95391.0,2.0,0_1,31471_0,3195
929,929.0,103527.0,2.0,0_1,31661_0,3223
930,930.0,102785.0,2.0,0_1,32271_0,3289
931,931.0,96943.0,2.0,0_1,32561_0,3340
932,932.0,100776.0,2.0,0_1,32601_0,3398
933,933.0,99188.0,2.0,0_1,32491_0,3402
934,934.0,95789.0,2.0,0_1,32651_0,3396
935,935.0,110414.0,2.0,0_1,33131_0,3307
936,936.0,85253.0,2.0,0_1,33221_0,3241
937,937.0,94209.0,2.0,0_1,33401_0,3289
938,938.0,100054.0,2.0,0_1,33441_0,3346
939,939.0,105869.0,2.0,0_1,33121_0,3270
940,940.0,87887.0,2.0,0_1,33171_0,3261
941,941.0,100691.0,2.0,0_1,33851_0,3229
942,942.0,88626.0,2.0,0_1,33551_0,3208
943,943.0,98673.0,2.0,0_1,33351_0,3152
944,944.0,91194.0,2.0,0_1,32821_0,3136
945,945.0,94064.0,2.0,0_1,32931_0,3192
946,946.0,100626.0,2.0,0_1,33611_0,3249
947,947.0,110205.0,2.0,0_1,33361_0,3213
948,948.0,94581.0,2.0,0_1,32931_0,3213
949,949.0,99130.0,2.0,0_1,32351_0,3220
950,950.0,88329.0,2.0,0_1,32761_0,3212
951,951.0,107626.0,2.0,0_1,33021_0,3287
952,952.0,97693.0,2.0,0_1,33071_0,3303
953,953.0,108775.0,2.0,0_1,32951_0,3343
954,954.0,94363.0,2.0,0_1,33521_0,3383
955,955.0,96122.0,2.0,0_1,33531_0,3394
956,956.0,104219.0,2.0,0_1,33731_0,3426
957,957.0,93576.0,2.0,0_1,33981_0,3444
958,958.0,97322.0,2.0,0_1,33821_0,3409
959,959.0,100450.0,2.0,0_1,33921_0,3373
960,960.0,98360.0,2.0,0_1,33551_0,3378
961,961.0,91636.0,2.0,0_1,32441_0,3289
962,962.0,101732.0,2.0,0_1,31311_0,3202
963,963.0,74693.0,2.0,0_1,31141_0,3185
964,964.0,88621.0,2.0,0_1,31081_0,3214
965,965.0,89816.0,2.0,0_1,31061_0,3148
966,966.0,83427.0,2.0,0_1,30651_0,3121
967,967.0,76192.0,2.0,0_1,30641_0,3064
968,968.0,86386.0,2.0,0_1,30531_0,3026
969,969.0,97596.0,2.0,0_1,30951_0,3011
970,970.0,89125.0,2.0,0_1,30631_0,3008
971,971.0,94162.0,2.0,0_1,29891_0,2972
972,972.0,84147.0,2.0,0_1,29251_0,2899
973,973.0,81925.0,2.0,0_1,28551_0,2816
974,974.0,83870.0,2.0,0_1,28991_0,2954
975,975.0,94623.0,2.0,0_1,28771_0,2924
976,976.0,86560.0,2.0,0_1,28641_0,2956
977,977.0,87676.0,2.0,0_1,29111_0,3005
978,978.0,88867.0,2.0,0_1,29341_0,3062
979,979.0,93435.0,2.0,0_1,29451_0,3056
980,980.0,87155.0,2.0,0_1,30061_0,3072
981,981.0,95568.0,2.0,0_1,30221_0,3120
982,982.0,89834.0,2.0,0_1,29701_0,3028
983,983.0,81402.0,2.0,0_1,30181_0,3061
984,984.0,100578.0,2.0,0_1,30131_0,3087
985,985.0,92749.0,2.0,0_1,30071_0,3079
986,986.0,101912.0,2.0,0_1,30711_0,3113
987,987.0,91829.0,2.0,0_1,31361_0,3065
988,988.0,82550.0,2.0,0_1,30981_0,3023
989,989.0,85023.0,2.0,0_1,30791_0,3009
990,990.0,87898.0,2.0,0_1,30401_0,2972
991,991.0,73099.0,2.0,0_1,29621_0,2943
992,992.0,83882.0,2.0,0_1,29301_0,2921
993,993.0,87932.0,2.0,0_1,28961_0,2917
994,994.0,90362.0,2.0,0_1,29141_0,2933
995,995.0,95234.0,2.0,0_1,30001_0,2961
996,996.0,100964.0,2.0,0_1,29931_0,2995
997,997.0,85044.0,2.0,0_1,29831_0,2986
998,998.0,91386.0,2.0,0_1,29831_0,2924
999,999.0,90524.0,2.0,0_1,29861_0,2926
