0,0.0,0.0,256.0,0.001639093137254902,107.0,
1,1.0,6828.0,256.0,0.0016237745098039217,106.0,
2,2.0,6346.0,256.0,0.001639093137254902,107.0,
3,3.0,5686.0,256.0,0.0016237745098039217,106.0,
4,4.0,4898.0,256.0,0.0015778186274509804,103.0,
5,5.0,6188.0,256.0,0.0016850490196078432,110.0,
6,6.0,6820.0,256.0,0.001715686274509804,112.0,
7,7.0,6763.0,256.0,0.0017463235294117648,114.0,
8,8.0,8603.0,256.0,0.0017463235294117648,114.0,
9,9.0,8629.0,256.0,0.001838235294117647,120.0,
10,10.0,9434.0,256.0,0.001914828431372549,125.0,
11,11.0,9162.0,256.0,0.0020986519607843136,137.0,
12,12.0,10969.0,256.0,0.0021292892156862743,139.0,
13,13.0,10565.0,256.0,0.0021599264705882354,141.0,
14,14.0,8715.0,256.0,0.0021599264705882354,141.0,
15,15.0,10709.0,256.0,0.002236519607843137,146.0,
16,16.0,8032.0,256.0,0.0023590686274509803,154.0,
17,17.0,8290.0,256.0,0.00234375,153.0,
18,18.0,7448.0,256.0,0.0023897058823529414,156.0,
19,19.0,6703.0,256.0,0.0023131127450980392,151.0,
20,20.0,8832.0,256.0,0.0024050245098039217,157.0,
21,21.0,8129.0,256.0,0.0023590686274509803,154.0,
22,22.0,5445.0,256.0,0.0023131127450980392,151.0,
23,23.0,7106.0,256.0,0.0023743872549019606,155.0,
24,24.0,8429.0,256.0,0.0022518382352941175,147.0,
25,25.0,9168.0,256.0,0.0023284313725490196,152.0,
26,26.0,12860.0,256.0,0.0023743872549019606,155.0,
27,27.0,10733.0,256.0,0.002420343137254902,158.0,
28,28.0,8266.0,256.0,0.002466299019607843,161.0,
29,29.0,9994.0,256.0,0.0024356617647058824,159.0,
30,30.0,10513.0,256.0,0.0023897058823529414,156.0,
31,31.0,12142.0,256.0,0.002527573529411765,165.0,
32,32.0,11774.0,256.0,0.002542892156862745,166.0,
33,33.0,12329.0,256.0,0.002619485294117647,171.0,
34,34.0,9525.0,256.0,0.0027267156862745097,178.0,
35,35.0,12651.0,256.0,0.002772671568627451,181.0,
36,36.0,11141.0,256.0,0.0029871323529411763,195.0,
37,37.0,13121.0,256.0,0.0030790441176470587,201.0,
38,38.0,11804.0,256.0,0.003094362745098039,202.0,
39,39.0,13397.0,256.0,0.0031403186274509805,205.0,
40,40.0,12659.0,256.0,0.003094362745098039,202.0,
41,41.0,13544.0,256.0,0.0030330882352941177,198.0,
42,42.0,13740.0,256.0,0.0031862745098039215,208.0,
43,43.0,11940.0,256.0,0.0033700980392156864,220.0,
44,44.0,10483.0,256.0,0.0033700980392156864,220.0,
45,45.0,11635.0,256.0,0.0033088235294117647,216.0,
46,46.0,11662.0,256.0,0.003278186274509804,214.0,
47,47.0,14172.0,256.0,0.003324142156862745,217.0,
48,48.0,13160.0,256.0,0.003278186274509804,214.0,
49,49.0,11734.0,256.0,0.0032475490196078433,212.0,
50,50.0,11552.0,256.0,0.0033547794117647057,219.0,
51,51.0,13896.0,256.0,0.003400735294117647,222.0,
52,52.0,15048.0,256.0,0.0033547794117647057,219.0,
53,53.0,13132.0,256.0,0.0033700980392156864,220.0,
54,54.0,10486.0,256.0,0.0033394607843137253,218.0,
55,55.0,11136.0,256.0,0.0033088235294117647,216.0,
56,56.0,13104.0,256.0,0.003125,204.0,
57,57.0,10650.0,256.0,0.0031096813725490194,203.0,
58,58.0,8306.0,256.0,0.003094362745098039,202.0,
59,59.0,13270.0,256.0,0.003201593137254902,209.0,
60,60.0,13635.0,256.0,0.0031403186274509805,205.0,
61,61.0,15306.0,256.0,0.0032322303921568625,211.0,
62,62.0,12605.0,256.0,0.0032322303921568625,211.0,
63,63.0,11930.0,256.0,0.003400735294117647,222.0,
64,64.0,14219.0,256.0,0.003446691176470588,225.0,
65,65.0,12290.0,256.0,0.0034926470588235296,228.0,
66,66.0,12084.0,256.0,0.0035386029411764706,231.0,
67,67.0,13338.0,256.0,0.00350796568627451,229.0,
68,68.0,13234.0,256.0,0.00350796568627451,229.0,
69,69.0,13099.0,256.0,0.0035232843137254903,230.0,
70,70.0,15792.0,256.0,0.003477328431372549,227.0,
71,71.0,11266.0,256.0,0.0034160539215686275,223.0,
72,72.0,14058.0,256.0,0.0034926470588235296,228.0,
73,73.0,14233.0,256.0,0.0034620098039215685,226.0,
74,74.0,17496.0,256.0,0.0036151960784313727,236.0,
75,75.0,13164.0,256.0,0.003630514705882353,237.0,
76,76.0,14518.0,256.0,0.0036458333333333334,238.0,
77,77.0,15115.0,256.0,0.0035232843137254903,230.0,
78,78.0,11907.0,256.0,0.003477328431372549,227.0,
79,79.0,13757.0,256.0,0.003446691176470588,225.0,
80,80.0,16668.0,256.0,0.0035845588235294116,234.0,
81,81.0,16349.0,256.0,0.0036917892156862744,241.0,
82,82.0,16025.0,256.0,0.0038143382352941175,249.0,
83,83.0,12992.0,256.0,0.003783700980392157,247.0,
84,84.0,10067.0,256.0,0.003753063725490196,245.0,
85,85.0,13069.0,256.0,0.003799019607843137,248.0,
86,86.0,12686.0,256.0,0.003936887254901961,257.0,
87,87.0,12891.0,256.0,0.003860294117647059,252.0,
88,88.0,14277.0,256.0,0.0037683823529411765,246.0,
89,89.0,12687.0,256.0,0.0036917892156862744,241.0,
90,90.0,12373.0,256.0,0.0036151960784313727,236.0,
91,91.0,15364.0,256.0,0.0035845588235294116,234.0,
92,92.0,13251.0,256.0,0.0036611519607843137,239.0,
93,93.0,12426.0,256.0,0.003753063725490196,245.0,
94,94.0,13726.0,256.0,0.003860294117647059,252.0,
95,95.0,14347.0,256.0,0.003844975490196078,251.0,
96,96.0,14675.0,256.0,0.003860294117647059,252.0,
97,97.0,16279.0,256.0,0.004013480392156862,262.0,
98,98.0,15107.0,256.0,0.004044117647058824,264.0,
99,99.0,14928.0,256.0,0.003982843137254902,260.0,
100,100.0,15598.0,256.0,0.003998161764705882,261.0,
101,101.0,13342.0,256.0,0.004028799019607844,263.0,
102,102.0,14729.0,256.0,0.003860294117647059,252.0,
103,103.0,14013.0,256.0,0.0038143382352941175,249.0,
104,104.0,16295.0,256.0,0.003844975490196078,251.0,
105,105.0,15171.0,256.0,0.0038756127450980393,253.0,
106,106.0,13143.0,256.0,0.003722426470588235,243.0,
107,107.0,13549.0,256.0,0.003599877450980392,235.0,
108,108.0,11914.0,256.0,0.003630514705882353,237.0,
109,109.0,15019.0,256.0,0.003676470588235294,240.0,
110,110.0,13495.0,256.0,0.003676470588235294,240.0,
111,111.0,13311.0,256.0,0.0037683823529411765,246.0,
112,112.0,18006.0,256.0,0.003753063725490196,245.0,
113,113.0,12172.0,256.0,0.003783700980392157,247.0,
114,114.0,13814.0,256.0,0.0038909313725490197,254.0,
115,115.0,13907.0,256.0,0.003936887254901961,257.0,
116,116.0,13322.0,256.0,0.003860294117647059,252.0,
117,117.0,11306.0,256.0,0.003829656862745098,250.0,
118,118.0,15517.0,256.0,0.003829656862745098,250.0,
119,119.0,15881.0,256.0,0.003753063725490196,245.0,
120,120.0,12872.0,256.0,0.003737745098039216,244.0,
121,121.0,12229.0,256.0,0.0036917892156862744,241.0,
122,122.0,11031.0,256.0,0.003599877450980392,235.0,
123,123.0,11499.0,256.0,0.0035692401960784313,233.0,
124,124.0,12526.0,256.0,0.0035386029411764706,231.0,
125,125.0,11313.0,256.0,0.0035232843137254903,230.0,
126,126.0,11255.0,256.0,0.0034926470588235296,228.0,
127,127.0,10884.0,256.0,0.0033394607843137253,218.0,
128,128.0,10616.0,256.0,0.0032628676470588236,213.0,
129,129.0,10371.0,256.0,0.003216911764705882,210.0,
130,130.0,11122.0,256.0,0.003216911764705882,210.0,
131,131.0,9938.0,256.0,0.003278186274509804,214.0,
132,132.0,12247.0,256.0,0.003278186274509804,214.0,
133,133.0,10651.0,256.0,0.003170955882352941,207.0,
134,134.0,10599.0,256.0,0.0031862745098039215,208.0,
135,135.0,13001.0,256.0,0.0031403186274509805,205.0,
136,136.0,9465.0,256.0,0.003170955882352941,207.0,
137,137.0,9745.0,256.0,0.003048406862745098,199.0,
138,138.0,10706.0,256.0,0.0030177696078431374,197.0,
139,139.0,12889.0,256.0,0.003002450980392157,196.0,
140,140.0,11033.0,256.0,0.0029564950980392156,193.0,
141,141.0,11731.0,256.0,0.0029411764705882353,192.0,
142,142.0,12832.0,256.0,0.0028952205882352942,189.0,
143,143.0,12224.0,256.0,0.002879901960784314,188.0,
144,144.0,10103.0,256.0,0.002879901960784314,188.0,
145,145.0,11218.0,256.0,0.0030177696078431374,197.0,
146,146.0,11805.0,256.0,0.0029564950980392156,193.0,
147,147.0,10427.0,256.0,0.002864583333333333,187.0,
148,148.0,8286.0,256.0,0.002849264705882353,186.0,
149,149.0,11781.0,256.0,0.002925857843137255,191.0,
150,150.0,13085.0,256.0,0.0029411764705882353,192.0,
151,151.0,11012.0,256.0,0.0028952205882352942,189.0,
152,152.0,9930.0,256.0,0.002849264705882353,186.0,
153,153.0,9773.0,256.0,0.002864583333333333,187.0,
154,154.0,12448.0,256.0,0.003002450980392157,196.0,
155,155.0,11156.0,256.0,0.003048406862745098,199.0,
156,156.0,9997.0,256.0,0.0031096813725490194,203.0,
157,157.0,11382.0,256.0,0.003048406862745098,199.0,
158,158.0,12466.0,256.0,0.0029871323529411763,195.0,
159,159.0,11473.0,256.0,0.0029411764705882353,192.0,
160,160.0,12437.0,256.0,0.0029105392156862746,190.0,
161,161.0,13387.0,256.0,0.002925857843137255,191.0,
162,162.0,11523.0,256.0,0.002971813725490196,194.0,
163,163.0,11547.0,256.0,0.0029871323529411763,195.0,
164,164.0,11840.0,256.0,0.0029871323529411763,195.0,
165,165.0,11837.0,256.0,0.002971813725490196,194.0,
166,166.0,9407.0,256.0,0.0028952205882352942,189.0,
167,167.0,12359.0,256.0,0.002925857843137255,191.0,
168,168.0,11887.0,256.0,0.0029105392156862746,190.0,
169,169.0,12433.0,256.0,0.002849264705882353,186.0,
170,170.0,11560.0,256.0,0.0026807598039215686,175.0,
171,171.0,10851.0,256.0,0.002650122549019608,173.0,
172,172.0,12102.0,256.0,0.0026654411764705883,174.0,
173,173.0,10484.0,256.0,0.0025582107843137255,167.0,
174,174.0,9156.0,256.0,0.0025122549019607845,164.0,
175,175.0,9437.0,256.0,0.002466299019607843,161.0,
176,176.0,11264.0,256.0,0.0024509803921568627,160.0,
177,177.0,12622.0,256.0,0.0023590686274509803,154.0,
178,178.0,12299.0,256.0,0.0024050245098039217,157.0,
179,179.0,12556.0,256.0,0.0023897058823529414,156.0,
180,180.0,13925.0,256.0,0.0023590686274509803,154.0,
181,181.0,14144.0,256.0,0.0023131127450980392,151.0,
182,182.0,13163.0,256.0,0.002297794117647059,150.0,
183,183.0,12779.0,256.0,0.0022212009803921568,145.0,
184,184.0,11052.0,256.0,0.002190563725490196,143.0,
185,185.0,12674.0,256.0,0.0022058823529411764,144.0,
186,186.0,11958.0,256.0,0.0022671568627450982,148.0,
187,187.0,12546.0,256.0,0.002190563725490196,143.0,
188,188.0,11217.0,256.0,0.0021752450980392158,142.0,
189,189.0,10587.0,256.0,0.0020373774509803923,133.0,
190,190.0,12785.0,256.0,0.002022058823529412,132.0,
191,191.0,11253.0,256.0,0.002022058823529412,132.0,
192,192.0,10234.0,256.0,0.0018535539215686274,121.0,
193,193.0,11295.0,256.0,0.001838235294117647,120.0,
194,194.0,9475.0,256.0,0.0017769607843137255,116.0,
195,195.0,13935.0,256.0,0.0018229166666666667,119.0,
196,196.0,11400.0,256.0,0.0017463235294117648,114.0,
197,197.0,10220.0,256.0,0.001715686274509804,112.0,
198,198.0,12950.0,256.0,0.0017003676470588236,111.0,
199,199.0,10821.0,256.0,0.0017003676470588236,111.0,
200,200.0,10281.0,256.0,0.0016697303921568627,109.0,
201,201.0,12179.0,256.0,0.0016544117647058823,108.0,
202,202.0,10320.0,256.0,0.0017003676470588236,111.0,
203,203.0,11864.0,256.0,0.0016237745098039217,106.0,
204,204.0,11722.0,256.0,0.001608455882352941,105.0,
205,205.0,11306.0,256.0,0.0015625,102.0,
206,206.0,12567.0,256.0,0.0015318627450980392,100.0,
207,207.0,13034.0,256.0,0.001485906862745098,97.0,
208,208.0,9443.0,256.0,0.0014705882352941176,96.0,
209,209.0,11370.0,256.0,0.0014552696078431373,95.0,
210,210.0,14758.0,256.0,0.001409313725490196,92.0,
211,211.0,14684.0,256.0,0.0014246323529411764,93.0,
212,212.0,12988.0,256.0,0.001485906862745098,97.0,
213,213.0,11109.0,256.0,0.0014705882352941176,96.0,
214,214.0,10601.0,256.0,0.001439950980392157,94.0,
215,215.0,11714.0,256.0,0.0015012254901960785,98.0,
216,216.0,12455.0,256.0,0.0014705882352941176,96.0,
217,217.0,11653.0,256.0,0.001485906862745098,97.0,
218,218.0,12543.0,256.0,0.0014552696078431373,95.0,
219,219.0,11676.0,256.0,0.0014552696078431373,95.0,
220,220.0,11911.0,256.0,0.0014705882352941176,96.0,
221,221.0,13308.0,256.0,0.0014705882352941176,96.0,
222,222.0,13470.0,256.0,0.0014705882352941176,96.0,
223,223.0,12617.0,256.0,0.001439950980392157,94.0,
224,224.0,7139.0,256.0,0.001439950980392157,94.0,
225,225.0,12355.0,256.0,0.0014246323529411764,93.0,
226,226.0,12987.0,256.0,0.0013633578431372548,89.0,
227,227.0,11820.0,256.0,0.0013327205882352942,87.0,
228,228.0,13063.0,256.0,0.0013480392156862745,88.0,
229,229.0,13227.0,256.0,0.0013327205882352942,87.0,
230,230.0,12369.0,256.0,0.0013633578431372548,89.0,
231,231.0,11276.0,256.0,0.0013174019607843138,86.0,
232,232.0,12071.0,256.0,0.0012714460784313726,83.0,
233,233.0,14028.0,256.0,0.0012254901960784314,80.0,
234,234.0,14000.0,256.0,0.001210171568627451,79.0,
235,235.0,13481.0,256.0,0.0011948529411764707,78.0,
236,236.0,10298.0,256.0,0.0011948529411764707,78.0,
237,237.0,13810.0,256.0,0.0012254901960784314,80.0,
238,238.0,12443.0,256.0,0.0012714460784313726,83.0,
239,239.0,12668.0,256.0,0.001286764705882353,84.0,
240,240.0,12980.0,256.0,0.0012561274509803922,82.0,
241,241.0,13237.0,256.0,0.001210171568627451,79.0,
242,242.0,10597.0,256.0,0.0012254901960784314,80.0,
243,243.0,15206.0,256.0,0.0012408088235294117,81.0,
244,244.0,13551.0,256.0,0.0012254901960784314,80.0,
245,245.0,13314.0,256.0,0.001210171568627451,79.0,
246,246.0,13870.0,256.0,0.001210171568627451,79.0,
247,247.0,11861.0,256.0,0.0011642156862745098,76.0,
248,248.0,15472.0,256.0,0.0011795343137254901,77.0,
249,249.0,11122.0,256.0,0.0011948529411764707,78.0,
250,250.0,14421.0,256.0,0.001210171568627451,79.0,
251,251.0,13390.0,256.0,0.0011335784313725491,74.0,
252,252.0,14272.0,256.0,0.0010876225490196079,71.0,
253,253.0,13613.0,256.0,0.0011182598039215686,73.0,
254,254.0,13272.0,256.0,0.0011488970588235295,75.0,
255,255.0,15846.0,256.0,0.0011642156862745098,76.0,
256,256.0,14533.0,256.0,0.0011795343137254901,77.0,
257,257.0,15912.0,256.0,0.0011488970588235295,75.0,
258,258.0,14519.0,256.0,0.0011182598039215686,73.0,
259,259.0,14116.0,256.0,0.0011488970588235295,75.0,
260,260.0,14839.0,256.0,0.0011795343137254901,77.0,
261,261.0,14223.0,256.0,0.0011182598039215686,73.0,
262,262.0,18748.0,256.0,0.0011488970588235295,75.0,
263,263.0,13188.0,256.0,0.0011029411764705882,72.0,
264,264.0,14317.0,256.0,0.0011029411764705882,72.0,
265,265.0,11912.0,256.0,0.0010876225490196079,71.0,
266,266.0,13495.0,256.0,0.0011488970588235295,75.0,
267,267.0,13758.0,256.0,0.0011488970588235295,75.0,
268,268.0,13394.0,256.0,0.0011642156862745098,76.0,
269,269.0,16946.0,256.0,0.0011948529411764707,78.0,
270,270.0,16966.0,256.0,0.0011642156862745098,76.0,
271,271.0,15949.0,256.0,0.0011642156862745098,76.0,
272,272.0,14798.0,256.0,0.0011642156862745098,76.0,
273,273.0,13766.0,256.0,0.0011795343137254901,77.0,
274,274.0,14064.0,256.0,0.0011948529411764707,78.0,
275,275.0,12640.0,256.0,0.0011488970588235295,75.0,
276,276.0,13271.0,256.0,0.0011795343137254901,77.0,
277,277.0,16313.0,256.0,0.001210171568627451,79.0,
278,278.0,14769.0,256.0,0.001210171568627451,79.0,
279,279.0,13747.0,256.0,0.001210171568627451,79.0,
280,280.0,16051.0,256.0,0.0012561274509803922,82.0,
281,281.0,13021.0,256.0,0.0012408088235294117,81.0,
282,282.0,16455.0,256.0,0.0011948529411764707,78.0,
283,283.0,14568.0,256.0,0.0011948529411764707,78.0,
284,284.0,17117.0,256.0,0.0011488970588235295,75.0,
285,285.0,19248.0,256.0,0.0011488970588235295,75.0,
286,286.0,14555.0,256.0,0.0011948529411764707,78.0,
287,287.0,17293.0,256.0,0.001210171568627451,79.0,
288,288.0,17041.0,256.0,0.0012254901960784314,80.0,
289,289.0,15224.0,256.0,0.0012408088235294117,81.0,
290,290.0,16903.0,256.0,0.0012408088235294117,81.0,
291,291.0,18742.0,256.0,0.001286764705882353,84.0,
292,292.0,17386.0,256.0,0.0012714460784313726,83.0,
293,293.0,16429.0,256.0,0.0012561274509803922,82.0,
294,294.0,14645.0,256.0,0.0012561274509803922,82.0,
295,295.0,16054.0,256.0,0.0012561274509803922,82.0,
296,296.0,18507.0,256.0,0.0012561274509803922,82.0,
297,297.0,14555.0,256.0,0.0013020833333333333,85.0,
298,298.0,15180.0,256.0,0.0013174019607843138,86.0,
299,299.0,16266.0,256.0,0.0013480392156862745,88.0,
300,300.0,15544.0,256.0,0.0013327205882352942,87.0,
301,301.0,20958.0,256.0,0.0013327205882352942,87.0,
302,302.0,15368.0,256.0,0.0013327205882352942,87.0,
303,303.0,16502.0,256.0,0.0013174019607843138,86.0,
304,304.0,15285.0,256.0,0.0013020833333333333,85.0,
305,305.0,19231.0,256.0,0.0013480392156862745,88.0,
306,306.0,18643.0,256.0,0.0013327205882352942,87.0,
307,307.0,16097.0,256.0,0.0013020833333333333,85.0,
308,308.0,17526.0,256.0,0.0013633578431372548,89.0,
309,309.0,20865.0,256.0,0.0013633578431372548,89.0,
310,310.0,17149.0,256.0,0.0013786764705882354,90.0,
311,311.0,16300.0,256.0,0.001409313725490196,92.0,
312,312.0,19272.0,256.0,0.0013939950980392157,91.0,
313,313.0,19966.0,256.0,0.0013786764705882354,90.0,
314,314.0,14826.0,256.0,0.0013939950980392157,91.0,
315,315.0,17004.0,256.0,0.0013939950980392157,91.0,
316,316.0,18177.0,256.0,0.001409313725490196,92.0,
317,317.0,15376.0,256.0,0.0013786764705882354,90.0,
318,318.0,18702.0,256.0,0.0014246323529411764,93.0,
319,319.0,19991.0,256.0,0.0013786764705882354,90.0,
320,320.0,17815.0,256.0,0.0013786764705882354,90.0,
321,321.0,18136.0,256.0,0.0014246323529411764,93.0,
322,322.0,16645.0,256.0,0.0013786764705882354,90.0,
323,323.0,18628.0,256.0,0.0014246323529411764,93.0,
324,324.0,17881.0,256.0,0.0013939950980392157,91.0,
325,325.0,16889.0,256.0,0.0013939950980392157,91.0,
326,326.0,16845.0,256.0,0.001409313725490196,92.0,
327,327.0,21118.0,256.0,0.0013939950980392157,91.0,
328,328.0,18301.0,256.0,0.0013480392156862745,88.0,
329,329.0,17333.0,256.0,0.0013480392156862745,88.0,
330,330.0,19443.0,256.0,0.0013480392156862745,88.0,
331,331.0,17203.0,256.0,0.0013633578431372548,89.0,
332,332.0,20543.0,256.0,0.0013939950980392157,91.0,
333,333.0,20988.0,256.0,0.001409313725490196,92.0,
334,334.0,21731.0,256.0,0.0013480392156862745,88.0,
335,335.0,23134.0,256.0,0.0013480392156862745,88.0,
336,336.0,16642.0,256.0,0.0013174019607843138,86.0,
337,337.0,20828.0,256.0,0.0013480392156862745,88.0,
338,338.0,19561.0,256.0,0.0013633578431372548,89.0,
339,339.0,19383.0,256.0,0.0013327205882352942,87.0,
340,340.0,17384.0,256.0,0.0013480392156862745,88.0,
341,341.0,12975.0,256.0,0.0013174019607843138,86.0,
342,342.0,19493.0,256.0,0.0013327205882352942,87.0,
343,343.0,17092.0,256.0,0.0013174019607843138,86.0,
344,344.0,18268.0,256.0,0.0013480392156862745,88.0,
345,345.0,14694.0,256.0,0.0013786764705882354,90.0,
346,346.0,15424.0,256.0,0.0013480392156862745,88.0,
347,347.0,12832.0,256.0,0.0013480392156862745,88.0,
348,348.0,14774.0,256.0,0.0013327205882352942,87.0,
349,349.0,19609.0,256.0,0.0013174019607843138,86.0,
350,350.0,23082.0,256.0,0.0013327205882352942,87.0,
351,351.0,20297.0,256.0,0.0013327205882352942,87.0,
352,352.0,16910.0,256.0,0.0013480392156862745,88.0,
353,353.0,18096.0,256.0,0.0013480392156862745,88.0,
354,354.0,20310.0,256.0,0.0013327205882352942,87.0,
355,355.0,18191.0,256.0,0.0013480392156862745,88.0,
356,356.0,15986.0,256.0,0.001286764705882353,84.0,
357,357.0,18335.0,256.0,0.001286764705882353,84.0,
358,358.0,20026.0,256.0,0.0013174019607843138,86.0,
359,359.0,21227.0,256.0,0.0013480392156862745,88.0,
360,360.0,19260.0,256.0,0.0013939950980392157,91.0,
361,361.0,17641.0,256.0,0.0013633578431372548,89.0,
362,362.0,18763.0,256.0,0.0013480392156862745,88.0,
363,363.0,19315.0,256.0,0.0013633578431372548,89.0,
364,364.0,20163.0,256.0,0.0013939950980392157,91.0,
365,365.0,20107.0,256.0,0.0014246323529411764,93.0,
366,366.0,19931.0,256.0,0.001439950980392157,94.0,
367,367.0,19760.0,256.0,0.001409313725490196,92.0,
368,368.0,21329.0,256.0,0.001409313725490196,92.0,
369,369.0,18445.0,256.0,0.001439950980392157,94.0,
370,370.0,19906.0,256.0,0.001409313725490196,92.0,
371,371.0,21295.0,256.0,0.0014246323529411764,93.0,
372,372.0,21362.0,256.0,0.0013939950980392157,91.0,
373,373.0,24556.0,256.0,0.0013633578431372548,89.0,
374,374.0,22919.0,256.0,0.0013480392156862745,88.0,
375,375.0,20767.0,256.0,0.0013786764705882354,90.0,
376,376.0,18238.0,256.0,0.0013633578431372548,89.0,
377,377.0,24387.0,256.0,0.0013480392156862745,88.0,
378,378.0,18516.0,256.0,0.0013786764705882354,90.0,
379,379.0,20963.0,256.0,0.0013786764705882354,90.0,
380,380.0,19985.0,256.0,0.001409313725490196,92.0,
381,381.0,19205.0,256.0,0.0013939950980392157,91.0,
382,382.0,20438.0,256.0,0.0014246323529411764,93.0,
383,383.0,20128.0,256.0,0.0014552696078431373,95.0,
384,384.0,23090.0,256.0,0.001439950980392157,94.0,
385,385.0,21514.0,256.0,0.0014246323529411764,93.0,
386,386.0,20930.0,256.0,0.0013786764705882354,90.0,
387,387.0,23247.0,256.0,0.0013480392156862745,88.0,
388,388.0,20443.0,256.0,0.0013480392156862745,88.0,
389,389.0,18578.0,256.0,0.0013633578431372548,89.0,
390,390.0,20357.0,256.0,0.0013939950980392157,91.0,
391,391.0,19683.0,256.0,0.001409313725490196,92.0,
392,392.0,23585.0,256.0,0.001439950980392157,94.0,
393,393.0,19746.0,256.0,0.0014705882352941176,96.0,
394,394.0,23453.0,256.0,0.001439950980392157,94.0,
395,395.0,25080.0,256.0,0.0014246323529411764,93.0,
396,396.0,21424.0,256.0,0.0014552696078431373,95.0,
397,397.0,22761.0,256.0,0.0014552696078431373,95.0,
398,398.0,24695.0,256.0,0.0014552696078431373,95.0,
399,399.0,20602.0,256.0,0.0014705882352941176,96.0,
400,400.0,25575.0,256.0,0.0015012254901960785,98.0,
401,401.0,21629.0,256.0,0.0015012254901960785,98.0,
402,402.0,25775.0,256.0,0.001485906862745098,97.0,
403,403.0,21965.0,256.0,0.001485906862745098,97.0,
404,404.0,22378.0,256.0,0.0015318627450980392,100.0,
405,405.0,22712.0,256.0,0.0015778186274509804,103.0,
406,406.0,26682.0,256.0,0.0016237745098039217,106.0,
407,407.0,28851.0,256.0,0.0016850490196078432,110.0,
408,408.0,27313.0,256.0,0.0016697303921568627,109.0,
409,409.0,25034.0,256.0,0.0015778186274509804,103.0,
410,410.0,26065.0,256.0,0.0015931372549019608,104.0,
411,411.0,27856.0,256.0,0.0015778186274509804,103.0,
412,412.0,27517.0,256.0,0.0015471813725490195,101.0,
413,413.0,22715.0,256.0,0.0015778186274509804,103.0,
414,414.0,26956.0,256.0,0.0015318627450980392,100.0,
415,415.0,27239.0,256.0,0.0015318627450980392,100.0,
416,416.0,26171.0,256.0,0.0015318627450980392,100.0,
417,417.0,27459.0,256.0,0.0015778186274509804,103.0,
418,418.0,25113.0,256.0,0.0015931372549019608,104.0,
419,419.0,24818.0,256.0,0.0015318627450980392,100.0,
420,420.0,26985.0,256.0,0.0015318627450980392,100.0,
421,421.0,28083.0,256.0,0.0015625,102.0,
422,422.0,27447.0,256.0,0.0015471813725490195,101.0,
423,423.0,27329.0,256.0,0.0015625,102.0,
424,424.0,28057.0,256.0,0.0016237745098039217,106.0,
425,425.0,29828.0,256.0,0.001639093137254902,107.0,
426,426.0,25047.0,256.0,0.001639093137254902,107.0,
427,427.0,27890.0,256.0,0.0016544117647058823,108.0,
428,428.0,27588.0,256.0,0.0016237745098039217,106.0,
429,429.0,27207.0,256.0,0.001608455882352941,105.0,
430,430.0,29688.0,256.0,0.0015931372549019608,104.0,
431,431.0,33851.0,256.0,0.0015778186274509804,103.0,
432,432.0,31494.0,256.0,0.0015931372549019608,104.0,
433,433.0,33227.0,256.0,0.0015625,102.0,
434,434.0,26067.0,256.0,0.0015778186274509804,103.0,
435,435.0,31454.0,256.0,0.001608455882352941,105.0,
436,436.0,34427.0,256.0,0.0016237745098039217,106.0,
437,437.0,29833.0,256.0,0.0015165441176470589,99.0,
438,438.0,25125.0,256.0,0.0015471813725490195,101.0,
439,439.0,28768.0,256.0,0.0015471813725490195,101.0,
440,440.0,26660.0,256.0,0.0015165441176470589,99.0,
441,441.0,27932.0,256.0,0.0014705882352941176,96.0,
442,442.0,33639.0,256.0,0.0015165441176470589,99.0,
443,443.0,31972.0,256.0,0.0015318627450980392,100.0,
444,444.0,30785.0,256.0,0.0015778186274509804,103.0,
445,445.0,33284.0,256.0,0.001639093137254902,107.0,
446,446.0,33520.0,256.0,0.0016237745098039217,106.0,
447,447.0,26261.0,256.0,0.0016237745098039217,106.0,
448,448.0,29219.0,256.0,0.001608455882352941,105.0,
449,449.0,26505.0,256.0,0.0016544117647058823,108.0,
450,450.0,24751.0,256.0,0.001639093137254902,107.0,
451,451.0,33444.0,256.0,0.0016237745098039217,106.0,
452,452.0,33094.0,256.0,0.001639093137254902,107.0,
453,453.0,33903.0,256.0,0.0016544117647058823,108.0,
454,454.0,33886.0,256.0,0.0016544117647058823,108.0,
455,455.0,31553.0,256.0,0.0016850490196078432,110.0,
456,456.0,33927.0,256.0,0.0016850490196078432,110.0,
457,457.0,29665.0,256.0,0.0016697303921568627,109.0,
458,458.0,28856.0,256.0,0.0016697303921568627,109.0,
459,459.0,33214.0,256.0,0.0016850490196078432,110.0,
460,460.0,34604.0,256.0,0.0016697303921568627,109.0,
461,461.0,33589.0,256.0,0.0016697303921568627,109.0,
462,462.0,35846.0,256.0,0.0016850490196078432,110.0,
463,463.0,32740.0,256.0,0.0016237745098039217,106.0,
464,464.0,32986.0,256.0,0.0016237745098039217,106.0,
465,465.0,33894.0,256.0,0.0016237745098039217,106.0,
466,466.0,33274.0,256.0,0.001639093137254902,107.0,
467,467.0,33056.0,256.0,0.0016544117647058823,108.0,
468,468.0,31535.0,256.0,0.0016544117647058823,108.0,
469,469.0,41946.0,256.0,0.0016697303921568627,109.0,
470,470.0,35257.0,256.0,0.001639093137254902,107.0,
471,471.0,34995.0,256.0,0.001639093137254902,107.0,
472,472.0,36351.0,256.0,0.0016697303921568627,109.0,
473,473.0,34726.0,256.0,0.0016697303921568627,109.0,
474,474.0,33885.0,256.0,0.001715686274509804,112.0,
475,475.0,31180.0,256.0,0.0017463235294117648,114.0,
476,476.0,35900.0,256.0,0.0017463235294117648,114.0,
477,477.0,37157.0,256.0,0.0017769607843137255,116.0,
478,478.0,36049.0,256.0,0.0018075980392156864,118.0,
479,479.0,38902.0,256.0,0.0017922794117647058,117.0,
480,480.0,39367.0,256.0,0.0018229166666666667,119.0,
481,481.0,26497.0,256.0,0.0017922794117647058,117.0,
482,482.0,41312.0,256.0,0.0018075980392156864,118.0,
483,483.0,37869.0,256.0,0.001838235294117647,120.0,
484,484.0,35842.0,256.0,0.001914828431372549,125.0,
485,485.0,40221.0,256.0,0.001868872549019608,122.0,
486,486.0,36608.0,256.0,0.0018841911764705883,123.0,
487,487.0,24374.0,256.0,0.0018841911764705883,123.0,
488,488.0,39130.0,256.0,0.0018535539215686274,121.0,
489,489.0,37596.0,256.0,0.001868872549019608,122.0,
490,490.0,36927.0,256.0,0.0018841911764705883,123.0,
491,491.0,36714.0,256.0,0.001914828431372549,125.0,
492,492.0,37306.0,256.0,0.001914828431372549,125.0,
493,493.0,34953.0,256.0,0.00196078431372549,128.0,
494,494.0,39506.0,256.0,0.0019454656862745098,127.0,
495,495.0,34169.0,256.0,0.0020373774509803923,133.0,
496,496.0,40466.0,256.0,0.001991421568627451,130.0,
497,497.0,42541.0,256.0,0.0019761029411764705,129.0,
498,498.0,35866.0,256.0,0.002006740196078431,131.0,
499,499.0,39880.0,256.0,0.0019761029411764705,129.0,
500,500.0,39566.0,256.0,0.001991421568627451,130.0,
501,501.0,34337.0,256.0,0.002006740196078431,131.0,
502,502.0,38617.0,256.0,0.001991421568627451,130.0,
503,503.0,35757.0,256.0,0.00196078431372549,128.0,
504,504.0,38338.0,256.0,0.002006740196078431,131.0,
505,505.0,33450.0,256.0,0.001991421568627451,130.0,
506,506.0,36731.0,256.0,0.0019761029411764705,129.0,
507,507.0,33878.0,256.0,0.001991421568627451,130.0,
508,508.0,29078.0,256.0,0.0019454656862745098,127.0,
509,509.0,32505.0,256.0,0.001914828431372549,125.0,
510,510.0,37466.0,256.0,0.001914828431372549,125.0,
511,511.0,31513.0,256.0,0.0019301470588235295,126.0,
512,512.0,36826.0,256.0,0.0018995098039215686,124.0,
513,513.0,37328.0,256.0,0.0018535539215686274,121.0,
514,514.0,41028.0,256.0,0.0018841911764705883,123.0,
515,515.0,34442.0,256.0,0.0018995098039215686,124.0,
516,516.0,35140.0,256.0,0.0018841911764705883,123.0,
517,517.0,35850.0,256.0,0.0018535539215686274,121.0,
518,518.0,36914.0,256.0,0.0018229166666666667,119.0,
519,519.0,35944.0,256.0,0.001868872549019608,122.0,
520,520.0,33626.0,256.0,0.0018841911764705883,123.0,
521,521.0,36159.0,256.0,0.0018995098039215686,124.0,
522,522.0,33082.0,256.0,0.0018841911764705883,123.0,
523,523.0,38933.0,256.0,0.001838235294117647,120.0,
524,524.0,35729.0,256.0,0.0018535539215686274,121.0,
525,525.0,34332.0,256.0,0.0017922794117647058,117.0,
526,526.0,38116.0,256.0,0.0018075980392156864,118.0,
527,527.0,28862.0,256.0,0.0017616421568627451,115.0,
528,528.0,30421.0,256.0,0.0017922794117647058,117.0,
529,529.0,34960.0,256.0,0.0017922794117647058,117.0,
530,530.0,39166.0,256.0,0.0018535539215686274,121.0,
531,531.0,31600.0,256.0,0.0018229166666666667,119.0,
532,532.0,40573.0,256.0,0.0017922794117647058,117.0,
533,533.0,36616.0,256.0,0.0017463235294117648,114.0,
534,534.0,35282.0,256.0,0.001715686274509804,112.0,
535,535.0,37915.0,256.0,0.0017003676470588236,111.0,
536,536.0,34212.0,256.0,0.0017003676470588236,111.0,
537,537.0,34924.0,256.0,0.0016697303921568627,109.0,
538,538.0,34555.0,256.0,0.0016544117647058823,108.0,
539,539.0,39392.0,256.0,0.0017003676470588236,111.0,
540,540.0,38331.0,256.0,0.0016697303921568627,109.0,
541,541.0,41535.0,256.0,0.0017310049019607842,113.0,
542,542.0,32816.0,256.0,0.0017463235294117648,114.0,
543,543.0,36421.0,256.0,0.001715686274509804,112.0,
544,544.0,33958.0,256.0,0.0017769607843137255,116.0,
545,545.0,38179.0,256.0,0.0018075980392156864,118.0,
546,546.0,39545.0,256.0,0.0018075980392156864,118.0,
547,547.0,42817.0,256.0,0.0018535539215686274,121.0,
548,548.0,33543.0,256.0,0.0018229166666666667,119.0,
549,549.0,41401.0,256.0,0.0018535539215686274,121.0,
550,550.0,40976.0,256.0,0.0018535539215686274,121.0,
551,551.0,40600.0,256.0,0.001868872549019608,122.0,
552,552.0,40045.0,256.0,0.0018535539215686274,121.0,
553,553.0,42643.0,256.0,0.001868872549019608,122.0,
554,554.0,37827.0,256.0,0.0018535539215686274,121.0,
555,555.0,40195.0,256.0,0.0018841911764705883,123.0,
556,556.0,39322.0,256.0,0.0018841911764705883,123.0,
557,557.0,36370.0,256.0,0.0018995098039215686,124.0,
558,558.0,43680.0,256.0,0.001868872549019608,122.0,
559,559.0,42267.0,256.0,0.0018535539215686274,121.0,
560,560.0,37686.0,256.0,0.0018995098039215686,124.0,
561,561.0,37175.0,256.0,0.001868872549019608,122.0,
562,562.0,39360.0,256.0,0.001868872549019608,122.0,
563,563.0,39215.0,256.0,0.0018535539215686274,121.0,
564,564.0,35169.0,256.0,0.0018841911764705883,123.0,
565,565.0,42880.0,256.0,0.0018995098039215686,124.0,
566,566.0,34513.0,256.0,0.0019761029411764705,129.0,
567,567.0,28383.0,256.0,0.0019761029411764705,129.0,
568,568.0,36308.0,256.0,0.002022058823529412,132.0,
569,569.0,33172.0,256.0,0.0019761029411764705,129.0,
570,570.0,37857.0,256.0,0.0019761029411764705,129.0,
571,571.0,34749.0,256.0,0.002006740196078431,131.0,
572,572.0,36025.0,256.0,0.0019761029411764705,129.0,
573,573.0,35172.0,256.0,0.0019301470588235295,126.0,
574,574.0,32486.0,256.0,0.001914828431372549,125.0,
575,575.0,35001.0,256.0,0.001838235294117647,120.0,
576,576.0,29574.0,256.0,0.0018535539215686274,121.0,
577,577.0,31870.0,256.0,0.0018535539215686274,121.0,
578,578.0,31572.0,256.0,0.0018075980392156864,118.0,
579,579.0,32450.0,256.0,0.0018075980392156864,118.0,
580,580.0,35908.0,256.0,0.001838235294117647,120.0,
581,581.0,36102.0,256.0,0.0018535539215686274,121.0,
582,582.0,37523.0,256.0,0.0018535539215686274,121.0,
583,583.0,38816.0,256.0,0.001868872549019608,122.0,
584,584.0,35141.0,256.0,0.0019301470588235295,126.0,
585,585.0,38976.0,256.0,0.0019454656862745098,127.0,
586,586.0,34445.0,256.0,0.00196078431372549,128.0,
587,587.0,32894.0,256.0,0.001991421568627451,130.0,
588,588.0,32000.0,256.0,0.002006740196078431,131.0,
589,589.0,34455.0,256.0,0.001991421568627451,130.0,
590,590.0,31964.0,256.0,0.002006740196078431,131.0,
591,591.0,40769.0,256.0,0.001991421568627451,130.0,
592,592.0,38409.0,256.0,0.00196078431372549,128.0,
593,593.0,38898.0,256.0,0.0018995098039215686,124.0,
594,594.0,32602.0,256.0,0.0018995098039215686,124.0,
595,595.0,29793.0,256.0,0.002006740196078431,131.0,
596,596.0,30198.0,256.0,0.0019761029411764705,129.0,
597,597.0,38134.0,256.0,0.0019301470588235295,126.0,
598,598.0,34137.0,256.0,0.0018841911764705883,123.0,
599,599.0,41282.0,256.0,0.001914828431372549,125.0,
600,600.0,36297.0,256.0,0.001868872549019608,122.0,
601,601.0,35417.0,256.0,0.0018841911764705883,123.0,
602,602.0,36650.0,256.0,0.001868872549019608,122.0,
603,603.0,31401.0,256.0,0.0018841911764705883,123.0,
604,604.0,31856.0,256.0,0.0018841911764705883,123.0,
605,605.0,32580.0,256.0,0.0019301470588235295,126.0,
606,606.0,35281.0,256.0,0.0019301470588235295,126.0,
607,607.0,36824.0,256.0,0.00196078431372549,128.0,
608,608.0,39953.0,256.0,0.00196078431372549,128.0,
609,609.0,30121.0,256.0,0.0019761029411764705,129.0,
610,610.0,40975.0,256.0,0.0019454656862745098,127.0,
611,611.0,33538.0,256.0,0.0019454656862745098,127.0,
612,612.0,32544.0,256.0,0.0019301470588235295,126.0,
613,613.0,42188.0,256.0,0.00196078431372549,128.0,
614,614.0,36392.0,256.0,0.0020373774509803923,133.0,
615,615.0,32318.0,256.0,0.0020526960784313726,134.0,
616,616.0,34935.0,256.0,0.0020986519607843136,137.0,
617,617.0,38032.0,256.0,0.0020833333333333333,136.0,
618,618.0,36208.0,256.0,0.0020986519607843136,137.0,
619,619.0,35525.0,256.0,0.002068014705882353,135.0,
620,620.0,36777.0,256.0,0.0020833333333333333,136.0,
621,621.0,35930.0,256.0,0.002068014705882353,135.0,
622,622.0,33964.0,256.0,0.0020986519607843136,137.0,
623,623.0,39228.0,256.0,0.0021599264705882354,141.0,
624,624.0,33150.0,256.0,0.0021292892156862743,139.0,
625,625.0,34823.0,256.0,0.0021292892156862743,139.0,
626,626.0,34649.0,256.0,0.0021599264705882354,141.0,
627,627.0,34377.0,256.0,0.0021599264705882354,141.0,
628,628.0,40137.0,256.0,0.0021292892156862743,139.0,
629,629.0,34109.0,256.0,0.0020986519607843136,137.0,
630,630.0,33560.0,256.0,0.0021292892156862743,139.0,
631,631.0,31059.0,256.0,0.002068014705882353,135.0,
632,632.0,27639.0,256.0,0.0020986519607843136,137.0,
633,633.0,25530.0,256.0,0.0021292892156862743,139.0,
634,634.0,33363.0,256.0,0.002144607843137255,140.0,
635,635.0,33986.0,256.0,0.0021599264705882354,141.0,
636,636.0,27554.0,256.0,0.0020986519607843136,137.0,
637,637.0,31196.0,256.0,0.0020986519607843136,137.0,
638,638.0,35580.0,256.0,0.002144607843137255,140.0,
639,639.0,35492.0,256.0,0.0021599264705882354,141.0,
640,640.0,35030.0,256.0,0.0021752450980392158,142.0,
641,641.0,33746.0,256.0,0.0022212009803921568,145.0,
642,642.0,31214.0,256.0,0.002236519607843137,146.0,
643,643.0,34559.0,256.0,0.0022518382352941175,147.0,
644,644.0,30839.0,256.0,0.0022058823529411764,144.0,
645,645.0,35506.0,256.0,0.0022671568627450982,148.0,
646,646.0,34317.0,256.0,0.0023131127450980392,151.0,
647,647.0,33278.0,256.0,0.0023590686274509803,154.0,
648,648.0,33834.0,256.0,0.002420343137254902,158.0,
649,649.0,32582.0,256.0,0.002420343137254902,158.0,
650,650.0,39958.0,256.0,0.002420343137254902,158.0,
651,651.0,34638.0,256.0,0.002527573529411765,165.0,
652,652.0,40483.0,256.0,0.002573529411764706,168.0,
653,653.0,35482.0,256.0,0.0025582107843137255,167.0,
654,654.0,34295.0,256.0,0.002527573529411765,165.0,
655,655.0,34240.0,256.0,0.0025122549019607845,164.0,
656,656.0,32546.0,256.0,0.002527573529411765,165.0,
657,657.0,34849.0,256.0,0.0024969362745098037,163.0,
658,658.0,32791.0,256.0,0.002527573529411765,165.0,
659,659.0,34861.0,256.0,0.002466299019607843,161.0,
660,660.0,37508.0,256.0,0.002466299019607843,161.0,
661,661.0,36909.0,256.0,0.0024969362745098037,163.0,
662,662.0,32086.0,256.0,0.002466299019607843,161.0,
663,663.0,34675.0,256.0,0.0024969362745098037,163.0,
664,664.0,37860.0,256.0,0.0025122549019607845,164.0,
665,665.0,30377.0,256.0,0.0025122549019607845,164.0,
666,666.0,29549.0,256.0,0.0024816176470588234,162.0,
667,667.0,35891.0,256.0,0.002466299019607843,161.0,
668,668.0,30273.0,256.0,0.0025122549019607845,164.0,
669,669.0,28905.0,256.0,0.0024969362745098037,163.0,
670,670.0,32825.0,256.0,0.0024969362745098037,163.0,
671,671.0,23846.0,256.0,0.002420343137254902,158.0,
672,672.0,32708.0,256.0,0.0024509803921568627,160.0,
673,673.0,33368.0,256.0,0.0024509803921568627,160.0,
674,674.0,36898.0,256.0,0.0024509803921568627,160.0,
675,675.0,32182.0,256.0,0.002542892156862745,166.0,
676,676.0,39572.0,256.0,0.0025582107843137255,167.0,
677,677.0,35733.0,256.0,0.002588848039215686,169.0,
678,678.0,29376.0,256.0,0.0024816176470588234,162.0,
679,679.0,33114.0,256.0,0.002466299019607843,161.0,
680,680.0,35149.0,256.0,0.0025582107843137255,167.0,
681,681.0,32767.0,256.0,0.0025582107843137255,167.0,
682,682.0,34817.0,256.0,0.0024356617647058824,159.0,
683,683.0,30732.0,256.0,0.0024050245098039217,157.0,
684,684.0,29578.0,256.0,0.0024356617647058824,159.0,
685,685.0,32802.0,256.0,0.0024050245098039217,157.0,
686,686.0,28679.0,256.0,0.002420343137254902,158.0,
687,687.0,29521.0,256.0,0.0024969362745098037,163.0,
688,688.0,33137.0,256.0,0.002466299019607843,161.0,
689,689.0,32981.0,256.0,0.0025122549019607845,164.0,
690,690.0,36669.0,256.0,0.0024509803921568627,160.0,
691,691.0,36149.0,256.0,0.0024509803921568627,160.0,
692,692.0,38026.0,256.0,0.0024356617647058824,159.0,
693,693.0,32245.0,256.0,0.002466299019607843,161.0,
694,694.0,33352.0,256.0,0.0024969362745098037,163.0,
695,695.0,37330.0,256.0,0.0024816176470588234,162.0,
696,696.0,33708.0,256.0,0.002420343137254902,158.0,
697,697.0,31288.0,256.0,0.0024509803921568627,160.0,
698,698.0,37547.0,256.0,0.0025122549019607845,164.0,
699,699.0,31762.0,256.0,0.0025122549019607845,164.0,
700,700.0,32877.0,256.0,0.002588848039215686,169.0,
701,701.0,35487.0,256.0,0.002542892156862745,166.0,
702,702.0,34129.0,256.0,0.0025582107843137255,167.0,
703,703.0,32097.0,256.0,0.002542892156862745,166.0,
704,704.0,32820.0,256.0,0.0025582107843137255,167.0,
705,705.0,36884.0,256.0,0.0024969362745098037,163.0,
706,706.0,33536.0,256.0,0.0024356617647058824,159.0,
707,707.0,34509.0,256.0,0.0024969362745098037,163.0,
708,708.0,33929.0,256.0,0.0025122549019607845,164.0,
709,709.0,34772.0,256.0,0.0024969362745098037,163.0,
710,710.0,30964.0,256.0,0.002527573529411765,165.0,
711,711.0,30386.0,256.0,0.002527573529411765,165.0,
712,712.0,26046.0,256.0,0.002527573529411765,165.0,
713,713.0,31764.0,256.0,0.0025582107843137255,167.0,
714,714.0,34343.0,256.0,0.0025582107843137255,167.0,
715,715.0,36488.0,256.0,0.002573529411764706,168.0,
716,716.0,32239.0,256.0,0.002588848039215686,169.0,
717,717.0,34057.0,256.0,0.0025582107843137255,167.0,
718,718.0,33623.0,256.0,0.002573529411764706,168.0,
719,719.0,35862.0,256.0,0.002573529411764706,168.0,
720,720.0,32203.0,256.0,0.002466299019607843,161.0,
721,721.0,35147.0,256.0,0.0024356617647058824,159.0,
722,722.0,39009.0,256.0,0.0024050245098039217,157.0,
723,723.0,33148.0,256.0,0.0023897058823529414,156.0,
724,724.0,34977.0,256.0,0.002420343137254902,158.0,
725,725.0,34744.0,256.0,0.00234375,153.0,
726,726.0,32263.0,256.0,0.0023284313725490196,152.0,
727,727.0,38890.0,256.0,0.002297794117647059,150.0,
728,728.0,31310.0,256.0,0.0023131127450980392,151.0,
729,729.0,32556.0,256.0,0.00234375,153.0,
730,730.0,32308.0,256.0,0.0024050245098039217,157.0,
731,731.0,32116.0,256.0,0.002420343137254902,158.0,
732,732.0,31268.0,256.0,0.0023897058823529414,156.0,
733,733.0,32404.0,256.0,0.0024050245098039217,157.0,
734,734.0,29570.0,256.0,0.0024050245098039217,157.0,
735,735.0,31422.0,256.0,0.0023897058823529414,156.0,
736,736.0,36656.0,256.0,0.0023897058823529414,156.0,
737,737.0,38933.0,256.0,0.0023284313725490196,152.0,
738,738.0,33603.0,256.0,0.0023590686274509803,154.0,
739,739.0,32446.0,256.0,0.0022671568627450982,148.0,
740,740.0,33221.0,256.0,0.002297794117647059,150.0,
741,741.0,34159.0,256.0,0.0023131127450980392,151.0,
742,742.0,30613.0,256.0,0.002297794117647059,150.0,
743,743.0,42665.0,256.0,0.0023897058823529414,156.0,
744,744.0,37012.0,256.0,0.0023743872549019606,155.0,
745,745.0,38383.0,256.0,0.0023284313725490196,152.0,
746,746.0,32970.0,256.0,0.0023131127450980392,151.0,
747,747.0,33496.0,256.0,0.0023131127450980392,151.0,
748,748.0,35666.0,256.0,0.0022824754901960786,149.0,
749,749.0,38859.0,256.0,0.0022824754901960786,149.0,
750,750.0,32922.0,256.0,0.0023284313725490196,152.0,
751,751.0,30046.0,256.0,0.0023897058823529414,156.0,
752,752.0,34773.0,256.0,0.0023743872549019606,155.0,
753,753.0,31106.0,256.0,0.0023590686274509803,154.0,
754,754.0,32993.0,256.0,0.0023590686274509803,154.0,
755,755.0,32852.0,256.0,0.002420343137254902,158.0,
756,756.0,39207.0,256.0,0.002420343137254902,158.0,
757,757.0,32809.0,256.0,0.0025122549019607845,164.0,
758,758.0,32681.0,256.0,0.002527573529411765,165.0,
759,759.0,33878.0,256.0,0.0024816176470588234,162.0,
760,760.0,38140.0,256.0,0.0023897058823529414,156.0,
761,761.0,36874.0,256.0,0.0023897058823529414,156.0,
762,762.0,37374.0,256.0,0.0023590686274509803,154.0,
763,763.0,31866.0,256.0,0.0024050245098039217,157.0,
764,764.0,38760.0,256.0,0.0024509803921568627,160.0,
765,765.0,38881.0,256.0,0.002420343137254902,158.0,
766,766.0,33167.0,256.0,0.0023897058823529414,156.0,
767,767.0,39922.0,256.0,0.002420343137254902,158.0,
768,768.0,41006.0,256.0,0.002542892156862745,166.0,
769,769.0,33643.0,256.0,0.002527573529411765,165.0,
770,770.0,39235.0,256.0,0.0024969362745098037,163.0,
771,771.0,38821.0,256.0,0.0024816176470588234,162.0,
772,772.0,39744.0,256.0,0.002542892156862745,166.0,
773,773.0,38359.0,256.0,0.0025582107843137255,167.0,
774,774.0,39224.0,256.0,0.0026348039215686276,172.0,
775,775.0,35370.0,256.0,0.0027573529411764708,180.0,
776,776.0,34168.0,256.0,0.0026654411764705883,174.0,
777,777.0,38318.0,256.0,0.0027113970588235293,177.0,
778,778.0,33296.0,256.0,0.0027879901960784314,182.0,
779,779.0,40283.0,256.0,0.0028339460784313725,185.0,
780,780.0,40839.0,256.0,0.002849264705882353,186.0,
781,781.0,40904.0,256.0,0.002818627450980392,184.0,
782,782.0,34001.0,256.0,0.0027879901960784314,182.0,
783,783.0,41222.0,256.0,0.0028033088235294118,183.0,
784,784.0,41261.0,256.0,0.0028339460784313725,185.0,
785,785.0,37307.0,256.0,0.002879901960784314,188.0,
786,786.0,40195.0,256.0,0.002879901960784314,188.0,
787,787.0,40240.0,256.0,0.002864583333333333,187.0,
788,788.0,46142.0,256.0,0.0029411764705882353,192.0,
789,789.0,36389.0,256.0,0.0029871323529411763,195.0,
790,790.0,40655.0,256.0,0.0029871323529411763,195.0,
791,791.0,38761.0,256.0,0.003002450980392157,196.0,
792,792.0,35805.0,256.0,0.0029871323529411763,195.0,
793,793.0,34537.0,256.0,0.0030330882352941177,198.0,
794,794.0,42163.0,256.0,0.003048406862745098,199.0,
795,795.0,43464.0,256.0,0.0031096813725490194,203.0,
796,796.0,30437.0,256.0,0.0031403186274509805,205.0,
797,797.0,33555.0,256.0,0.0031403186274509805,205.0,
798,798.0,35966.0,256.0,0.003216911764705882,210.0,
799,799.0,43964.0,256.0,0.0032475490196078433,212.0,
800,800.0,43490.0,256.0,0.003170955882352941,207.0,
801,801.0,43426.0,256.0,0.0031403186274509805,205.0,
802,802.0,43309.0,256.0,0.0031862745098039215,208.0,
803,803.0,37326.0,256.0,0.0030790441176470587,201.0,
804,804.0,37607.0,256.0,0.0030330882352941177,198.0,
805,805.0,45472.0,256.0,0.0030177696078431374,197.0,
806,806.0,42878.0,256.0,0.003094362745098039,202.0,
807,807.0,35463.0,256.0,0.0030790441176470587,201.0,
808,808.0,41790.0,256.0,0.003048406862745098,199.0,
809,809.0,40773.0,256.0,0.0029564950980392156,193.0,
810,810.0,40112.0,256.0,0.002925857843137255,191.0,
811,811.0,42651.0,256.0,0.0029564950980392156,193.0,
812,812.0,38146.0,256.0,0.003048406862745098,199.0,
813,813.0,43524.0,256.0,0.003048406862745098,199.0,
814,814.0,39444.0,256.0,0.0030790441176470587,201.0,
815,815.0,37307.0,256.0,0.0030790441176470587,201.0,
816,816.0,39111.0,256.0,0.0031096813725490194,203.0,
817,817.0,33129.0,256.0,0.0031403186274509805,205.0,
818,818.0,34093.0,256.0,0.003170955882352941,207.0,
819,819.0,37614.0,256.0,0.003201593137254902,209.0,
820,820.0,36274.0,256.0,0.003170955882352941,207.0,
821,821.0,39294.0,256.0,0.0030637254901960784,200.0,
822,822.0,32615.0,256.0,0.0030790441176470587,201.0,
823,823.0,36999.0,256.0,0.003155637254901961,206.0,
824,824.0,40161.0,256.0,0.003170955882352941,207.0,
825,825.0,40443.0,256.0,0.0031403186274509805,205.0,
826,826.0,37757.0,256.0,0.0031096813725490194,203.0,
827,827.0,41112.0,256.0,0.003155637254901961,206.0,
828,828.0,42751.0,256.0,0.003125,204.0,
829,829.0,34409.0,256.0,0.003170955882352941,207.0,
830,830.0,39995.0,256.0,0.0031403186274509805,205.0,
831,831.0,44109.0,256.0,0.003125,204.0,
832,832.0,45110.0,256.0,0.0030330882352941177,198.0,
833,833.0,42647.0,256.0,0.003048406862745098,199.0,
834,834.0,43827.0,256.0,0.0030637254901960784,200.0,
835,835.0,38711.0,256.0,0.0030790441176470587,201.0,
836,836.0,36001.0,256.0,0.0030330882352941177,198.0,
837,837.0,37958.0,256.0,0.0030330882352941177,198.0,
838,838.0,41352.0,256.0,0.003094362745098039,202.0,
839,839.0,36811.0,256.0,0.003216911764705882,210.0,
840,840.0,37654.0,256.0,0.003170955882352941,207.0,
841,841.0,32651.0,256.0,0.003201593137254902,209.0,
842,842.0,43373.0,256.0,0.0031862745098039215,208.0,
843,843.0,40917.0,256.0,0.0031096813725490194,203.0,
844,844.0,38444.0,256.0,0.0030330882352941177,198.0,
845,845.0,31147.0,256.0,0.0029411764705882353,192.0,
846,846.0,41450.0,256.0,0.002925857843137255,191.0,
847,847.0,39328.0,256.0,0.0029411764705882353,192.0,
848,848.0,41100.0,256.0,0.002925857843137255,191.0,
849,849.0,32260.0,256.0,0.0029105392156862746,190.0,
850,850.0,40367.0,256.0,0.0029411764705882353,192.0,
851,851.0,35406.0,256.0,0.0029105392156862746,190.0,
852,852.0,32791.0,256.0,0.0029871323529411763,195.0,
853,853.0,37650.0,256.0,0.0029564950980392156,193.0,
854,854.0,36602.0,256.0,0.0029871323529411763,195.0,
855,855.0,44582.0,256.0,0.0029564950980392156,193.0,
856,856.0,35977.0,256.0,0.002971813725490196,194.0,
857,857.0,39209.0,256.0,0.002925857843137255,191.0,
858,858.0,44703.0,256.0,0.0029564950980392156,193.0,
859,859.0,34690.0,256.0,0.0029411764705882353,192.0,
860,860.0,33476.0,256.0,0.0029105392156862746,190.0,
861,861.0,36257.0,256.0,0.002849264705882353,186.0,
862,862.0,40301.0,256.0,0.0029564950980392156,193.0,
863,863.0,34034.0,256.0,0.003048406862745098,199.0,
864,864.0,41047.0,256.0,0.003094362745098039,202.0,
865,865.0,34493.0,256.0,0.003048406862745098,199.0,
866,866.0,33936.0,256.0,0.0031096813725490194,203.0,
867,867.0,35511.0,256.0,0.003094362745098039,202.0,
868,868.0,37751.0,256.0,0.0031096813725490194,203.0,
869,869.0,34886.0,256.0,0.0031096813725490194,203.0,
870,870.0,39649.0,256.0,0.003170955882352941,207.0,
871,871.0,42759.0,256.0,0.003170955882352941,207.0,
872,872.0,39597.0,256.0,0.003048406862745098,199.0,
873,873.0,41056.0,256.0,0.0030177696078431374,197.0,
874,874.0,42318.0,256.0,0.003048406862745098,199.0,
875,875.0,39166.0,256.0,0.0030177696078431374,197.0,
876,876.0,36355.0,256.0,0.0030637254901960784,200.0,
877,877.0,36696.0,256.0,0.003155637254901961,206.0,
878,878.0,41930.0,256.0,0.003170955882352941,207.0,
879,879.0,39401.0,256.0,0.003125,204.0,
880,880.0,44023.0,256.0,0.003216911764705882,210.0,
881,881.0,35383.0,256.0,0.0032475490196078433,212.0,
882,882.0,39919.0,256.0,0.003216911764705882,210.0,
883,883.0,41038.0,256.0,0.003278186274509804,214.0,
884,884.0,39801.0,256.0,0.0032475490196078433,212.0,
885,885.0,36254.0,256.0,0.0032628676470588236,213.0,
886,886.0,43641.0,256.0,0.0032935049019607843,215.0,
887,887.0,39538.0,256.0,0.0033088235294117647,216.0,
888,888.0,38237.0,256.0,0.0033088235294117647,216.0,
889,889.0,45448.0,256.0,0.003400735294117647,222.0,
890,890.0,44796.0,256.0,0.0032628676470588236,213.0,
891,891.0,43757.0,256.0,0.003201593137254902,209.0,
892,892.0,42503.0,256.0,0.0032322303921568625,211.0,
893,893.0,43245.0,256.0,0.0032322303921568625,211.0,
894,894.0,42410.0,256.0,0.0033394607843137253,218.0,
895,895.0,43120.0,256.0,0.0032322303921568625,211.0,
896,896.0,42063.0,256.0,0.0033088235294117647,216.0,
897,897.0,42588.0,256.0,0.0032628676470588236,213.0,
898,898.0,35536.0,256.0,0.0032628676470588236,213.0,
899,899.0,37881.0,256.0,0.0031862745098039215,208.0,
900,900.0,44798.0,256.0,0.003201593137254902,209.0,
901,901.0,43151.0,256.0,0.003324142156862745,217.0,
902,902.0,44099.0,256.0,0.0033088235294117647,216.0,
903,903.0,34625.0,256.0,0.0033700980392156864,220.0,
904,904.0,38832.0,256.0,0.003400735294117647,222.0,
905,905.0,43124.0,256.0,0.003324142156862745,217.0,
906,906.0,44105.0,256.0,0.003400735294117647,222.0,
907,907.0,44847.0,256.0,0.0034926470588235296,228.0,
908,908.0,42382.0,256.0,0.0034620098039215685,226.0,
909,909.0,40462.0,256.0,0.003446691176470588,225.0,
910,910.0,38017.0,256.0,0.003477328431372549,227.0,
911,911.0,48741.0,256.0,0.003446691176470588,225.0,
912,912.0,41653.0,256.0,0.00350796568627451,229.0,
913,913.0,38086.0,256.0,0.003676470588235294,240.0,
914,914.0,34734.0,256.0,0.0035845588235294116,234.0,
915,915.0,37756.0,256.0,0.003676470588235294,240.0,
916,916.0,37309.0,256.0,0.0036611519607843137,239.0,
917,917.0,38733.0,256.0,0.0035845588235294116,234.0,
918,918.0,45896.0,256.0,0.0035386029411764706,231.0,
919,919.0,38274.0,256.0,0.0034926470588235296,228.0,
920,920.0,40643.0,256.0,0.0034160539215686275,223.0,
921,921.0,37984.0,256.0,0.0033854166666666668,221.0,
922,922.0,38498.0,256.0,0.003477328431372549,227.0,
923,923.0,39634.0,256.0,0.003446691176470588,225.0,
924,924.0,43191.0,256.0,0.00350796568627451,229.0,
925,925.0,43759.0,256.0,0.003446691176470588,225.0,
926,926.0,45372.0,256.0,0.003400735294117647,222.0,
927,927.0,37843.0,256.0,0.0034926470588235296,228.0,
928,928.0,43722.0,256.0,0.0034160539215686275,223.0,
929,929.0,40436.0,256.0,0.0034926470588235296,228.0,
930,930.0,34790.0,256.0,0.0035232843137254903,230.0,
931,931.0,44994.0,256.0,0.003477328431372549,227.0,
932,932.0,37411.0,256.0,0.003553921568627451,232.0,
933,933.0,35718.0,256.0,0.003431372549019608,224.0,
934,934.0,38892.0,256.0,0.0034160539215686275,223.0,
935,935.0,42989.0,256.0,0.0034620098039215685,226.0,
936,936.0,44411.0,256.0,0.0033547794117647057,219.0,
937,937.0,40058.0,256.0,0.0033547794117647057,219.0,
938,938.0,37185.0,256.0,0.0034160539215686275,223.0,
939,939.0,34734.0,256.0,0.00350796568627451,229.0,
940,940.0,40380.0,256.0,0.0035386029411764706,231.0,
941,941.0,38616.0,256.0,0.0035386029411764706,231.0,
942,942.0,39238.0,256.0,0.0035845588235294116,234.0,
943,943.0,44150.0,256.0,0.0036151960784313727,236.0,
944,944.0,50724.0,256.0,0.003722426470588235,243.0,
945,945.0,42671.0,256.0,0.0036611519607843137,239.0,
946,946.0,42444.0,256.0,0.0037683823529411765,246.0,
947,947.0,45114.0,256.0,0.0037683823529411765,246.0,
948,948.0,45359.0,256.0,0.003844975490196078,251.0,
949,949.0,38995.0,256.0,0.0037683823529411765,246.0,
950,950.0,40360.0,256.0,0.0038143382352941175,249.0,
951,951.0,41068.0,256.0,0.0038143382352941175,249.0,
952,952.0,41557.0,256.0,0.0038143382352941175,249.0,
953,953.0,41887.0,256.0,0.0037683823529411765,246.0,
954,954.0,39486.0,256.0,0.003799019607843137,248.0,
955,955.0,44741.0,256.0,0.0037683823529411765,246.0,
956,956.0,31370.0,256.0,0.003737745098039216,244.0,
957,957.0,44788.0,256.0,0.0037071078431372547,242.0,
958,958.0,33548.0,256.0,0.003737745098039216,244.0,
959,959.0,38530.0,256.0,0.0036458333333333334,238.0,
960,960.0,46400.0,256.0,0.0036151960784313727,236.0,
961,961.0,44656.0,256.0,0.0035845588235294116,234.0,
962,962.0,33462.0,256.0,0.003630514705882353,237.0,
963,963.0,42986.0,256.0,0.0036917892156862744,241.0,
964,964.0,36319.0,256.0,0.0035845588235294116,234.0,
965,965.0,41058.0,256.0,0.003630514705882353,237.0,
966,966.0,41406.0,256.0,0.0035845588235294116,234.0,
967,967.0,40117.0,256.0,0.003599877450980392,235.0,
968,968.0,42013.0,256.0,0.0035845588235294116,234.0,
969,969.0,45318.0,256.0,0.0035386029411764706,231.0,
970,970.0,44730.0,256.0,0.003676470588235294,240.0,
971,971.0,31812.0,256.0,0.003676470588235294,240.0,
972,972.0,37924.0,256.0,0.003737745098039216,244.0,
973,973.0,36083.0,256.0,0.0036611519607843137,239.0,
974,974.0,41544.0,256.0,0.0036917892156862744,241.0,
975,975.0,35013.0,256.0,0.0037071078431372547,242.0,
976,976.0,45844.0,256.0,0.003722426470588235,243.0,
977,977.0,39873.0,256.0,0.0036458333333333334,238.0,
978,978.0,42060.0,256.0,0.003722426470588235,243.0,
979,979.0,40475.0,256.0,0.003722426470588235,243.0,
980,980.0,41141.0,256.0,0.003722426470588235,243.0,
981,981.0,33842.0,256.0,0.0037683823529411765,246.0,
982,982.0,36312.0,256.0,0.003676470588235294,240.0,
983,983.0,36793.0,256.0,0.003553921568627451,232.0,
984,984.0,35654.0,256.0,0.003599877450980392,235.0,
985,985.0,35169.0,256.0,0.003599877450980392,235.0,
986,986.0,40561.0,256.0,0.003599877450980392,235.0,
987,987.0,35835.0,256.0,0.0036458333333333334,238.0,
988,988.0,38018.0,256.0,0.0036917892156862744,241.0,
989,989.0,41050.0,256.0,0.003676470588235294,240.0,
990,990.0,37354.0,256.0,0.0035845588235294116,234.0,
991,991.0,35413.0,256.0,0.003599877450980392,235.0,
992,992.0,43484.0,256.0,0.0037071078431372547,242.0,
993,993.0,38082.0,256.0,0.003783700980392157,247.0,
994,994.0,40864.0,256.0,0.003799019607843137,248.0,
995,995.0,38295.0,256.0,0.003829656862745098,250.0,
996,996.0,38187.0,256.0,0.0038909313725490197,254.0,
997,997.0,41801.0,256.0,0.003998161764705882,261.0,
998,998.0,34369.0,256.0,0.003952205882352941,258.0,
999,999.0,37434.0,256.0,0.003860294117647059,252.0,
