0,0.0,0.0,2.0,0_1,781_0,89
1,1.0,5650.0,2.0,0_1,931_0,109
2,2.0,3752.0,2.0,0_1,851_0,101
3,3.0,3276.0,2.0,0_1,811_0,104
4,4.0,3701.0,2.0,0_1,821_0,104
5,5.0,3707.0,2.0,0_1,861_0,101
6,6.0,3587.0,2.0,0_1,891_0,99
7,7.0,2390.0,2.0,0_1,931_0,101
8,8.0,4281.0,2.0,0_1,881_0,105
9,9.0,4616.0,2.0,0_1,961_0,104
10,10.0,3625.0,2.0,0_1,1051_0,109
11,11.0,5885.0,2.0,0_1,1081_0,119
12,12.0,3789.0,2.0,0_1,1111_0,128
13,13.0,5183.0,2.0,0_1,1171_0,135
14,14.0,4936.0,2.0,0_1,1281_0,142
15,15.0,5526.0,2.0,0_1,1301_0,147
16,16.0,6090.0,2.0,0_1,1331_0,153
17,17.0,5382.0,2.0,0_1,1371_0,149
18,18.0,5712.0,2.0,0_1,1461_0,150
19,19.0,5307.0,2.0,0_1,1441_0,157
20,20.0,5242.0,2.0,0_1,1531_0,166
21,21.0,5921.0,2.0,0_1,1521_0,175
22,22.0,5774.0,2.0,0_1,1511_0,177
23,23.0,5158.0,2.0,0_1,1611_0,179
24,24.0,5032.0,2.0,0_1,1581_0,171
25,25.0,5841.0,2.0,0_1,1621_0,180
26,26.0,7242.0,2.0,0_1,1691_0,180
27,27.0,6661.0,2.0,0_1,1771_0,184
28,28.0,6675.0,2.0,0_1,1821_0,189
29,29.0,6310.0,2.0,0_1,1921_0,200
30,30.0,7693.0,2.0,0_1,2051_0,224
31,31.0,9738.0,2.0,0_1,2201_0,235
32,32.0,9561.0,2.0,0_1,2381_0,251
33,33.0,9424.0,2.0,0_1,2401_0,264
34,34.0,8408.0,2.0,0_1,2521_0,270
35,35.0,9657.0,2.0,0_1,2661_0,284
36,36.0,8384.0,2.0,0_1,2731_0,294
37,37.0,9625.0,2.0,0_1,2911_0,312
38,38.0,13121.0,2.0,0_1,2941_0,321
39,39.0,10210.0,2.0,0_1,2971_0,315
40,40.0,8423.0,2.0,0_1,2971_0,319
41,41.0,10296.0,2.0,0_1,3011_0,329
42,42.0,9268.0,2.0,0_1,3011_0,327
43,43.0,9232.0,2.0,0_1,3131_0,319
44,44.0,8385.0,2.0,0_1,3131_0,323
45,45.0,11202.0,2.0,0_1,3221_0,317
46,46.0,10055.0,2.0,0_1,3271_0,319
47,47.0,10346.0,2.0,0_1,3361_0,321
48,48.0,11488.0,2.0,0_1,3521_0,335
49,49.0,13817.0,2.0,0_1,3541_0,342
50,50.0,9308.0,2.0,0_1,3691_0,347
51,51.0,15407.0,2.0,0_1,3811_0,342
52,52.0,13198.0,2.0,0_1,3941_0,348
53,53.0,12690.0,2.0,0_1,3931_0,351
54,54.0,9751.0,2.0,0_1,3911_0,362
55,55.0,12921.0,2.0,0_1,3951_0,370
56,56.0,14503.0,2.0,0_1,3921_0,395
57,57.0,11128.0,2.0,0_1,3841_0,407
58,58.0,10734.0,2.0,0_1,3941_0,410
59,59.0,14245.0,2.0,0_1,3921_0,414
60,60.0,11127.0,2.0,0_1,3931_0,415
61,61.0,14711.0,2.0,0_1,3981_0,421
62,62.0,14697.0,2.0,0_1,3951_0,428
63,63.0,12914.0,2.0,0_1,4031_0,431
64,64.0,16521.0,2.0,0_1,4111_0,440
65,65.0,13502.0,2.0,0_1,4271_0,455
66,66.0,13677.0,2.0,0_1,4391_0,466
67,67.0,17735.0,2.0,0_1,4371_0,494
68,68.0,18431.0,2.0,0_1,4401_0,505
69,69.0,16307.0,2.0,0_1,4571_0,503
70,70.0,16483.0,2.0,0_1,4761_0,513
71,71.0,14507.0,2.0,0_1,4901_0,532
72,72.0,18702.0,2.0,0_1,4981_0,549
73,73.0,19626.0,2.0,0_1,4981_0,553
74,74.0,16771.0,2.0,0_1,4931_0,556
75,75.0,14777.0,2.0,0_1,5011_0,552
76,76.0,16037.0,2.0,0_1,5191_0,550
77,77.0,12074.0,2.0,0_1,5231_0,568
78,78.0,17230.0,2.0,0_1,5391_0,567
79,79.0,20406.0,2.0,0_1,5521_0,568
80,80.0,18850.0,2.0,0_1,5781_0,574
81,81.0,19449.0,2.0,0_1,5921_0,576
82,82.0,14930.0,2.0,0_1,5861_0,578
83,83.0,15980.0,2.0,0_1,5661_0,581
84,84.0,17864.0,2.0,0_1,5841_0,575
85,85.0,17741.0,2.0,0_1,5891_0,585
86,86.0,18366.0,2.0,0_1,5851_0,597
87,87.0,14572.0,2.0,0_1,5771_0,590
88,88.0,15378.0,2.0,0_1,5731_0,595
89,89.0,18083.0,2.0,0_1,5711_0,605
90,90.0,16454.0,2.0,0_1,5591_0,616
91,91.0,15487.0,2.0,0_1,5511_0,609
92,92.0,15214.0,2.0,0_1,5521_0,607
93,93.0,17727.0,2.0,0_1,5481_0,592
94,94.0,16087.0,2.0,0_1,5501_0,589
95,95.0,19045.0,2.0,0_1,5451_0,589
96,96.0,14949.0,2.0,0_1,5441_0,581
97,97.0,15649.0,2.0,0_1,5481_0,591
98,98.0,18871.0,2.0,0_1,5671_0,591
99,99.0,21771.0,2.0,0_1,5911_0,600
100,100.0,16822.0,2.0,0_1,5951_0,587
101,101.0,18903.0,2.0,0_1,6061_0,593
102,102.0,21468.0,2.0,0_1,6251_0,604
103,103.0,19510.0,2.0,0_1,6361_0,611
104,104.0,18843.0,2.0,0_1,6541_0,624
105,105.0,21056.0,2.0,0_1,6591_0,630
106,106.0,19698.0,2.0,0_1,6571_0,632
107,107.0,18028.0,2.0,0_1,6631_0,640
108,108.0,22130.0,2.0,0_1,6691_0,664
109,109.0,19395.0,2.0,0_1,6841_0,673
110,110.0,24339.0,2.0,0_1,7011_0,671
111,111.0,22987.0,2.0,0_1,6901_0,660
112,112.0,22090.0,2.0,0_1,7121_0,664
113,113.0,21964.0,2.0,0_1,7251_0,686
114,114.0,20387.0,2.0,0_1,7331_0,703
115,115.0,23141.0,2.0,0_1,7421_0,722
116,116.0,21964.0,2.0,0_1,7411_0,730
117,117.0,23528.0,2.0,0_1,7611_0,748
118,118.0,27489.0,2.0,0_1,7601_0,766
119,119.0,23400.0,2.0,0_1,7561_0,767
120,120.0,24710.0,2.0,0_1,7711_0,770
121,121.0,24200.0,2.0,0_1,7911_0,774
122,122.0,26167.0,2.0,0_1,7921_0,788
123,123.0,18746.0,2.0,0_1,8061_0,784
124,124.0,23439.0,2.0,0_1,8051_0,809
125,125.0,23313.0,2.0,0_1,7821_0,796
126,126.0,25932.0,2.0,0_1,7811_0,802
127,127.0,24260.0,2.0,0_1,7731_0,806
128,128.0,24836.0,2.0,0_1,8001_0,821
129,129.0,28693.0,2.0,0_1,8021_0,846
130,130.0,23658.0,2.0,0_1,8211_0,845
131,131.0,26463.0,2.0,0_1,8341_0,859
132,132.0,27413.0,2.0,0_1,8401_0,873
133,133.0,26779.0,2.0,0_1,8621_0,896
134,134.0,26926.0,2.0,0_1,8831_0,902
135,135.0,26623.0,2.0,0_1,8881_0,909
136,136.0,26621.0,2.0,0_1,8761_0,922
137,137.0,29659.0,2.0,0_1,8831_0,932
138,138.0,28779.0,2.0,0_1,8891_0,930
139,139.0,23695.0,2.0,0_1,8941_0,947
140,140.0,27006.0,2.0,0_1,8761_0,921
141,141.0,24096.0,2.0,0_1,8801_0,920
142,142.0,30494.0,2.0,0_1,9121_0,932
143,143.0,29821.0,2.0,0_1,9341_0,927
144,144.0,24515.0,2.0,0_1,9411_0,934
145,145.0,31783.0,2.0,0_1,9541_0,940
146,146.0,29392.0,2.0,0_1,9511_0,949
147,147.0,24916.0,2.0,0_1,9771_0,931
148,148.0,29076.0,2.0,0_1,9931_0,948
149,149.0,31567.0,2.0,0_1,9961_0,962
150,150.0,30839.0,2.0,0_1,10031_0,967
151,151.0,31421.0,2.0,0_1,10111_0,964
152,152.0,32266.0,2.0,0_1,10191_0,977
153,153.0,31817.0,2.0,0_1,10311_0,1010
154,154.0,28591.0,2.0,0_1,10281_0,1016
155,155.0,30197.0,2.0,0_1,10281_0,1007
156,156.0,33941.0,2.0,0_1,10181_0,1017
157,157.0,30045.0,2.0,0_1,10231_0,1012
158,158.0,25058.0,2.0,0_1,10051_0,992
159,159.0,22540.0,2.0,0_1,9751_0,991
160,160.0,27082.0,2.0,0_1,9551_0,976
161,161.0,26483.0,2.0,0_1,9421_0,961
162,162.0,27182.0,2.0,0_1,9301_0,942
163,163.0,28280.0,2.0,0_1,9331_0,931
164,164.0,30530.0,2.0,0_1,9471_0,927
165,165.0,31134.0,2.0,0_1,9801_0,987
166,166.0,29782.0,2.0,0_1,10071_0,1028
167,167.0,34513.0,2.0,0_1,10471_0,1050
168,168.0,34913.0,2.0,0_1,10491_0,1078
169,169.0,30568.0,2.0,0_1,10261_0,1067
170,170.0,27646.0,2.0,0_1,10101_0,1070
171,171.0,33635.0,2.0,0_1,10231_0,1042
172,172.0,23503.0,2.0,0_1,10061_0,1033
173,173.0,23085.0,2.0,0_1,10111_0,1044
174,174.0,37179.0,2.0,0_1,9931_0,1031
175,175.0,31116.0,2.0,0_1,10051_0,1010
176,176.0,26006.0,2.0,0_1,9921_0,1001
177,177.0,28858.0,2.0,0_1,10191_0,998
178,178.0,26934.0,2.0,0_1,10071_0,1010
179,179.0,36330.0,2.0,0_1,10101_0,1032
180,180.0,31145.0,2.0,0_1,10191_0,1019
181,181.0,29939.0,2.0,0_1,10341_0,1053
182,182.0,34257.0,2.0,0_1,10221_0,1051
183,183.0,26781.0,2.0,0_1,10421_0,1052
184,184.0,31803.0,2.0,0_1,10301_0,1056
185,185.0,31738.0,2.0,0_1,10381_0,1070
186,186.0,31374.0,2.0,0_1,10391_0,1086
187,187.0,35762.0,2.0,0_1,10531_0,1109
188,188.0,30221.0,2.0,0_1,10561_0,1115
189,189.0,29761.0,2.0,0_1,10531_0,1130
190,190.0,31116.0,2.0,0_1,10341_0,1113
191,191.0,28681.0,2.0,0_1,10291_0,1093
192,192.0,27736.0,2.0,0_1,9981_0,1084
193,193.0,36196.0,2.0,0_1,10191_0,1073
194,194.0,33085.0,2.0,0_1,10321_0,1107
195,195.0,33356.0,2.0,0_1,10481_0,1115
196,196.0,32379.0,2.0,0_1,10571_0,1125
197,197.0,37810.0,2.0,0_1,10971_0,1139
198,198.0,33662.0,2.0,0_1,11191_0,1151
199,199.0,34930.0,2.0,0_1,11411_0,1173
200,200.0,32970.0,2.0,0_1,11361_0,1176
201,201.0,36259.0,2.0,0_1,11161_0,1174
202,202.0,34327.0,2.0,0_1,11161_0,1137
203,203.0,27889.0,2.0,0_1,11031_0,1107
204,204.0,35162.0,2.0,0_1,10981_0,1093
205,205.0,29955.0,2.0,0_1,10981_0,1092
206,206.0,33868.0,2.0,0_1,10711_0,1092
207,207.0,34237.0,2.0,0_1,10751_0,1111
208,208.0,32581.0,2.0,0_1,10891_0,1111
209,209.0,35806.0,2.0,0_1,11001_0,1115
210,210.0,28675.0,2.0,0_1,11331_0,1080
211,211.0,36311.0,2.0,0_1,11811_0,1109
212,212.0,42960.0,2.0,0_1,11871_0,1129
213,213.0,35264.0,2.0,0_1,11861_0,1156
214,214.0,31412.0,2.0,0_1,11701_0,1130
215,215.0,30305.0,2.0,0_1,11551_0,1091
216,216.0,33991.0,2.0,0_1,11481_0,1083
217,217.0,33620.0,2.0,0_1,11251_0,1058
218,218.0,34937.0,2.0,0_1,10981_0,1051
219,219.0,33818.0,2.0,0_1,10851_0,1037
220,220.0,32791.0,2.0,0_1,10761_0,1031
221,221.0,26993.0,2.0,0_1,10751_0,1025
222,222.0,32389.0,2.0,0_1,10981_0,1042
223,223.0,32995.0,2.0,0_1,11221_0,1061
224,224.0,38258.0,2.0,0_1,11601_0,1106
225,225.0,31510.0,2.0,0_1,11381_0,1143
226,226.0,33100.0,2.0,0_1,11621_0,1185
227,227.0,37455.0,2.0,0_1,11771_0,1240
228,228.0,40205.0,2.0,0_1,12111_0,1291
229,229.0,36366.0,2.0,0_1,12201_0,1305
230,230.0,35556.0,2.0,0_1,12411_0,1284
231,231.0,36591.0,2.0,0_1,12701_0,1312
232,232.0,40515.0,2.0,0_1,12331_0,1308
233,233.0,38160.0,2.0,0_1,12561_0,1307
234,234.0,36898.0,2.0,0_1,12441_0,1280
235,235.0,36097.0,2.0,0_1,12571_0,1288
236,236.0,41399.0,2.0,0_1,12631_0,1282
237,237.0,36292.0,2.0,0_1,12791_0,1329
238,238.0,47232.0,2.0,0_1,12881_0,1345
239,239.0,43936.0,2.0,0_1,13141_0,1381
240,240.0,37733.0,2.0,0_1,13311_0,1385
241,241.0,34403.0,2.0,0_1,13341_0,1424
242,242.0,45145.0,2.0,0_1,13011_0,1416
243,243.0,40117.0,2.0,0_1,13011_0,1391
244,244.0,39181.0,2.0,0_1,12431_0,1394
245,245.0,36692.0,2.0,0_1,12431_0,1388
246,246.0,42097.0,2.0,0_1,12371_0,1350
247,247.0,37673.0,2.0,0_1,12361_0,1344
248,248.0,39256.0,2.0,0_1,12561_0,1369
249,249.0,40761.0,2.0,0_1,12711_0,1360
250,250.0,42893.0,2.0,0_1,12851_0,1338
251,251.0,43842.0,2.0,0_1,13521_0,1386
252,252.0,42795.0,2.0,0_1,13811_0,1446
253,253.0,48793.0,2.0,0_1,13871_0,1440
254,254.0,41935.0,2.0,0_1,14301_0,1457
255,255.0,46094.0,2.0,0_1,14441_0,1483
256,256.0,52061.0,2.0,0_1,14631_0,1484
257,257.0,45810.0,2.0,0_1,15021_0,1523
258,258.0,45210.0,2.0,0_1,15041_0,1521
259,259.0,51307.0,2.0,0_1,15511_0,1553
260,260.0,49641.0,2.0,0_1,15321_0,1551
261,261.0,42628.0,2.0,0_1,15251_0,1575
262,262.0,40114.0,2.0,0_1,14971_0,1575
263,263.0,36418.0,2.0,0_1,14911_0,1583
264,264.0,41149.0,2.0,0_1,15191_0,1615
265,265.0,50662.0,2.0,0_1,14931_0,1593
266,266.0,46871.0,2.0,0_1,14941_0,1620
267,267.0,45993.0,2.0,0_1,15141_0,1608
268,268.0,50348.0,2.0,0_1,15071_0,1577
269,269.0,43788.0,2.0,0_1,14991_0,1553
270,270.0,48312.0,2.0,0_1,15081_0,1546
271,271.0,47837.0,2.0,0_1,15241_0,1557
272,272.0,46583.0,2.0,0_1,15621_0,1610
273,273.0,50774.0,2.0,0_1,16371_0,1655
274,274.0,49984.0,2.0,0_1,16631_0,1662
275,275.0,49921.0,2.0,0_1,16431_0,1634
276,276.0,46971.0,2.0,0_1,16181_0,1630
277,277.0,48018.0,2.0,0_1,16251_0,1630
278,278.0,47190.0,2.0,0_1,16271_0,1620
279,279.0,46209.0,2.0,0_1,16041_0,1611
280,280.0,44178.0,2.0,0_1,16521_0,1611
281,281.0,49230.0,2.0,0_1,16651_0,1621
282,282.0,49207.0,2.0,0_1,16191_0,1583
283,283.0,33473.0,2.0,0_1,16381_0,1576
284,284.0,46676.0,2.0,0_1,16411_0,1555
285,285.0,41302.0,2.0,0_1,16361_0,1546
286,286.0,50011.0,2.0,0_1,16551_0,1572
287,287.0,50952.0,2.0,0_1,16751_0,1574
288,288.0,51889.0,2.0,0_1,16941_0,1586
289,289.0,47392.0,2.0,0_1,16901_0,1625
290,290.0,58533.0,2.0,0_1,16831_0,1677
291,291.0,47471.0,2.0,0_1,16901_0,1701
292,292.0,52000.0,2.0,0_1,17151_0,1723
293,293.0,47148.0,2.0,0_1,16761_0,1713
294,294.0,50785.0,2.0,0_1,16681_0,1711
295,295.0,52423.0,2.0,0_1,16821_0,1694
296,296.0,48135.0,2.0,0_1,16771_0,1683
297,297.0,47739.0,2.0,0_1,16791_0,1673
298,298.0,54342.0,2.0,0_1,16801_0,1640
299,299.0,55137.0,2.0,0_1,17441_0,1666
300,300.0,56833.0,2.0,0_1,17911_0,1680
301,301.0,61230.0,2.0,0_1,18021_0,1686
302,302.0,53628.0,2.0,0_1,18251_0,1698
303,303.0,53981.0,2.0,0_1,18001_0,1703
304,304.0,51449.0,2.0,0_1,18231_0,1729
305,305.0,58297.0,2.0,0_1,18981_0,1816
306,306.0,59943.0,2.0,0_1,18721_0,1821
307,307.0,49546.0,2.0,0_1,18791_0,1797
308,308.0,56581.0,2.0,0_1,18711_0,1809
309,309.0,51860.0,2.0,0_1,18701_0,1820
310,310.0,60241.0,2.0,0_1,18811_0,1771
311,311.0,51383.0,2.0,0_1,19011_0,1772
312,312.0,61470.0,2.0,0_1,18991_0,1777
313,313.0,53302.0,2.0,0_1,18711_0,1742
314,314.0,47981.0,2.0,0_1,19081_0,1790
315,315.0,54578.0,2.0,0_1,19151_0,1805
316,316.0,54861.0,2.0,0_1,18981_0,1804
317,317.0,58856.0,2.0,0_1,19041_0,1830
318,318.0,56093.0,2.0,0_1,18991_0,1865
319,319.0,62605.0,2.0,0_1,19131_0,1900
320,320.0,53494.0,2.0,0_1,18921_0,1909
321,321.0,54517.0,2.0,0_1,18881_0,1936
322,322.0,60041.0,2.0,0_1,19031_0,1910
323,323.0,62020.0,2.0,0_1,19481_0,1907
324,324.0,56938.0,2.0,0_1,20141_0,1926
325,325.0,67181.0,2.0,0_1,20161_0,1974
326,326.0,62139.0,2.0,0_1,20471_0,1970
327,327.0,65061.0,2.0,0_1,20651_0,2016
328,328.0,62367.0,2.0,0_1,20851_0,2036
329,329.0,61747.0,2.0,0_1,20891_0,2035
330,330.0,61072.0,2.0,0_1,20631_0,2024
331,331.0,55813.0,2.0,0_1,20841_0,2048
332,332.0,65679.0,2.0,0_1,20871_0,2076
333,333.0,59726.0,2.0,0_1,21001_0,2087
334,334.0,59885.0,2.0,0_1,21011_0,2113
335,335.0,61112.0,2.0,0_1,20951_0,2079
336,336.0,51934.0,2.0,0_1,21091_0,2070
337,337.0,61172.0,2.0,0_1,21201_0,2020
338,338.0,61022.0,2.0,0_1,21211_0,2037
339,339.0,63222.0,2.0,0_1,20781_0,1977
340,340.0,49063.0,2.0,0_1,20751_0,1945
341,341.0,65578.0,2.0,0_1,20181_0,1882
342,342.0,50598.0,2.0,0_1,19831_0,1872
343,343.0,58274.0,2.0,0_1,19561_0,1837
344,344.0,52140.0,2.0,0_1,19651_0,1807
345,345.0,52932.0,2.0,0_1,19671_0,1853
346,346.0,58575.0,2.0,0_1,19641_0,1891
347,347.0,52496.0,2.0,0_1,19911_0,1917
348,348.0,64705.0,2.0,0_1,20051_0,1934
349,349.0,59404.0,2.0,0_1,20131_0,1970
350,350.0,67955.0,2.0,0_1,20151_0,1964
351,351.0,51046.0,2.0,0_1,20331_0,1931
352,352.0,63011.0,2.0,0_1,21121_0,1994
353,353.0,63052.0,2.0,0_1,20931_0,2005
354,354.0,51090.0,2.0,0_1,20731_0,1997
355,355.0,59111.0,2.0,0_1,20321_0,1971
356,356.0,51967.0,2.0,0_1,19671_0,1903
357,357.0,41700.0,2.0,0_1,18601_0,1806
358,358.0,49996.0,2.0,0_1,18621_0,1781
359,359.0,54468.0,2.0,0_1,18741_0,1762
360,360.0,60869.0,2.0,0_1,18581_0,1748
361,361.0,57465.0,2.0,0_1,18831_0,1754
362,362.0,56540.0,2.0,0_1,19101_0,1820
363,363.0,67831.0,2.0,0_1,18931_0,1828
364,364.0,55385.0,2.0,0_1,19311_0,1832
365,365.0,58472.0,2.0,0_1,19841_0,1865
366,366.0,56113.0,2.0,0_1,20011_0,1927
367,367.0,58317.0,2.0,0_1,19941_0,2001
368,368.0,57748.0,2.0,0_1,19821_0,1976
369,369.0,51034.0,2.0,0_1,19781_0,1972
370,370.0,55869.0,2.0,0_1,18941_0,1945
371,371.0,57318.0,2.0,0_1,18611_0,1878
372,372.0,55388.0,2.0,0_1,18921_0,1829
373,373.0,55678.0,2.0,0_1,18841_0,1860
374,374.0,64495.0,2.0,0_1,19111_0,1866
375,375.0,60588.0,2.0,0_1,19551_0,1887
376,376.0,69733.0,2.0,0_1,20281_0,1915
377,377.0,64561.0,2.0,0_1,20821_0,1932
378,378.0,58038.0,2.0,0_1,21351_0,1990
379,379.0,67976.0,2.0,0_1,21511_0,2035
380,380.0,61863.0,2.0,0_1,21481_0,2043
381,381.0,63415.0,2.0,0_1,21811_0,2106
382,382.0,63144.0,2.0,0_1,22371_0,2142
383,383.0,66766.0,2.0,0_1,22211_0,2138
384,384.0,60737.0,2.0,0_1,22341_0,2201
385,385.0,55849.0,2.0,0_1,22061_0,2182
386,386.0,63166.0,2.0,0_1,22201_0,2171
387,387.0,66498.0,2.0,0_1,21681_0,2127
388,388.0,61280.0,2.0,0_1,21251_0,2142
389,389.0,69157.0,2.0,0_1,20951_0,2142
390,390.0,62578.0,2.0,0_1,20901_0,2120
391,391.0,60716.0,2.0,0_1,20471_0,2134
392,392.0,52610.0,2.0,0_1,20021_0,2115
393,393.0,63434.0,2.0,0_1,19681_0,2121
394,394.0,67356.0,2.0,0_1,20441_0,2159
395,395.0,65359.0,2.0,0_1,20331_0,2135
396,396.0,55600.0,2.0,0_1,20521_0,2100
397,397.0,58549.0,2.0,0_1,20591_0,2113
398,398.0,64150.0,2.0,0_1,20781_0,2095
399,399.0,59020.0,2.0,0_1,21011_0,2068
400,400.0,67957.0,2.0,0_1,20411_0,2034
401,401.0,51976.0,2.0,0_1,19791_0,2030
402,402.0,50521.0,2.0,0_1,19671_0,1970
403,403.0,59149.0,2.0,0_1,19661_0,1961
404,404.0,56702.0,2.0,0_1,20201_0,2003
405,405.0,70191.0,2.0,0_1,20631_0,2062
406,406.0,59313.0,2.0,0_1,20721_0,2091
407,407.0,59342.0,2.0,0_1,21231_0,2138
408,408.0,69869.0,2.0,0_1,20791_0,2140
409,409.0,51919.0,2.0,0_1,20441_0,2122
410,410.0,54957.0,2.0,0_1,19471_0,2038
411,411.0,52092.0,2.0,0_1,19511_0,2005
412,412.0,62172.0,2.0,0_1,19791_0,2031
413,413.0,65810.0,2.0,0_1,20021_0,2015
414,414.0,58070.0,2.0,0_1,19671_0,1972
415,415.0,56894.0,2.0,0_1,20071_0,1960
416,416.0,63593.0,2.0,0_1,20341_0,1990
417,417.0,75423.0,2.0,0_1,20901_0,2040
418,418.0,68449.0,2.0,0_1,21671_0,2123
419,419.0,72169.0,2.0,0_1,21861_0,2154
420,420.0,61977.0,2.0,0_1,21941_0,2195
421,421.0,70271.0,2.0,0_1,21851_0,2226
422,422.0,61880.0,2.0,0_1,21561_0,2226
423,423.0,65504.0,2.0,0_1,22131_0,2275
424,424.0,76700.0,2.0,0_1,22841_0,2335
425,425.0,76241.0,2.0,0_1,23091_0,2355
426,426.0,67935.0,2.0,0_1,22831_0,2304
427,427.0,66711.0,2.0,0_1,23101_0,2290
428,428.0,61699.0,2.0,0_1,22981_0,2283
429,429.0,72032.0,2.0,0_1,23671_0,2338
430,430.0,79319.0,2.0,0_1,23551_0,2320
431,431.0,66177.0,2.0,0_1,23121_0,2312
432,432.0,70688.0,2.0,0_1,22291_0,2306
433,433.0,67448.0,2.0,0_1,21981_0,2217
434,434.0,64939.0,2.0,0_1,21161_0,2165
435,435.0,60862.0,2.0,0_1,21181_0,2121
436,436.0,62060.0,2.0,0_1,21901_0,2192
437,437.0,70104.0,2.0,0_1,22101_0,2185
438,438.0,66921.0,2.0,0_1,23061_0,2263
439,439.0,80216.0,2.0,0_1,23281_0,2261
440,440.0,56052.0,2.0,0_1,23231_0,2253
441,441.0,52510.0,2.0,0_1,22491_0,2194
442,442.0,62174.0,2.0,0_1,21801_0,2144
443,443.0,57748.0,2.0,0_1,21981_0,2173
444,444.0,65415.0,2.0,0_1,21631_0,2168
445,445.0,60279.0,2.0,0_1,21881_0,2192
446,446.0,65035.0,2.0,0_1,22161_0,2250
447,447.0,70900.0,2.0,0_1,21971_0,2244
448,448.0,64702.0,2.0,0_1,22341_0,2257
449,449.0,63874.0,2.0,0_1,22461_0,2204
450,450.0,57365.0,2.0,0_1,21471_0,2099
451,451.0,56406.0,2.0,0_1,21031_0,2060
452,452.0,57565.0,2.0,0_1,20731_0,2079
453,453.0,54906.0,2.0,0_1,20951_0,2047
454,454.0,68326.0,2.0,0_1,21181_0,2050
455,455.0,71227.0,2.0,0_1,21451_0,2034
456,456.0,60299.0,2.0,0_1,21401_0,2007
457,457.0,62979.0,2.0,0_1,20891_0,1995
458,458.0,65039.0,2.0,0_1,20671_0,2026
459,459.0,67200.0,2.0,0_1,20581_0,2027
460,460.0,65881.0,2.0,0_1,21381_0,2094
461,461.0,69300.0,2.0,0_1,22041_0,2131
462,462.0,64089.0,2.0,0_1,22111_0,2171
463,463.0,66935.0,2.0,0_1,22171_0,2207
464,464.0,71301.0,2.0,0_1,22611_0,2253
465,465.0,67607.0,2.0,0_1,22441_0,2266
466,466.0,69353.0,2.0,0_1,22511_0,2255
467,467.0,62495.0,2.0,0_1,23421_0,2330
468,468.0,71785.0,2.0,0_1,23821_0,2385
469,469.0,64271.0,2.0,0_1,23351_0,2346
470,470.0,62376.0,2.0,0_1,23331_0,2333
471,471.0,73370.0,2.0,0_1,23471_0,2318
472,472.0,67637.0,2.0,0_1,23501_0,2329
473,473.0,75958.0,2.0,0_1,23651_0,2372
474,474.0,72682.0,2.0,0_1,23461_0,2411
475,475.0,72208.0,2.0,0_1,23321_0,2382
476,476.0,63146.0,2.0,0_1,23231_0,2382
477,477.0,62390.0,2.0,0_1,22831_0,2310
478,478.0,59742.0,2.0,0_1,22551_0,2268
479,479.0,65640.0,2.0,0_1,22371_0,2271
480,480.0,68995.0,2.0,0_1,22491_0,2270
481,481.0,67874.0,2.0,0_1,22521_0,2245
482,482.0,64608.0,2.0,0_1,23091_0,2298
483,483.0,75568.0,2.0,0_1,23591_0,2352
484,484.0,73404.0,2.0,0_1,23111_0,2337
485,485.0,65546.0,2.0,0_1,22821_0,2315
486,486.0,74361.0,2.0,0_1,22811_0,2303
487,487.0,70054.0,2.0,0_1,23351_0,2307
488,488.0,62914.0,2.0,0_1,23171_0,2288
489,489.0,69532.0,2.0,0_1,22671_0,2276
490,490.0,63097.0,2.0,0_1,22671_0,2214
491,491.0,56142.0,2.0,0_1,22151_0,2205
492,492.0,64364.0,2.0,0_1,21611_0,2219
493,493.0,57869.0,2.0,0_1,21631_0,2233
494,494.0,61987.0,2.0,0_1,21441_0,2225
495,495.0,69726.0,2.0,0_1,21271_0,2186
496,496.0,62739.0,2.0,0_1,21111_0,2125
497,497.0,67019.0,2.0,0_1,21101_0,2102
498,498.0,59741.0,2.0,0_1,20911_0,2088
499,499.0,60548.0,2.0,0_1,20811_0,2078
500,500.0,55797.0,2.0,0_1,21131_0,2082
501,501.0,59342.0,2.0,0_1,21131_0,2067
502,502.0,57497.0,2.0,0_1,21361_0,2066
503,503.0,70422.0,2.0,0_1,21101_0,2037
504,504.0,54786.0,2.0,0_1,21141_0,2031
505,505.0,66127.0,2.0,0_1,21161_0,2064
506,506.0,58364.0,2.0,0_1,20581_0,2024
507,507.0,55489.0,2.0,0_1,20441_0,1991
508,508.0,58955.0,2.0,0_1,20321_0,1942
509,509.0,55722.0,2.0,0_1,20211_0,1908
510,510.0,63415.0,2.0,0_1,19691_0,1887
511,511.0,60902.0,2.0,0_1,19221_0,1934
512,512.0,48939.0,2.0,0_1,19681_0,1988
513,513.0,60145.0,2.0,0_1,20291_0,2024
514,514.0,65604.0,2.0,0_1,20431_0,2037
515,515.0,63073.0,2.0,0_1,20841_0,2084
516,516.0,69415.0,2.0,0_1,20851_0,2079
517,517.0,61673.0,2.0,0_1,20731_0,2108
518,518.0,55139.0,2.0,0_1,20441_0,2073
519,519.0,59403.0,2.0,0_1,20051_0,2054
520,520.0,56482.0,2.0,0_1,19031_0,1964
521,521.0,46551.0,2.0,0_1,18191_0,1924
522,522.0,50398.0,2.0,0_1,17461_0,1843
523,523.0,50075.0,2.0,0_1,17461_0,1804
524,524.0,48017.0,2.0,0_1,18031_0,1848
525,525.0,52517.0,2.0,0_1,17961_0,1874
526,526.0,55804.0,2.0,0_1,18381_0,1890
527,527.0,60880.0,2.0,0_1,18921_0,1911
528,528.0,59456.0,2.0,0_1,19461_0,1942
529,529.0,63227.0,2.0,0_1,20251_0,1987
530,530.0,62897.0,2.0,0_1,20421_0,2053
531,531.0,61374.0,2.0,0_1,20581_0,2086
532,532.0,61720.0,2.0,0_1,20441_0,2077
533,533.0,60987.0,2.0,0_1,20781_0,2105
534,534.0,68837.0,2.0,0_1,21191_0,2109
535,535.0,54162.0,2.0,0_1,20501_0,2061
536,536.0,55526.0,2.0,0_1,20321_0,2061
537,537.0,65453.0,2.0,0_1,20591_0,2048
538,538.0,53442.0,2.0,0_1,20601_0,2039
539,539.0,64238.0,2.0,0_1,20701_0,2030
540,540.0,65663.0,2.0,0_1,20271_0,2029
541,541.0,60534.0,2.0,0_1,20341_0,2020
542,542.0,57445.0,2.0,0_1,19831_0,1997
543,543.0,63479.0,2.0,0_1,19611_0,1994
544,544.0,50788.0,2.0,0_1,19751_0,1971
545,545.0,63745.0,2.0,0_1,20241_0,1966
546,546.0,59646.0,2.0,0_1,20071_0,1921
547,547.0,62978.0,2.0,0_1,20391_0,1914
548,548.0,63224.0,2.0,0_1,19971_0,1923
549,549.0,58869.0,2.0,0_1,20451_0,1980
550,550.0,66763.0,2.0,0_1,21271_0,2037
551,551.0,67547.0,2.0,0_1,21021_0,2046
552,552.0,65709.0,2.0,0_1,21001_0,2063
553,553.0,53850.0,2.0,0_1,20781_0,2014
554,554.0,52549.0,2.0,0_1,20581_0,2000
555,555.0,60611.0,2.0,0_1,20681_0,2012
556,556.0,65874.0,2.0,0_1,20861_0,2066
557,557.0,60513.0,2.0,0_1,21091_0,2139
558,558.0,65075.0,2.0,0_1,20841_0,2139
559,559.0,54997.0,2.0,0_1,20961_0,2172
560,560.0,68995.0,2.0,0_1,21681_0,2161
561,561.0,61166.0,2.0,0_1,22041_0,2183
562,562.0,63802.0,2.0,0_1,21971_0,2187
563,563.0,71694.0,2.0,0_1,21741_0,2172
564,564.0,57527.0,2.0,0_1,21331_0,2176
565,565.0,62765.0,2.0,0_1,20631_0,2139
566,566.0,65493.0,2.0,0_1,20631_0,2117
567,567.0,67191.0,2.0,0_1,21011_0,2166
568,568.0,64302.0,2.0,0_1,21401_0,2156
569,569.0,60838.0,2.0,0_1,21731_0,2124
570,570.0,64335.0,2.0,0_1,22161_0,2162
571,571.0,66735.0,2.0,0_1,22221_0,2161
572,572.0,62723.0,2.0,0_1,22441_0,2155
573,573.0,68933.0,2.0,0_1,22761_0,2203
574,574.0,67897.0,2.0,0_1,23111_0,2217
575,575.0,74897.0,2.0,0_1,23641_0,2206
576,576.0,74299.0,2.0,0_1,24061_0,2215
577,577.0,64713.0,2.0,0_1,24181_0,2237
578,578.0,62074.0,2.0,0_1,23661_0,2244
579,579.0,69152.0,2.0,0_1,23301_0,2221
580,580.0,69118.0,2.0,0_1,23261_0,2218
581,581.0,69671.0,2.0,0_1,22841_0,2214
582,582.0,65685.0,2.0,0_1,22801_0,2232
583,583.0,67280.0,2.0,0_1,22631_0,2250
584,584.0,72175.0,2.0,0_1,22631_0,2258
585,585.0,64312.0,2.0,0_1,22571_0,2262
586,586.0,64874.0,2.0,0_1,21881_0,2204
587,587.0,49039.0,2.0,0_1,21621_0,2154
588,588.0,52624.0,2.0,0_1,22111_0,2185
589,589.0,76495.0,2.0,0_1,22251_0,2182
590,590.0,63042.0,2.0,0_1,21981_0,2190
591,591.0,65984.0,2.0,0_1,22191_0,2216
592,592.0,67154.0,2.0,0_1,21851_0,2182
593,593.0,60093.0,2.0,0_1,22121_0,2207
594,594.0,66850.0,2.0,0_1,22391_0,2219
595,595.0,74780.0,2.0,0_1,23041_0,2239
596,596.0,68094.0,2.0,0_1,22931_0,2243
597,597.0,64960.0,2.0,0_1,23041_0,2240
598,598.0,62754.0,2.0,0_1,22821_0,2214
599,599.0,57051.0,2.0,0_1,22731_0,2215
600,600.0,59525.0,2.0,0_1,22061_0,2162
601,601.0,59486.0,2.0,0_1,21681_0,2123
602,602.0,69094.0,2.0,0_1,21501_0,2168
603,603.0,62723.0,2.0,0_1,21071_0,2146
604,604.0,62137.0,2.0,0_1,21261_0,2075
605,605.0,65388.0,2.0,0_1,21331_0,2090
606,606.0,67890.0,2.0,0_1,21431_0,2085
607,607.0,61684.0,2.0,0_1,21891_0,2139
608,608.0,69777.0,2.0,0_1,21661_0,2130
609,609.0,59930.0,2.0,0_1,22061_0,2133
610,610.0,65665.0,2.0,0_1,22271_0,2127
611,611.0,62962.0,2.0,0_1,22381_0,2198
612,612.0,72665.0,2.0,0_1,22611_0,2216
613,613.0,68935.0,2.0,0_1,22971_0,2299
614,614.0,77888.0,2.0,0_1,23271_0,2296
615,615.0,71400.0,2.0,0_1,22991_0,2309
616,616.0,68417.0,2.0,0_1,23571_0,2383
617,617.0,78899.0,2.0,0_1,23981_0,2410
618,618.0,78376.0,2.0,0_1,24261_0,2465
619,619.0,82010.0,2.0,0_1,24481_0,2438
620,620.0,67621.0,2.0,0_1,24951_0,2511
621,621.0,85958.0,2.0,0_1,24911_0,2520
622,622.0,75566.0,2.0,0_1,24871_0,2506
623,623.0,72991.0,2.0,0_1,25061_0,2563
624,624.0,74899.0,2.0,0_1,25081_0,2511
625,625.0,75154.0,2.0,0_1,24821_0,2524
626,626.0,65174.0,2.0,0_1,24841_0,2515
627,627.0,68073.0,2.0,0_1,25141_0,2519
628,628.0,69493.0,2.0,0_1,24731_0,2484
629,629.0,54330.0,2.0,0_1,24651_0,2432
630,630.0,67512.0,2.0,0_1,24311_0,2429
631,631.0,72081.0,2.0,0_1,24521_0,2418
632,632.0,80732.0,2.0,0_1,24031_0,2369
633,633.0,66535.0,2.0,0_1,24071_0,2326
634,634.0,72670.0,2.0,0_1,23891_0,2372
635,635.0,76012.0,2.0,0_1,23901_0,2417
636,636.0,79336.0,2.0,0_1,24331_0,2444
637,637.0,79126.0,2.0,0_1,24261_0,2419
638,638.0,74288.0,2.0,0_1,23811_0,2436
639,639.0,69467.0,2.0,0_1,24091_0,2429
640,640.0,62313.0,2.0,0_1,23651_0,2440
641,641.0,66800.0,2.0,0_1,23941_0,2479
642,642.0,78314.0,2.0,0_1,23771_0,2468
643,643.0,67095.0,2.0,0_1,23281_0,2365
644,644.0,56113.0,2.0,0_1,23261_0,2351
645,645.0,74752.0,2.0,0_1,23621_0,2374
646,646.0,77301.0,2.0,0_1,24051_0,2356
647,647.0,70337.0,2.0,0_1,23961_0,2358
648,648.0,74305.0,2.0,0_1,23281_0,2331
649,649.0,73719.0,2.0,0_1,23431_0,2345
650,650.0,67740.0,2.0,0_1,23341_0,2349
651,651.0,69659.0,2.0,0_1,23861_0,2358
652,652.0,78838.0,2.0,0_1,24291_0,2375
653,653.0,74073.0,2.0,0_1,24251_0,2405
654,654.0,76119.0,2.0,0_1,24341_0,2406
655,655.0,71309.0,2.0,0_1,24861_0,2462
656,656.0,69650.0,2.0,0_1,24321_0,2491
657,657.0,63219.0,2.0,0_1,24431_0,2476
658,658.0,74093.0,2.0,0_1,24221_0,2431
659,659.0,68459.0,2.0,0_1,24071_0,2474
660,660.0,74105.0,2.0,0_1,24841_0,2469
661,661.0,84462.0,2.0,0_1,24381_0,2438
662,662.0,77214.0,2.0,0_1,25091_0,2494
663,663.0,82648.0,2.0,0_1,25401_0,2537
664,664.0,81458.0,2.0,0_1,26261_0,2543
665,665.0,89926.0,2.0,0_1,26531_0,2544
666,666.0,79993.0,2.0,0_1,26701_0,2569
667,667.0,78419.0,2.0,0_1,26981_0,2616
668,668.0,82052.0,2.0,0_1,27681_0,2667
669,669.0,83057.0,2.0,0_1,27501_0,2632
670,670.0,78656.0,2.0,0_1,27431_0,2658
671,671.0,77383.0,2.0,0_1,27541_0,2703
672,672.0,90302.0,2.0,0_1,27781_0,2740
673,673.0,86134.0,2.0,0_1,27801_0,2733
674,674.0,77241.0,2.0,0_1,27521_0,2731
675,675.0,75357.0,2.0,0_1,27521_0,2749
676,676.0,72990.0,2.0,0_1,27131_0,2686
677,677.0,77680.0,2.0,0_1,27311_0,2672
678,678.0,83576.0,2.0,0_1,26961_0,2669
679,679.0,77080.0,2.0,0_1,26921_0,2651
680,680.0,75883.0,2.0,0_1,26231_0,2649
681,681.0,75971.0,2.0,0_1,26311_0,2617
682,682.0,71847.0,2.0,0_1,26121_0,2628
683,683.0,84072.0,2.0,0_1,26081_0,2682
684,684.0,80002.0,2.0,0_1,26021_0,2642
685,685.0,69908.0,2.0,0_1,26001_0,2664
686,686.0,74048.0,2.0,0_1,26091_0,2669
687,687.0,81040.0,2.0,0_1,25871_0,2654
688,688.0,78439.0,2.0,0_1,25861_0,2631
689,689.0,75933.0,2.0,0_1,25401_0,2622
690,690.0,72466.0,2.0,0_1,24781_0,2580
691,691.0,68589.0,2.0,0_1,24141_0,2520
692,692.0,68108.0,2.0,0_1,24201_0,2487
693,693.0,74283.0,2.0,0_1,23791_0,2439
694,694.0,56237.0,2.0,0_1,23991_0,2368
695,695.0,77301.0,2.0,0_1,23811_0,2313
696,696.0,70259.0,2.0,0_1,23481_0,2244
697,697.0,66056.0,2.0,0_1,23491_0,2259
698,698.0,71588.0,2.0,0_1,23371_0,2200
699,699.0,55669.0,2.0,0_1,23111_0,2226
700,700.0,61866.0,2.0,0_1,22921_0,2259
701,701.0,62234.0,2.0,0_1,22801_0,2276
702,702.0,71094.0,2.0,0_1,22251_0,2235
703,703.0,57725.0,2.0,0_1,21931_0,2239
704,704.0,65216.0,2.0,0_1,21991_0,2197
705,705.0,65362.0,2.0,0_1,21991_0,2206
706,706.0,67299.0,2.0,0_1,21911_0,2231
707,707.0,72205.0,2.0,0_1,22041_0,2229
708,708.0,78436.0,2.0,0_1,21931_0,2256
709,709.0,64161.0,2.0,0_1,22061_0,2245
710,710.0,71421.0,2.0,0_1,22391_0,2320
711,711.0,73264.0,2.0,0_1,22141_0,2353
712,712.0,63939.0,2.0,0_1,21851_0,2347
713,713.0,57872.0,2.0,0_1,21801_0,2318
714,714.0,62791.0,2.0,0_1,21601_0,2341
715,715.0,64780.0,2.0,0_1,21161_0,2297
716,716.0,63832.0,2.0,0_1,21631_0,2310
717,717.0,68266.0,2.0,0_1,22161_0,2332
718,718.0,73915.0,2.0,0_1,22661_0,2340
719,719.0,70437.0,2.0,0_1,23111_0,2395
720,720.0,77150.0,2.0,0_1,23041_0,2371
721,721.0,59283.0,2.0,0_1,23151_0,2329
722,722.0,67391.0,2.0,0_1,22701_0,2265
723,723.0,63205.0,2.0,0_1,22451_0,2264
724,724.0,61618.0,2.0,0_1,21991_0,2285
725,725.0,69047.0,2.0,0_1,21451_0,2299
726,726.0,57021.0,2.0,0_1,21121_0,2219
727,727.0,63362.0,2.0,0_1,20981_0,2213
728,728.0,69208.0,2.0,0_1,20861_0,2219
729,729.0,65040.0,2.0,0_1,21371_0,2210
730,730.0,71655.0,2.0,0_1,21331_0,2201
731,731.0,67240.0,2.0,0_1,21941_0,2216
732,732.0,72604.0,2.0,0_1,22661_0,2231
733,733.0,74880.0,2.0,0_1,22821_0,2286
734,734.0,67605.0,2.0,0_1,23361_0,2333
735,735.0,69526.0,2.0,0_1,23731_0,2367
736,736.0,72710.0,2.0,0_1,23591_0,2382
737,737.0,62804.0,2.0,0_1,22731_0,2306
738,738.0,59062.0,2.0,0_1,22971_0,2348
739,739.0,75582.0,2.0,0_1,23361_0,2333
740,740.0,76202.0,2.0,0_1,23821_0,2328
741,741.0,67591.0,2.0,0_1,23491_0,2340
742,742.0,67228.0,2.0,0_1,23441_0,2329
743,743.0,78796.0,2.0,0_1,23741_0,2388
744,744.0,73780.0,2.0,0_1,23691_0,2383
745,745.0,71323.0,2.0,0_1,23181_0,2332
746,746.0,64765.0,2.0,0_1,23111_0,2344
747,747.0,68224.0,2.0,0_1,23191_0,2343
748,748.0,62384.0,2.0,0_1,23151_0,2313
749,749.0,60210.0,2.0,0_1,22151_0,2321
750,750.0,64749.0,2.0,0_1,22361_0,2347
751,751.0,73780.0,2.0,0_1,22541_0,2301
752,752.0,69003.0,2.0,0_1,22041_0,2290
753,753.0,63163.0,2.0,0_1,22141_0,2279
754,754.0,64155.0,2.0,0_1,22221_0,2247
755,755.0,70667.0,2.0,0_1,22151_0,2257
756,756.0,64206.0,2.0,0_1,22271_0,2221
757,757.0,65383.0,2.0,0_1,22111_0,2213
758,758.0,66795.0,2.0,0_1,22171_0,2238
759,759.0,67450.0,2.0,0_1,22021_0,2194
760,760.0,67329.0,2.0,0_1,21901_0,2214
761,761.0,72262.0,2.0,0_1,21971_0,2212
762,762.0,70461.0,2.0,0_1,22481_0,2273
763,763.0,69848.0,2.0,0_1,23071_0,2315
764,764.0,63113.0,2.0,0_1,23211_0,2348
765,765.0,79441.0,2.0,0_1,23731_0,2370
766,766.0,63398.0,2.0,0_1,23421_0,2361
767,767.0,67868.0,2.0,0_1,23211_0,2316
768,768.0,71702.0,2.0,0_1,23441_0,2365
769,769.0,67634.0,2.0,0_1,23501_0,2354
770,770.0,71309.0,2.0,0_1,22931_0,2305
771,771.0,59443.0,2.0,0_1,22841_0,2306
772,772.0,72782.0,2.0,0_1,22741_0,2318
773,773.0,74057.0,2.0,0_1,23051_0,2349
774,774.0,70429.0,2.0,0_1,23171_0,2354
775,775.0,75170.0,2.0,0_1,23621_0,2373
776,776.0,68899.0,2.0,0_1,24151_0,2373
777,777.0,75778.0,2.0,0_1,24531_0,2389
778,778.0,72913.0,2.0,0_1,24031_0,2418
779,779.0,78411.0,2.0,0_1,24411_0,2450
780,780.0,81650.0,2.0,0_1,24371_0,2478
781,781.0,75320.0,2.0,0_1,24411_0,2522
782,782.0,73224.0,2.0,0_1,24911_0,2548
783,783.0,70024.0,2.0,0_1,25201_0,2580
784,784.0,83957.0,2.0,0_1,25131_0,2533
785,785.0,75035.0,2.0,0_1,26051_0,2551
786,786.0,78597.0,2.0,0_1,26391_0,2567
787,787.0,79792.0,2.0,0_1,26381_0,2590
788,788.0,84430.0,2.0,0_1,26611_0,2635
789,789.0,82569.0,2.0,0_1,25541_0,2599
790,790.0,70801.0,2.0,0_1,25291_0,2532
791,791.0,73775.0,2.0,0_1,24551_0,2536
792,792.0,72195.0,2.0,0_1,24621_0,2512
793,793.0,86850.0,2.0,0_1,25041_0,2538
794,794.0,71370.0,2.0,0_1,25341_0,2570
795,795.0,83080.0,2.0,0_1,26011_0,2622
796,796.0,83479.0,2.0,0_1,27001_0,2727
797,797.0,94057.0,2.0,0_1,27261_0,2755
798,798.0,83956.0,2.0,0_1,27751_0,2764
799,799.0,82858.0,2.0,0_1,28491_0,2750
800,800.0,87158.0,2.0,0_1,28511_0,2738
801,801.0,86361.0,2.0,0_1,28041_0,2705
802,802.0,82788.0,2.0,0_1,28481_0,2712
803,803.0,77382.0,2.0,0_1,28271_0,2703
804,804.0,82355.0,2.0,0_1,28251_0,2742
805,805.0,84096.0,2.0,0_1,28841_0,2768
806,806.0,89736.0,2.0,0_1,28951_0,2772
807,807.0,82601.0,2.0,0_1,28591_0,2768
808,808.0,88053.0,2.0,0_1,28461_0,2741
809,809.0,73127.0,2.0,0_1,27431_0,2651
810,810.0,69535.0,2.0,0_1,26731_0,2612
811,811.0,69416.0,2.0,0_1,26541_0,2623
812,812.0,84777.0,2.0,0_1,27121_0,2640
813,813.0,87125.0,2.0,0_1,27521_0,2670
814,814.0,83055.0,2.0,0_1,28111_0,2736
815,815.0,79365.0,2.0,0_1,28121_0,2785
816,816.0,80814.0,2.0,0_1,27751_0,2764
817,817.0,69504.0,2.0,0_1,27461_0,2753
818,818.0,74273.0,2.0,0_1,27001_0,2705
819,819.0,73238.0,2.0,0_1,26521_0,2721
820,820.0,67362.0,2.0,0_1,25621_0,2628
821,821.0,75048.0,2.0,0_1,25761_0,2605
822,822.0,74828.0,2.0,0_1,26031_0,2630
823,823.0,86763.0,2.0,0_1,26121_0,2678
824,824.0,78976.0,2.0,0_1,25521_0,2626
825,825.0,77095.0,2.0,0_1,25281_0,2635
826,826.0,71934.0,2.0,0_1,25261_0,2638
827,827.0,72883.0,2.0,0_1,25491_0,2651
828,828.0,75891.0,2.0,0_1,25861_0,2624
829,829.0,75371.0,2.0,0_1,25411_0,2581
830,830.0,78410.0,2.0,0_1,25021_0,2547
831,831.0,72048.0,2.0,0_1,24871_0,2521
832,832.0,74859.0,2.0,0_1,24661_0,2457
833,833.0,71555.0,2.0,0_1,24721_0,2437
834,834.0,71337.0,2.0,0_1,25281_0,2511
835,835.0,78435.0,2.0,0_1,25191_0,2523
836,836.0,73367.0,2.0,0_1,25831_0,2586
837,837.0,80491.0,2.0,0_1,25911_0,2593
838,838.0,75784.0,2.0,0_1,25961_0,2616
839,839.0,76040.0,2.0,0_1,25701_0,2627
840,840.0,83515.0,2.0,0_1,25291_0,2625
841,841.0,79534.0,2.0,0_1,25691_0,2647
842,842.0,81575.0,2.0,0_1,26451_0,2671
843,843.0,72380.0,2.0,0_1,26621_0,2682
844,844.0,83831.0,2.0,0_1,26531_0,2683
845,845.0,76633.0,2.0,0_1,26231_0,2629
846,846.0,69336.0,2.0,0_1,25891_0,2622
847,847.0,73389.0,2.0,0_1,25871_0,2605
848,848.0,84019.0,2.0,0_1,26151_0,2560
849,849.0,77173.0,2.0,0_1,25421_0,2502
850,850.0,57448.0,2.0,0_1,25191_0,2457
851,851.0,81270.0,2.0,0_1,25691_0,2512
852,852.0,83750.0,2.0,0_1,25971_0,2482
853,853.0,80145.0,2.0,0_1,26461_0,2551
854,854.0,88544.0,2.0,0_1,26431_0,2639
855,855.0,87736.0,2.0,0_1,26211_0,2589
856,856.0,71160.0,2.0,0_1,26461_0,2590
857,857.0,80980.0,2.0,0_1,27151_0,2630
858,858.0,87945.0,2.0,0_1,27801_0,2699
859,859.0,79321.0,2.0,0_1,27521_0,2715
860,860.0,78165.0,2.0,0_1,27041_0,2652
861,861.0,67519.0,2.0,0_1,27121_0,2652
862,862.0,74915.0,2.0,0_1,26881_0,2597
863,863.0,85130.0,2.0,0_1,27411_0,2657
864,864.0,83340.0,2.0,0_1,27301_0,2638
865,865.0,72836.0,2.0,0_1,27231_0,2667
866,866.0,82827.0,2.0,0_1,27381_0,2663
867,867.0,81320.0,2.0,0_1,27231_0,2668
868,868.0,89950.0,2.0,0_1,26691_0,2664
869,869.0,80547.0,2.0,0_1,27081_0,2720
870,870.0,86690.0,2.0,0_1,27181_0,2712
871,871.0,76875.0,2.0,0_1,27791_0,2667
872,872.0,78661.0,2.0,0_1,27901_0,2693
873,873.0,89446.0,2.0,0_1,28251_0,2718
874,874.0,85067.0,2.0,0_1,28901_0,2787
875,875.0,86162.0,2.0,0_1,28561_0,2747
876,876.0,76225.0,2.0,0_1,27921_0,2739
877,877.0,76900.0,2.0,0_1,27541_0,2748
878,878.0,82729.0,2.0,0_1,27481_0,2697
879,879.0,79764.0,2.0,0_1,27691_0,2667
880,880.0,80020.0,2.0,0_1,27951_0,2720
881,881.0,75241.0,2.0,0_1,27091_0,2700
882,882.0,72992.0,2.0,0_1,26661_0,2708
883,883.0,85582.0,2.0,0_1,27101_0,2726
884,884.0,83768.0,2.0,0_1,27691_0,2770
885,885.0,92695.0,2.0,0_1,27621_0,2819
886,886.0,89495.0,2.0,0_1,27581_0,2824
887,887.0,83761.0,2.0,0_1,27891_0,2813
888,888.0,83623.0,2.0,0_1,28101_0,2810
889,889.0,89600.0,2.0,0_1,28071_0,2827
890,890.0,82354.0,2.0,0_1,28361_0,2852
891,891.0,79871.0,2.0,0_1,28051_0,2795
892,892.0,76076.0,2.0,0_1,28731_0,2851
893,893.0,90315.0,2.0,0_1,28621_0,2897
894,894.0,79335.0,2.0,0_1,28321_0,2890
895,895.0,79705.0,2.0,0_1,28051_0,2787
896,896.0,71216.0,2.0,0_1,26961_0,2681
897,897.0,72984.0,2.0,0_1,26541_0,2574
898,898.0,67370.0,2.0,0_1,25871_0,2497
899,899.0,73188.0,2.0,0_1,25411_0,2456
900,900.0,66024.0,2.0,0_1,25111_0,2452
901,901.0,69645.0,2.0,0_1,24951_0,2429
902,902.0,68928.0,2.0,0_1,25371_0,2497
903,903.0,82005.0,2.0,0_1,26131_0,2558
904,904.0,87454.0,2.0,0_1,26511_0,2566
905,905.0,70967.0,2.0,0_1,26671_0,2574
906,906.0,77265.0,2.0,0_1,26631_0,2576
907,907.0,81445.0,2.0,0_1,26561_0,2617
908,908.0,86866.0,2.0,0_1,27091_0,2612
909,909.0,90368.0,2.0,0_1,27891_0,2666
910,910.0,85540.0,2.0,0_1,28671_0,2738
911,911.0,84689.0,2.0,0_1,28591_0,2705
912,912.0,75846.0,2.0,0_1,28381_0,2662
913,913.0,70174.0,2.0,0_1,27401_0,2612
914,914.0,86131.0,2.0,0_1,27631_0,2641
915,915.0,92331.0,2.0,0_1,28021_0,2688
916,916.0,85626.0,2.0,0_1,28181_0,2752
917,917.0,76625.0,2.0,0_1,27981_0,2749
918,918.0,89164.0,2.0,0_1,28541_0,2764
919,919.0,80764.0,2.0,0_1,28851_0,2790
920,920.0,83474.0,2.0,0_1,29091_0,2836
921,921.0,88339.0,2.0,0_1,29041_0,2842
922,922.0,82579.0,2.0,0_1,29631_0,2851
923,923.0,89799.0,2.0,0_1,29191_0,2873
924,924.0,77477.0,2.0,0_1,28781_0,2865
925,925.0,73206.0,2.0,0_1,28311_0,2805
926,926.0,77656.0,2.0,0_1,27921_0,2712
927,927.0,73128.0,2.0,0_1,27481_0,2657
928,928.0,80666.0,2.0,0_1,26601_0,2618
929,929.0,76011.0,2.0,0_1,26451_0,2537
930,930.0,78334.0,2.0,0_1,26281_0,2538
931,931.0,68229.0,2.0,0_1,26061_0,2506
932,932.0,67604.0,2.0,0_1,25921_0,2495
933,933.0,70749.0,2.0,0_1,25301_0,2467
934,934.0,74658.0,2.0,0_1,25261_0,2468
935,935.0,74642.0,2.0,0_1,25071_0,2521
936,936.0,79686.0,2.0,0_1,25601_0,2499
937,937.0,74955.0,2.0,0_1,25081_0,2511
938,938.0,74512.0,2.0,0_1,24511_0,2457
939,939.0,66048.0,2.0,0_1,24481_0,2484
940,940.0,70615.0,2.0,0_1,24081_0,2475
941,941.0,72928.0,2.0,0_1,24171_0,2478
942,942.0,74041.0,2.0,0_1,24171_0,2499
943,943.0,79083.0,2.0,0_1,24741_0,2531
944,944.0,71198.0,2.0,0_1,25641_0,2516
945,945.0,81654.0,2.0,0_1,25991_0,2512
946,946.0,77088.0,2.0,0_1,26361_0,2493
947,947.0,74070.0,2.0,0_1,26451_0,2416
948,948.0,73018.0,2.0,0_1,26481_0,2439
949,949.0,70663.0,2.0,0_1,26071_0,2422
950,950.0,69435.0,2.0,0_1,25591_0,2404
951,951.0,77396.0,2.0,0_1,25251_0,2462
952,952.0,81535.0,2.0,0_1,25561_0,2507
953,953.0,78358.0,2.0,0_1,25351_0,2511
954,954.0,70024.0,2.0,0_1,25351_0,2432
955,955.0,72423.0,2.0,0_1,25971_0,2480
956,956.0,76709.0,2.0,0_1,25831_0,2470
957,957.0,72360.0,2.0,0_1,25451_0,2433
958,958.0,72117.0,2.0,0_1,24801_0,2432
959,959.0,73777.0,2.0,0_1,25361_0,2460
960,960.0,77988.0,2.0,0_1,25441_0,2498
961,961.0,76742.0,2.0,0_1,25071_0,2479
962,962.0,67883.0,2.0,0_1,24881_0,2468
963,963.0,83972.0,2.0,0_1,25521_0,2517
964,964.0,81751.0,2.0,0_1,25971_0,2582
965,965.0,78270.0,2.0,0_1,26261_0,2626
966,966.0,79673.0,2.0,0_1,26601_0,2648
967,967.0,81263.0,2.0,0_1,26531_0,2679
968,968.0,82330.0,2.0,0_1,26351_0,2688
969,969.0,81030.0,2.0,0_1,26921_0,2694
970,970.0,76718.0,2.0,0_1,27341_0,2686
971,971.0,83956.0,2.0,0_1,27841_0,2651
972,972.0,90065.0,2.0,0_1,28311_0,2671
973,973.0,86221.0,2.0,0_1,28381_0,2693
974,974.0,87788.0,2.0,0_1,28601_0,2766
975,975.0,89431.0,2.0,0_1,28341_0,2793
976,976.0,73013.0,2.0,0_1,27801_0,2790
977,977.0,76459.0,2.0,0_1,27481_0,2803
978,978.0,84383.0,2.0,0_1,27081_0,2798
979,979.0,83225.0,2.0,0_1,26681_0,2774
980,980.0,75159.0,2.0,0_1,26871_0,2751
981,981.0,84562.0,2.0,0_1,27421_0,2723
982,982.0,79196.0,2.0,0_1,27011_0,2744
983,983.0,82269.0,2.0,0_1,26791_0,2750
984,984.0,78824.0,2.0,0_1,26751_0,2756
985,985.0,80794.0,2.0,0_1,26701_0,2769
986,986.0,82487.0,2.0,0_1,26741_0,2742
987,987.0,86697.0,2.0,0_1,26541_0,2740
988,988.0,87271.0,2.0,0_1,27311_0,2762
989,989.0,88591.0,2.0,0_1,27101_0,2724
990,990.0,66234.0,2.0,0_1,27181_0,2768
991,991.0,79616.0,2.0,0_1,27701_0,2810
992,992.0,92828.0,2.0,0_1,27651_0,2885
993,993.0,85147.0,2.0,0_1,27821_0,2897
994,994.0,82653.0,2.0,0_1,28011_0,2894
995,995.0,92602.0,2.0,0_1,28931_0,2911
996,996.0,97976.0,2.0,0_1,29261_0,3008
997,997.0,97122.0,2.0,0_1,29401_0,3029
998,998.0,65669.0,2.0,0_1,29261_0,2979
999,999.0,81751.0,2.0,0_1,28961_0,2923
