0,0.0,0.0,2.0,0_1,1041_0,63
1,1.0,5887.0,2.0,0_1,1261_0,82
2,2.0,3970.0,2.0,0_1,1211_0,82
3,3.0,3788.0,2.0,0_1,1101_0,87
4,4.0,4178.0,2.0,0_1,1071_0,88
5,5.0,4160.0,2.0,0_1,1111_0,93
6,6.0,4665.0,2.0,0_1,1181_0,103
7,7.0,4284.0,2.0,0_1,1171_0,102
8,8.0,3210.0,2.0,0_1,1181_0,120
9,9.0,5670.0,2.0,0_1,1161_0,121
10,10.0,4453.0,2.0,0_1,1201_0,128
11,11.0,4979.0,2.0,0_1,1311_0,131
12,12.0,5995.0,2.0,0_1,1411_0,139
13,13.0,4683.0,2.0,0_1,1491_0,147
14,14.0,5699.0,2.0,0_1,1511_0,154
15,15.0,6156.0,2.0,0_1,1531_0,166
16,16.0,7119.0,2.0,0_1,1561_0,173
17,17.0,5401.0,2.0,0_1,1631_0,181
18,18.0,6438.0,2.0,0_1,1661_0,187
19,19.0,6349.0,2.0,0_1,1731_0,193
20,20.0,6788.0,2.0,0_1,1801_0,204
21,21.0,6825.0,2.0,0_1,1851_0,211
22,22.0,7206.0,2.0,0_1,1921_0,219
23,23.0,5158.0,2.0,0_1,1991_0,215
24,24.0,7920.0,2.0,0_1,1951_0,215
25,25.0,6531.0,2.0,0_1,1971_0,214
26,26.0,7253.0,2.0,0_1,1971_0,212
27,27.0,8595.0,2.0,0_1,2071_0,223
28,28.0,7289.0,2.0,0_1,2211_0,229
29,29.0,8084.0,2.0,0_1,2331_0,244
30,30.0,8079.0,2.0,0_1,2411_0,238
31,31.0,7402.0,2.0,0_1,2461_0,250
32,32.0,10989.0,2.0,0_1,2481_0,260
33,33.0,8778.0,2.0,0_1,2571_0,256
34,34.0,9267.0,2.0,0_1,2621_0,273
35,35.0,9800.0,2.0,0_1,2641_0,271
36,36.0,9178.0,2.0,0_1,2761_0,275
37,37.0,9555.0,2.0,0_1,2821_0,282
38,38.0,7209.0,2.0,0_1,2891_0,276
39,39.0,8591.0,2.0,0_1,2861_0,285
40,40.0,9705.0,2.0,0_1,2881_0,297
41,41.0,11470.0,2.0,0_1,2881_0,311
42,42.0,10721.0,2.0,0_1,2911_0,318
43,43.0,9314.0,2.0,0_1,3071_0,326
44,44.0,11603.0,2.0,0_1,3071_0,340
45,45.0,10651.0,2.0,0_1,3211_0,345
46,46.0,12591.0,2.0,0_1,3241_0,349
47,47.0,11753.0,2.0,0_1,3341_0,360
48,48.0,13503.0,2.0,0_1,3481_0,366
49,49.0,11678.0,2.0,0_1,3581_0,368
50,50.0,11580.0,2.0,0_1,3611_0,371
51,51.0,13124.0,2.0,0_1,3691_0,380
52,52.0,12799.0,2.0,0_1,3861_0,388
53,53.0,15439.0,2.0,0_1,4011_0,389
54,54.0,14618.0,2.0,0_1,4191_0,398
55,55.0,15174.0,2.0,0_1,4321_0,396
56,56.0,16827.0,2.0,0_1,4411_0,405
57,57.0,15299.0,2.0,0_1,4521_0,413
58,58.0,15607.0,2.0,0_1,4611_0,423
59,59.0,17722.0,2.0,0_1,4821_0,448
60,60.0,16841.0,2.0,0_1,5021_0,460
61,61.0,18739.0,2.0,0_1,5261_0,478
62,62.0,16328.0,2.0,0_1,5361_0,484
63,63.0,15319.0,2.0,0_1,5411_0,501
64,64.0,17337.0,2.0,0_1,5471_0,524
65,65.0,19674.0,2.0,0_1,5581_0,535
66,66.0,18488.0,2.0,0_1,5691_0,544
67,67.0,20186.0,2.0,0_1,5831_0,556
68,68.0,20229.0,2.0,0_1,6161_0,572
69,69.0,21456.0,2.0,0_1,6291_0,601
70,70.0,20735.0,2.0,0_1,6641_0,613
71,71.0,16763.0,2.0,0_1,6731_0,632
72,72.0,20656.0,2.0,0_1,6881_0,651
73,73.0,25994.0,2.0,0_1,6911_0,667
74,74.0,22267.0,2.0,0_1,6901_0,697
75,75.0,21252.0,2.0,0_1,6911_0,691
76,76.0,23550.0,2.0,0_1,6961_0,705
77,77.0,23806.0,2.0,0_1,7151_0,692
78,78.0,21074.0,2.0,0_1,7181_0,697
79,79.0,26061.0,2.0,0_1,7201_0,713
80,80.0,23045.0,2.0,0_1,6901_0,723
81,81.0,18043.0,2.0,0_1,7031_0,723
82,82.0,24123.0,2.0,0_1,7021_0,729
83,83.0,15079.0,2.0,0_1,7051_0,712
84,84.0,16373.0,2.0,0_1,7001_0,700
85,85.0,17891.0,2.0,0_1,6901_0,686
86,86.0,15399.0,2.0,0_1,6781_0,666
87,87.0,19054.0,2.0,0_1,6551_0,659
88,88.0,18475.0,2.0,0_1,6521_0,650
89,89.0,19930.0,2.0,0_1,6561_0,646
90,90.0,20453.0,2.0,0_1,6541_0,634
91,91.0,20094.0,2.0,0_1,6751_0,652
92,92.0,19183.0,2.0,0_1,6751_0,657
93,93.0,23745.0,2.0,0_1,6591_0,676
94,94.0,18941.0,2.0,0_1,6661_0,682
95,95.0,18236.0,2.0,0_1,6631_0,683
96,96.0,15841.0,2.0,0_1,6651_0,676
97,97.0,20224.0,2.0,0_1,6591_0,683
98,98.0,22394.0,2.0,0_1,6601_0,674
99,99.0,19557.0,2.0,0_1,6601_0,693
100,100.0,22645.0,2.0,0_1,6801_0,689
101,101.0,22707.0,2.0,0_1,6851_0,686
102,102.0,23285.0,2.0,0_1,6981_0,685
103,103.0,23404.0,2.0,0_1,7111_0,692
104,104.0,22390.0,2.0,0_1,7161_0,685
105,105.0,20390.0,2.0,0_1,7211_0,699
106,106.0,23375.0,2.0,0_1,7291_0,693
107,107.0,24692.0,2.0,0_1,7601_0,698
108,108.0,23948.0,2.0,0_1,7681_0,706
109,109.0,27053.0,2.0,0_1,7641_0,722
110,110.0,25196.0,2.0,0_1,7731_0,756
111,111.0,26609.0,2.0,0_1,7691_0,781
112,112.0,24600.0,2.0,0_1,7831_0,789
113,113.0,24533.0,2.0,0_1,7991_0,812
114,114.0,22056.0,2.0,0_1,8131_0,831
115,115.0,24283.0,2.0,0_1,8331_0,820
116,116.0,30628.0,2.0,0_1,8401_0,819
117,117.0,24428.0,2.0,0_1,8451_0,818
118,118.0,20818.0,2.0,0_1,8411_0,812
119,119.0,22659.0,2.0,0_1,8281_0,814
120,120.0,25126.0,2.0,0_1,8331_0,817
121,121.0,23918.0,2.0,0_1,8411_0,829
122,122.0,26069.0,2.0,0_1,8361_0,831
123,123.0,26325.0,2.0,0_1,8481_0,835
124,124.0,23639.0,2.0,0_1,8401_0,847
125,125.0,24151.0,2.0,0_1,8471_0,846
126,126.0,28846.0,2.0,0_1,8501_0,858
127,127.0,25755.0,2.0,0_1,8781_0,853
128,128.0,27672.0,2.0,0_1,8821_0,863
129,129.0,29031.0,2.0,0_1,8931_0,879
130,130.0,29313.0,2.0,0_1,8941_0,868
131,131.0,25770.0,2.0,0_1,9031_0,869
132,132.0,24090.0,2.0,0_1,9051_0,872
133,133.0,22651.0,2.0,0_1,9051_0,877
134,134.0,31408.0,2.0,0_1,9321_0,872
135,135.0,30018.0,2.0,0_1,9271_0,878
136,136.0,35471.0,2.0,0_1,9481_0,867
137,137.0,25752.0,2.0,0_1,9641_0,879
138,138.0,36382.0,2.0,0_1,9651_0,896
139,139.0,29212.0,2.0,0_1,9741_0,897
140,140.0,25439.0,2.0,0_1,9881_0,905
141,141.0,28528.0,2.0,0_1,9671_0,915
142,142.0,27571.0,2.0,0_1,9561_0,930
143,143.0,30210.0,2.0,0_1,9451_0,927
144,144.0,28679.0,2.0,0_1,9431_0,944
145,145.0,32021.0,2.0,0_1,9511_0,970
146,146.0,29353.0,2.0,0_1,9521_0,981
147,147.0,24391.0,2.0,0_1,9451_0,983
148,148.0,25632.0,2.0,0_1,9531_0,971
149,149.0,26370.0,2.0,0_1,9561_0,960
150,150.0,28939.0,2.0,0_1,9561_0,943
151,151.0,30264.0,2.0,0_1,9541_0,949
152,152.0,30443.0,2.0,0_1,9671_0,947
153,153.0,30802.0,2.0,0_1,9591_0,969
154,154.0,28573.0,2.0,0_1,9721_0,972
155,155.0,32084.0,2.0,0_1,9561_0,974
156,156.0,26221.0,2.0,0_1,9561_0,963
157,157.0,20091.0,2.0,0_1,9461_0,960
158,158.0,27400.0,2.0,0_1,9271_0,962
159,159.0,30960.0,2.0,0_1,9521_0,1020
160,160.0,31623.0,2.0,0_1,9651_0,1059
161,161.0,32212.0,2.0,0_1,9761_0,1087
162,162.0,28890.0,2.0,0_1,10081_0,1105
163,163.0,29656.0,2.0,0_1,10341_0,1096
164,164.0,29353.0,2.0,0_1,10371_0,1098
165,165.0,32599.0,2.0,0_1,10411_0,1072
166,166.0,25139.0,2.0,0_1,10291_0,1083
167,167.0,28746.0,2.0,0_1,10131_0,1081
168,168.0,32014.0,2.0,0_1,10201_0,1075
169,169.0,28036.0,2.0,0_1,10381_0,1043
170,170.0,31719.0,2.0,0_1,10171_0,1012
171,171.0,26421.0,2.0,0_1,9961_0,993
172,172.0,22029.0,2.0,0_1,10221_0,1002
173,173.0,30143.0,2.0,0_1,10461_0,1027
174,174.0,32575.0,2.0,0_1,10421_0,1009
175,175.0,27068.0,2.0,0_1,10231_0,1017
176,176.0,31524.0,2.0,0_1,10181_0,1009
177,177.0,32972.0,2.0,0_1,10431_0,1002
178,178.0,37103.0,2.0,0_1,10441_0,1065
179,179.0,38311.0,2.0,0_1,11151_0,1096
180,180.0,38877.0,2.0,0_1,11401_0,1106
181,181.0,32430.0,2.0,0_1,11631_0,1143
182,182.0,38289.0,2.0,0_1,11711_0,1144
183,183.0,37210.0,2.0,0_1,11671_0,1144
184,184.0,34117.0,2.0,0_1,11721_0,1131
185,185.0,32263.0,2.0,0_1,11671_0,1158
186,186.0,40636.0,2.0,0_1,11421_0,1167
187,187.0,33234.0,2.0,0_1,11591_0,1183
188,188.0,36972.0,2.0,0_1,11441_0,1177
189,189.0,34033.0,2.0,0_1,11791_0,1202
190,190.0,35312.0,2.0,0_1,11891_0,1204
191,191.0,38605.0,2.0,0_1,12301_0,1217
192,192.0,38451.0,2.0,0_1,12421_0,1245
193,193.0,44134.0,2.0,0_1,12791_0,1266
194,194.0,39636.0,2.0,0_1,12761_0,1302
195,195.0,40222.0,2.0,0_1,12721_0,1306
196,196.0,33503.0,2.0,0_1,12771_0,1298
197,197.0,42868.0,2.0,0_1,12741_0,1323
198,198.0,39366.0,2.0,0_1,12881_0,1331
199,199.0,37697.0,2.0,0_1,13131_0,1333
200,200.0,43269.0,2.0,0_1,13201_0,1369
201,201.0,41312.0,2.0,0_1,13351_0,1340
202,202.0,38077.0,2.0,0_1,13301_0,1351
203,203.0,42875.0,2.0,0_1,13381_0,1367
204,204.0,36833.0,2.0,0_1,13431_0,1370
205,205.0,40774.0,2.0,0_1,13601_0,1355
206,206.0,39428.0,2.0,0_1,13951_0,1359
207,207.0,44230.0,2.0,0_1,14051_0,1385
208,208.0,47659.0,2.0,0_1,14411_0,1410
209,209.0,45299.0,2.0,0_1,14421_0,1424
210,210.0,44052.0,2.0,0_1,14621_0,1456
211,211.0,51026.0,2.0,0_1,14861_0,1476
212,212.0,39829.0,2.0,0_1,14681_0,1471
213,213.0,38018.0,2.0,0_1,14531_0,1513
214,214.0,41607.0,2.0,0_1,14651_0,1502
215,215.0,37325.0,2.0,0_1,14491_0,1503
216,216.0,46907.0,2.0,0_1,14771_0,1530
217,217.0,46420.0,2.0,0_1,14881_0,1536
218,218.0,47211.0,2.0,0_1,15361_0,1556
219,219.0,45112.0,2.0,0_1,15251_0,1520
220,220.0,39542.0,2.0,0_1,15041_0,1517
221,221.0,38463.0,2.0,0_1,14881_0,1478
222,222.0,35053.0,2.0,0_1,14981_0,1495
223,223.0,40790.0,2.0,0_1,15011_0,1515
224,224.0,50374.0,2.0,0_1,14941_0,1472
225,225.0,44119.0,2.0,0_1,15141_0,1464
226,226.0,50353.0,2.0,0_1,15601_0,1503
227,227.0,47564.0,2.0,0_1,15341_0,1526
228,228.0,36481.0,2.0,0_1,15141_0,1521
229,229.0,46702.0,2.0,0_1,14731_0,1504
230,230.0,39844.0,2.0,0_1,14371_0,1471
231,231.0,40430.0,2.0,0_1,13851_0,1457
232,232.0,38354.0,2.0,0_1,13371_0,1420
233,233.0,39710.0,2.0,0_1,13281_0,1410
234,234.0,44352.0,2.0,0_1,13171_0,1394
235,235.0,45479.0,2.0,0_1,13491_0,1434
236,236.0,43245.0,2.0,0_1,13341_0,1437
237,237.0,41765.0,2.0,0_1,13241_0,1441
238,238.0,43430.0,2.0,0_1,13911_0,1505
239,239.0,46092.0,2.0,0_1,14331_0,1521
240,240.0,42426.0,2.0,0_1,14731_0,1550
241,241.0,48283.0,2.0,0_1,14961_0,1557
242,242.0,40702.0,2.0,0_1,14661_0,1521
243,243.0,42014.0,2.0,0_1,14861_0,1525
244,244.0,44720.0,2.0,0_1,14801_0,1526
245,245.0,45049.0,2.0,0_1,14811_0,1535
246,246.0,43838.0,2.0,0_1,14891_0,1537
247,247.0,49172.0,2.0,0_1,14811_0,1518
248,248.0,41566.0,2.0,0_1,14751_0,1534
249,249.0,48299.0,2.0,0_1,14621_0,1491
250,250.0,36566.0,2.0,0_1,15121_0,1484
251,251.0,41405.0,2.0,0_1,15161_0,1459
252,252.0,46540.0,2.0,0_1,14901_0,1472
253,253.0,39668.0,2.0,0_1,14671_0,1429
254,254.0,41520.0,2.0,0_1,14571_0,1402
255,255.0,42950.0,2.0,0_1,14371_0,1395
256,256.0,47976.0,2.0,0_1,14781_0,1399
257,257.0,42249.0,2.0,0_1,14751_0,1430
258,258.0,46687.0,2.0,0_1,14861_0,1450
259,259.0,38774.0,2.0,0_1,15011_0,1446
260,260.0,42446.0,2.0,0_1,15041_0,1460
261,261.0,38399.0,2.0,0_1,14981_0,1483
262,262.0,51204.0,2.0,0_1,15041_0,1488
263,263.0,43422.0,2.0,0_1,14771_0,1506
264,264.0,41274.0,2.0,0_1,14941_0,1546
265,265.0,47390.0,2.0,0_1,15011_0,1536
266,266.0,41797.0,2.0,0_1,14781_0,1522
267,267.0,41178.0,2.0,0_1,14521_0,1487
268,268.0,38208.0,2.0,0_1,14751_0,1493
269,269.0,43179.0,2.0,0_1,14841_0,1508
270,270.0,43642.0,2.0,0_1,14981_0,1498
271,271.0,44288.0,2.0,0_1,14951_0,1475
272,272.0,44433.0,2.0,0_1,14981_0,1475
273,273.0,44261.0,2.0,0_1,15261_0,1462
274,274.0,43330.0,2.0,0_1,15441_0,1489
275,275.0,47271.0,2.0,0_1,15171_0,1507
276,276.0,49400.0,2.0,0_1,15061_0,1526
277,277.0,50283.0,2.0,0_1,15051_0,1564
278,278.0,48190.0,2.0,0_1,15031_0,1587
279,279.0,45550.0,2.0,0_1,14951_0,1610
280,280.0,47775.0,2.0,0_1,14961_0,1597
281,281.0,46891.0,2.0,0_1,14971_0,1590
282,282.0,45567.0,2.0,0_1,15321_0,1618
283,283.0,53008.0,2.0,0_1,15441_0,1586
284,284.0,37526.0,2.0,0_1,15601_0,1606
285,285.0,46409.0,2.0,0_1,15791_0,1586
286,286.0,50848.0,2.0,0_1,15931_0,1559
287,287.0,50437.0,2.0,0_1,16551_0,1549
288,288.0,43692.0,2.0,0_1,16481_0,1560
289,289.0,48230.0,2.0,0_1,16611_0,1585
290,290.0,51893.0,2.0,0_1,16901_0,1629
291,291.0,49269.0,2.0,0_1,16791_0,1605
292,292.0,44913.0,2.0,0_1,16971_0,1584
293,293.0,50896.0,2.0,0_1,16971_0,1603
294,294.0,52698.0,2.0,0_1,16851_0,1642
295,295.0,52605.0,2.0,0_1,17381_0,1678
296,296.0,50507.0,2.0,0_1,17671_0,1726
297,297.0,56125.0,2.0,0_1,17891_0,1734
298,298.0,44417.0,2.0,0_1,17691_0,1695
299,299.0,46798.0,2.0,0_1,17201_0,1661
300,300.0,46070.0,2.0,0_1,17401_0,1685
301,301.0,59085.0,2.0,0_1,17891_0,1723
302,302.0,52830.0,2.0,0_1,17991_0,1790
303,303.0,58426.0,2.0,0_1,18531_0,1806
304,304.0,56071.0,2.0,0_1,19071_0,1822
305,305.0,61108.0,2.0,0_1,19211_0,1834
306,306.0,53681.0,2.0,0_1,19131_0,1807
307,307.0,48048.0,2.0,0_1,19231_0,1806
308,308.0,55669.0,2.0,0_1,19101_0,1813
309,309.0,57958.0,2.0,0_1,19011_0,1805
310,310.0,49930.0,2.0,0_1,18761_0,1792
311,311.0,50853.0,2.0,0_1,18811_0,1804
312,312.0,52547.0,2.0,0_1,18501_0,1781
313,313.0,47504.0,2.0,0_1,18391_0,1789
314,314.0,48443.0,2.0,0_1,18201_0,1751
315,315.0,53030.0,2.0,0_1,17801_0,1734
316,316.0,56973.0,2.0,0_1,18091_0,1774
317,317.0,62290.0,2.0,0_1,18681_0,1805
318,318.0,55986.0,2.0,0_1,18921_0,1838
319,319.0,51099.0,2.0,0_1,18951_0,1851
320,320.0,53599.0,2.0,0_1,18801_0,1824
321,321.0,50764.0,2.0,0_1,18471_0,1809
322,322.0,48977.0,2.0,0_1,18041_0,1843
323,323.0,57758.0,2.0,0_1,17991_0,1829
324,324.0,54905.0,2.0,0_1,17851_0,1783
325,325.0,48691.0,2.0,0_1,17621_0,1760
326,326.0,54632.0,2.0,0_1,17671_0,1749
327,327.0,58468.0,2.0,0_1,17661_0,1764
328,328.0,52663.0,2.0,0_1,18131_0,1741
329,329.0,58810.0,2.0,0_1,18311_0,1752
330,330.0,52048.0,2.0,0_1,18241_0,1755
331,331.0,56939.0,2.0,0_1,18751_0,1819
332,332.0,61694.0,2.0,0_1,19561_0,1868
333,333.0,63092.0,2.0,0_1,20191_0,1929
334,334.0,66043.0,2.0,0_1,20551_0,1945
335,335.0,57865.0,2.0,0_1,20661_0,1972
336,336.0,63803.0,2.0,0_1,20701_0,1975
337,337.0,68091.0,2.0,0_1,21101_0,2019
338,338.0,64671.0,2.0,0_1,21201_0,2058
339,339.0,62650.0,2.0,0_1,20931_0,2068
340,340.0,57102.0,2.0,0_1,20691_0,2023
341,341.0,52538.0,2.0,0_1,20421_0,2028
342,342.0,38938.0,2.0,0_1,19641_0,1986
343,343.0,51472.0,2.0,0_1,18881_0,1927
344,344.0,53808.0,2.0,0_1,18651_0,1950
345,345.0,67040.0,2.0,0_1,18831_0,1964
346,346.0,54799.0,2.0,0_1,18861_0,1957
347,347.0,47126.0,2.0,0_1,18271_0,1933
348,348.0,49729.0,2.0,0_1,17721_0,1905
349,349.0,58316.0,2.0,0_1,17101_0,1865
350,350.0,46961.0,2.0,0_1,17351_0,1822
351,351.0,50081.0,2.0,0_1,17021_0,1819
352,352.0,62403.0,2.0,0_1,17551_0,1845
353,353.0,51185.0,2.0,0_1,18091_0,1863
354,354.0,57634.0,2.0,0_1,17851_0,1858
355,355.0,53148.0,2.0,0_1,17691_0,1851
356,356.0,53849.0,2.0,0_1,17231_0,1816
357,357.0,41499.0,2.0,0_1,17211_0,1779
358,358.0,53616.0,2.0,0_1,17271_0,1819
359,359.0,57378.0,2.0,0_1,17711_0,1823
360,360.0,55775.0,2.0,0_1,17921_0,1874
361,361.0,59326.0,2.0,0_1,18521_0,1898
362,362.0,61576.0,2.0,0_1,18981_0,1889
363,363.0,59731.0,2.0,0_1,19261_0,1875
364,364.0,55270.0,2.0,0_1,19331_0,1913
365,365.0,58249.0,2.0,0_1,19701_0,1988
366,366.0,63278.0,2.0,0_1,19721_0,1984
367,367.0,58556.0,2.0,0_1,19691_0,1970
368,368.0,55757.0,2.0,0_1,19761_0,1996
369,369.0,63953.0,2.0,0_1,19791_0,1967
370,370.0,67744.0,2.0,0_1,19591_0,1987
371,371.0,58461.0,2.0,0_1,19611_0,2009
372,372.0,58058.0,2.0,0_1,19261_0,1997
373,373.0,48647.0,2.0,0_1,19831_0,2021
374,374.0,56620.0,2.0,0_1,20091_0,2060
375,375.0,60864.0,2.0,0_1,19791_0,1994
376,376.0,52162.0,2.0,0_1,19721_0,2002
377,377.0,60928.0,2.0,0_1,19721_0,1969
378,378.0,59270.0,2.0,0_1,19351_0,1942
379,379.0,47691.0,2.0,0_1,19111_0,1922
380,380.0,59931.0,2.0,0_1,18751_0,1879
381,381.0,54811.0,2.0,0_1,18661_0,1883
382,382.0,54839.0,2.0,0_1,18431_0,1841
383,383.0,51354.0,2.0,0_1,18351_0,1832
384,384.0,55159.0,2.0,0_1,18181_0,1847
385,385.0,59128.0,2.0,0_1,17841_0,1832
386,386.0,48824.0,2.0,0_1,17851_0,1867
387,387.0,58349.0,2.0,0_1,18091_0,1900
388,388.0,62401.0,2.0,0_1,17941_0,1950
389,389.0,58910.0,2.0,0_1,18431_0,1998
390,390.0,58281.0,2.0,0_1,18551_0,2005
391,391.0,60711.0,2.0,0_1,18881_0,2029
392,392.0,59790.0,2.0,0_1,19221_0,1983
393,393.0,56040.0,2.0,0_1,19231_0,2019
394,394.0,61582.0,2.0,0_1,19341_0,1991
395,395.0,55659.0,2.0,0_1,19451_0,1982
396,396.0,56737.0,2.0,0_1,19521_0,2006
397,397.0,60983.0,2.0,0_1,19501_0,2027
398,398.0,62799.0,2.0,0_1,20011_0,2036
399,399.0,62729.0,2.0,0_1,20141_0,2048
400,400.0,59804.0,2.0,0_1,20381_0,2065
401,401.0,68452.0,2.0,0_1,20611_0,2081
402,402.0,74855.0,2.0,0_1,20751_0,2091
403,403.0,70709.0,2.0,0_1,21171_0,2141
404,404.0,75313.0,2.0,0_1,22071_0,2211
405,405.0,79761.0,2.0,0_1,22401_0,2246
406,406.0,77349.0,2.0,0_1,23071_0,2299
407,407.0,80723.0,2.0,0_1,23471_0,2336
408,408.0,79313.0,2.0,0_1,24481_0,2368
409,409.0,89387.0,2.0,0_1,24411_0,2416
410,410.0,83442.0,2.0,0_1,24181_0,2421
411,411.0,81325.0,2.0,0_1,24201_0,2426
412,412.0,79539.0,2.0,0_1,24641_0,2416
413,413.0,76908.0,2.0,0_1,25171_0,2455
414,414.0,88304.0,2.0,0_1,25851_0,2507
415,415.0,83131.0,2.0,0_1,25991_0,2522
416,416.0,90350.0,2.0,0_1,26311_0,2602
417,417.0,92242.0,2.0,0_1,26141_0,2654
418,418.0,87409.0,2.0,0_1,26201_0,2698
419,419.0,89173.0,2.0,0_1,26591_0,2692
420,420.0,93611.0,2.0,0_1,27351_0,2725
421,421.0,105098.0,2.0,0_1,28531_0,2806
422,422.0,97743.0,2.0,0_1,28671_0,2799
423,423.0,96358.0,2.0,0_1,28831_0,2846
424,424.0,88703.0,2.0,0_1,29571_0,2870
425,425.0,101030.0,2.0,0_1,29951_0,2875
426,426.0,105307.0,2.0,0_1,30001_0,2869
427,427.0,91259.0,2.0,0_1,30021_0,2896
428,428.0,88995.0,2.0,0_1,30221_0,2928
429,429.0,91153.0,2.0,0_1,30381_0,2958
430,430.0,108255.0,2.0,0_1,30441_0,2945
431,431.0,81621.0,2.0,0_1,30481_0,2982
432,432.0,109727.0,2.0,0_1,30771_0,2995
433,433.0,103138.0,2.0,0_1,31281_0,3065
434,434.0,107489.0,2.0,0_1,32141_0,3119
435,435.0,114842.0,2.0,0_1,32811_0,3161
436,436.0,119907.0,2.0,0_1,33171_0,3212
437,437.0,105907.0,2.0,0_1,33381_0,3196
438,438.0,101918.0,2.0,0_1,33101_0,3175
439,439.0,110061.0,2.0,0_1,33551_0,3215
440,440.0,116322.0,2.0,0_1,33831_0,3264
441,441.0,122764.0,2.0,0_1,34091_0,3288
442,442.0,107145.0,2.0,0_1,34301_0,3352
443,443.0,114136.0,2.0,0_1,34391_0,3411
444,444.0,122018.0,2.0,0_1,34981_0,3412
445,445.0,122665.0,2.0,0_1,35431_0,3460
446,446.0,109147.0,2.0,0_1,35841_0,3492
447,447.0,121911.0,2.0,0_1,35781_0,3478
448,448.0,105734.0,2.0,0_1,35781_0,3489
449,449.0,122887.0,2.0,0_1,35971_0,3600
450,450.0,120865.0,2.0,0_1,36451_0,3653
451,451.0,136409.0,2.0,0_1,36801_0,3687
452,452.0,114240.0,2.0,0_1,36891_0,3626
453,453.0,119198.0,2.0,0_1,37411_0,3685
454,454.0,122768.0,2.0,0_1,37741_0,3696
455,455.0,112455.0,2.0,0_1,38061_0,3735
456,456.0,139919.0,2.0,0_1,38651_0,3750
457,457.0,129154.0,2.0,0_1,38871_0,3822
458,458.0,126019.0,2.0,0_1,38771_0,3841
459,459.0,129203.0,2.0,0_1,39201_0,3956
460,460.0,144068.0,2.0,0_1,39731_0,3979
461,461.0,137543.0,2.0,0_1,40581_0,3978
462,462.0,127606.0,2.0,0_1,40921_0,4004
463,463.0,135515.0,2.0,0_1,41181_0,4051
464,464.0,118529.0,2.0,0_1,41311_0,4075
465,465.0,143072.0,2.0,0_1,41141_0,4125
466,466.0,123675.0,2.0,0_1,41151_0,4087
467,467.0,132569.0,2.0,0_1,41531_0,4112
468,468.0,128949.0,2.0,0_1,41511_0,4103
469,469.0,139224.0,2.0,0_1,41671_0,4124
470,470.0,143234.0,2.0,0_1,42401_0,4160
471,471.0,145560.0,2.0,0_1,42771_0,4266
472,472.0,156341.0,2.0,0_1,42891_0,4298
473,473.0,141985.0,2.0,0_1,43361_0,4307
474,474.0,138025.0,2.0,0_1,43641_0,4360
475,475.0,133678.0,2.0,0_1,43911_0,4353
476,476.0,144559.0,2.0,0_1,43811_0,4392
477,477.0,138888.0,2.0,0_1,44241_0,4455
478,478.0,162873.0,2.0,0_1,44241_0,4509
479,479.0,160642.0,2.0,0_1,44501_0,4512
480,480.0,144398.0,2.0,0_1,44551_0,4491
481,481.0,139751.0,2.0,0_1,44661_0,4500
482,482.0,144574.0,2.0,0_1,44471_0,4513
483,483.0,135877.0,2.0,0_1,44561_0,4538
484,484.0,163244.0,2.0,0_1,44821_0,4568
485,485.0,153137.0,2.0,0_1,44651_0,4557
486,486.0,147147.0,2.0,0_1,44921_0,4565
487,487.0,144781.0,2.0,0_1,45541_0,4563
488,488.0,155154.0,2.0,0_1,45531_0,4569
489,489.0,151667.0,2.0,0_1,45671_0,4630
490,490.0,156166.0,2.0,0_1,45601_0,4638
491,491.0,136779.0,2.0,0_1,45641_0,4629
492,492.0,135199.0,2.0,0_1,45521_0,4608
493,493.0,141482.0,2.0,0_1,45431_0,4574
494,494.0,140385.0,2.0,0_1,45501_0,4574
495,495.0,167390.0,2.0,0_1,46011_0,4629
496,496.0,150167.0,2.0,0_1,46361_0,4608
497,497.0,151161.0,2.0,0_1,46451_0,4587
498,498.0,157263.0,2.0,0_1,46851_0,4616
499,499.0,158555.0,2.0,0_1,47051_0,4612
500,500.0,147853.0,2.0,0_1,47331_0,4592
501,501.0,150782.0,2.0,0_1,47271_0,4583
502,502.0,117893.0,2.0,0_1,47151_0,4581
503,503.0,125932.0,2.0,0_1,47021_0,4598
504,504.0,136303.0,2.0,0_1,46491_0,4582
505,505.0,135009.0,2.0,0_1,46181_0,4592
506,506.0,134377.0,2.0,0_1,46121_0,4573
507,507.0,119640.0,2.0,0_1,45751_0,4525
508,508.0,127519.0,2.0,0_1,45561_0,4519
509,509.0,118665.0,2.0,0_1,45291_0,4497
510,510.0,133565.0,2.0,0_1,45051_0,4482
511,511.0,125976.0,2.0,0_1,44631_0,4421
512,512.0,113349.0,2.0,0_1,43971_0,4319
513,513.0,100810.0,2.0,0_1,43921_0,4296
514,514.0,111767.0,2.0,0_1,43551_0,4204
515,515.0,123766.0,2.0,0_1,43971_0,4324
516,516.0,122627.0,2.0,0_1,43651_0,4336
517,517.0,130800.0,2.0,0_1,43091_0,4311
518,518.0,120652.0,2.0,0_1,42341_0,4283
519,519.0,124890.0,2.0,0_1,42641_0,4270
520,520.0,121886.0,2.0,0_1,42971_0,4249
521,521.0,118804.0,2.0,0_1,43001_0,4266
522,522.0,109015.0,2.0,0_1,42641_0,4238
523,523.0,114527.0,2.0,0_1,41611_0,4131
524,524.0,98278.0,2.0,0_1,40701_0,4078
525,525.0,115145.0,2.0,0_1,40021_0,4000
526,526.0,112898.0,2.0,0_1,40171_0,4066
527,527.0,125710.0,2.0,0_1,40221_0,4089
528,528.0,111295.0,2.0,0_1,39941_0,4071
529,529.0,119955.0,2.0,0_1,39731_0,4043
530,530.0,113646.0,2.0,0_1,39621_0,4012
531,531.0,120757.0,2.0,0_1,39141_0,3930
532,532.0,101284.0,2.0,0_1,39221_0,3982
533,533.0,114485.0,2.0,0_1,39671_0,4004
534,534.0,131844.0,2.0,0_1,38961_0,3956
535,535.0,99557.0,2.0,0_1,38441_0,3955
536,536.0,107575.0,2.0,0_1,37721_0,3929
537,537.0,106780.0,2.0,0_1,37501_0,3877
538,538.0,113918.0,2.0,0_1,36771_0,3834
539,539.0,110173.0,2.0,0_1,36841_0,3839
540,540.0,96971.0,2.0,0_1,37061_0,3899
541,541.0,108514.0,2.0,0_1,37471_0,3917
542,542.0,103243.0,2.0,0_1,37111_0,3828
543,543.0,95683.0,2.0,0_1,36441_0,3770
544,544.0,109791.0,2.0,0_1,35881_0,3709
545,545.0,92852.0,2.0,0_1,34941_0,3637
546,546.0,98751.0,2.0,0_1,34061_0,3600
547,547.0,96634.0,2.0,0_1,34051_0,3511
548,548.0,107293.0,2.0,0_1,33231_0,3463
549,549.0,87285.0,2.0,0_1,32221_0,3372
550,550.0,86823.0,2.0,0_1,31591_0,3271
551,551.0,97171.0,2.0,0_1,31921_0,3211
552,552.0,96063.0,2.0,0_1,32211_0,3219
553,553.0,100423.0,2.0,0_1,32391_0,3221
554,554.0,89887.0,2.0,0_1,31801_0,3165
555,555.0,99852.0,2.0,0_1,31691_0,3208
556,556.0,98292.0,2.0,0_1,31301_0,3282
557,557.0,104562.0,2.0,0_1,31111_0,3236
558,558.0,82319.0,2.0,0_1,31331_0,3208
559,559.0,96939.0,2.0,0_1,31601_0,3283
560,560.0,93566.0,2.0,0_1,31881_0,3280
561,561.0,85550.0,2.0,0_1,31901_0,3291
562,562.0,88826.0,2.0,0_1,32171_0,3295
563,563.0,95154.0,2.0,0_1,31891_0,3233
564,564.0,90645.0,2.0,0_1,32071_0,3173
565,565.0,104938.0,2.0,0_1,32171_0,3177
566,566.0,103361.0,2.0,0_1,31641_0,3152
567,567.0,91748.0,2.0,0_1,31711_0,3189
568,568.0,105151.0,2.0,0_1,31691_0,3254
569,569.0,100607.0,2.0,0_1,31961_0,3350
570,570.0,103032.0,2.0,0_1,31871_0,3367
571,571.0,91626.0,2.0,0_1,31951_0,3399
572,572.0,98559.0,2.0,0_1,32321_0,3446
573,573.0,102909.0,2.0,0_1,33151_0,3486
574,574.0,105514.0,2.0,0_1,33541_0,3483
575,575.0,103903.0,2.0,0_1,33491_0,3524
576,576.0,95606.0,2.0,0_1,33471_0,3543
577,577.0,103676.0,2.0,0_1,33261_0,3467
578,578.0,109043.0,2.0,0_1,33561_0,3461
579,579.0,101755.0,2.0,0_1,32721_0,3386
580,580.0,87413.0,2.0,0_1,32491_0,3341
581,581.0,105878.0,2.0,0_1,33011_0,3397
582,582.0,106035.0,2.0,0_1,33291_0,3371
583,583.0,87302.0,2.0,0_1,33571_0,3354
584,584.0,88419.0,2.0,0_1,33421_0,3375
585,585.0,107793.0,2.0,0_1,33351_0,3345
586,586.0,95329.0,2.0,0_1,33141_0,3320
587,587.0,105915.0,2.0,0_1,33261_0,3354
588,588.0,111962.0,2.0,0_1,32881_0,3383
589,589.0,101012.0,2.0,0_1,33391_0,3422
590,590.0,106041.0,2.0,0_1,34631_0,3481
591,591.0,119890.0,2.0,0_1,35181_0,3518
592,592.0,102061.0,2.0,0_1,35561_0,3564
593,593.0,116552.0,2.0,0_1,35651_0,3522
594,594.0,99626.0,2.0,0_1,35591_0,3496
595,595.0,99631.0,2.0,0_1,35901_0,3564
596,596.0,90608.0,2.0,0_1,36061_0,3516
597,597.0,103279.0,2.0,0_1,35461_0,3464
598,598.0,98526.0,2.0,0_1,34601_0,3348
599,599.0,89607.0,2.0,0_1,34051_0,3309
600,600.0,92122.0,2.0,0_1,33851_0,3251
601,601.0,94128.0,2.0,0_1,33281_0,3260
602,602.0,114352.0,2.0,0_1,33471_0,3270
603,603.0,108990.0,2.0,0_1,33691_0,3328
604,604.0,92134.0,2.0,0_1,33341_0,3378
605,605.0,97646.0,2.0,0_1,32701_0,3315
606,606.0,85200.0,2.0,0_1,32101_0,3246
607,607.0,83741.0,2.0,0_1,31691_0,3200
608,608.0,95583.0,2.0,0_1,30811_0,3122
609,609.0,93105.0,2.0,0_1,30681_0,3072
610,610.0,97748.0,2.0,0_1,29841_0,3040
611,611.0,80956.0,2.0,0_1,30361_0,3031
612,612.0,78140.0,2.0,0_1,31211_0,3064
613,613.0,89216.0,2.0,0_1,31671_0,3136
614,614.0,101829.0,2.0,0_1,32321_0,3248
615,615.0,101586.0,2.0,0_1,32911_0,3285
616,616.0,92841.0,2.0,0_1,32691_0,3255
617,617.0,97162.0,2.0,0_1,32291_0,3232
618,618.0,90432.0,2.0,0_1,31491_0,3188
619,619.0,100250.0,2.0,0_1,31581_0,3263
620,620.0,95085.0,2.0,0_1,32321_0,3320
621,621.0,100096.0,2.0,0_1,32391_0,3405
622,622.0,102681.0,2.0,0_1,32721_0,3354
623,623.0,98187.0,2.0,0_1,32681_0,3293
624,624.0,97948.0,2.0,0_1,33561_0,3339
625,625.0,102851.0,2.0,0_1,33541_0,3314
626,626.0,102350.0,2.0,0_1,33681_0,3276
627,627.0,92750.0,2.0,0_1,34731_0,3324
628,628.0,104577.0,2.0,0_1,34491_0,3305
629,629.0,99030.0,2.0,0_1,35051_0,3334
630,630.0,102154.0,2.0,0_1,33691_0,3268
631,631.0,87383.0,2.0,0_1,33401_0,3262
632,632.0,97959.0,2.0,0_1,33121_0,3251
633,633.0,99107.0,2.0,0_1,33571_0,3336
634,634.0,112030.0,2.0,0_1,34231_0,3366
635,635.0,81920.0,2.0,0_1,34051_0,3279
636,636.0,83449.0,2.0,0_1,33461_0,3241
637,637.0,89180.0,2.0,0_1,33051_0,3132
638,638.0,92174.0,2.0,0_1,32121_0,3085
639,639.0,93717.0,2.0,0_1,31681_0,3086
640,640.0,90038.0,2.0,0_1,32011_0,3122
641,641.0,93963.0,2.0,0_1,32001_0,3139
642,642.0,95606.0,2.0,0_1,31341_0,3118
643,643.0,91388.0,2.0,0_1,30951_0,3091
644,644.0,98937.0,2.0,0_1,31271_0,3139
645,645.0,106908.0,2.0,0_1,31951_0,3187
646,646.0,99655.0,2.0,0_1,31811_0,3165
647,647.0,91649.0,2.0,0_1,32351_0,3221
648,648.0,94455.0,2.0,0_1,32661_0,3208
649,649.0,93849.0,2.0,0_1,32031_0,3113
650,650.0,90158.0,2.0,0_1,32591_0,3182
651,651.0,97690.0,2.0,0_1,32561_0,3210
652,652.0,91950.0,2.0,0_1,32461_0,3128
653,653.0,96632.0,2.0,0_1,32581_0,3194
654,654.0,98084.0,2.0,0_1,32141_0,3247
655,655.0,102203.0,2.0,0_1,32111_0,3261
656,656.0,93462.0,2.0,0_1,31671_0,3261
657,657.0,89644.0,2.0,0_1,31821_0,3261
658,658.0,107158.0,2.0,0_1,31891_0,3256
659,659.0,90017.0,2.0,0_1,31491_0,3180
660,660.0,86318.0,2.0,0_1,31661_0,3176
661,661.0,95873.0,2.0,0_1,30701_0,3138
662,662.0,83536.0,2.0,0_1,30151_0,3198
663,663.0,83000.0,2.0,0_1,30341_0,3211
664,664.0,89042.0,2.0,0_1,30171_0,3164
665,665.0,82533.0,2.0,0_1,30581_0,3105
666,666.0,91876.0,2.0,0_1,30481_0,3093
667,667.0,92326.0,2.0,0_1,30391_0,3067
668,668.0,94898.0,2.0,0_1,30491_0,3042
669,669.0,94857.0,2.0,0_1,29961_0,3033
670,670.0,76849.0,2.0,0_1,29811_0,3042
671,671.0,82035.0,2.0,0_1,29451_0,2964
672,672.0,89193.0,2.0,0_1,29521_0,2925
673,673.0,90869.0,2.0,0_1,29701_0,2909
674,674.0,89542.0,2.0,0_1,29161_0,2833
675,675.0,87291.0,2.0,0_1,29401_0,2906
676,676.0,92841.0,2.0,0_1,29061_0,2950
677,677.0,99271.0,2.0,0_1,29441_0,2979
678,678.0,102148.0,2.0,0_1,30401_0,3125
679,679.0,96969.0,2.0,0_1,30621_0,3195
680,680.0,92639.0,2.0,0_1,31041_0,3161
681,681.0,86100.0,2.0,0_1,31321_0,3172
682,682.0,77966.0,2.0,0_1,31221_0,3179
683,683.0,95775.0,2.0,0_1,30991_0,3180
684,684.0,100339.0,2.0,0_1,31351_0,3252
685,685.0,104779.0,2.0,0_1,31631_0,3280
686,686.0,105582.0,2.0,0_1,31921_0,3288
687,687.0,98295.0,2.0,0_1,31901_0,3283
688,688.0,100677.0,2.0,0_1,32141_0,3256
689,689.0,99650.0,2.0,0_1,32671_0,3283
690,690.0,95290.0,2.0,0_1,32061_0,3261
691,691.0,87517.0,2.0,0_1,31771_0,3272
692,692.0,88745.0,2.0,0_1,31961_0,3286
693,693.0,96818.0,2.0,0_1,31791_0,3280
694,694.0,102785.0,2.0,0_1,32351_0,3361
695,695.0,101923.0,2.0,0_1,32321_0,3345
696,696.0,89452.0,2.0,0_1,31701_0,3279
697,697.0,84767.0,2.0,0_1,31671_0,3261
698,698.0,92311.0,2.0,0_1,30921_0,3181
699,699.0,84170.0,2.0,0_1,30431_0,3118
700,700.0,83478.0,2.0,0_1,30381_0,3081
701,701.0,93535.0,2.0,0_1,31181_0,3067
702,702.0,94664.0,2.0,0_1,31381_0,3073
703,703.0,95254.0,2.0,0_1,31371_0,3074
704,704.0,88733.0,2.0,0_1,31281_0,3097
705,705.0,97954.0,2.0,0_1,31391_0,3095
706,706.0,95749.0,2.0,0_1,31901_0,3070
707,707.0,101339.0,2.0,0_1,31131_0,3098
708,708.0,80419.0,2.0,0_1,31161_0,3059
709,709.0,84778.0,2.0,0_1,31391_0,3056
710,710.0,100780.0,2.0,0_1,31981_0,3089
711,711.0,95616.0,2.0,0_1,31641_0,3110
712,712.0,88495.0,2.0,0_1,31611_0,3131
713,713.0,88615.0,2.0,0_1,31221_0,3112
714,714.0,85958.0,2.0,0_1,31291_0,3100
715,715.0,93616.0,2.0,0_1,30621_0,3085
716,716.0,80582.0,2.0,0_1,30401_0,3028
717,717.0,86247.0,2.0,0_1,30251_0,2986
718,718.0,88893.0,2.0,0_1,29591_0,2940
719,719.0,88256.0,2.0,0_1,29381_0,2961
720,720.0,96406.0,2.0,0_1,29211_0,2933
721,721.0,75580.0,2.0,0_1,29131_0,2954
722,722.0,84630.0,2.0,0_1,28551_0,2886
723,723.0,71745.0,2.0,0_1,28891_0,2891
724,724.0,93218.0,2.0,0_1,29031_0,2871
725,725.0,96320.0,2.0,0_1,29271_0,2919
726,726.0,106648.0,2.0,0_1,29801_0,2918
727,727.0,98216.0,2.0,0_1,30121_0,3039
728,728.0,86992.0,2.0,0_1,30171_0,3083
729,729.0,87837.0,2.0,0_1,30151_0,3072
730,730.0,71766.0,2.0,0_1,29781_0,3000
731,731.0,76319.0,2.0,0_1,28641_0,2893
732,732.0,71677.0,2.0,0_1,27861_0,2813
733,733.0,64669.0,2.0,0_1,27861_0,2747
734,734.0,78160.0,2.0,0_1,27621_0,2711
735,735.0,76760.0,2.0,0_1,27321_0,2641
736,736.0,70075.0,2.0,0_1,26701_0,2619
737,737.0,70201.0,2.0,0_1,26181_0,2563
738,738.0,74354.0,2.0,0_1,25571_0,2501
739,739.0,72294.0,2.0,0_1,25291_0,2405
740,740.0,66455.0,2.0,0_1,24701_0,2363
741,741.0,74283.0,2.0,0_1,24251_0,2332
742,742.0,77769.0,2.0,0_1,24451_0,2341
743,743.0,79346.0,2.0,0_1,24401_0,2389
744,744.0,88914.0,2.0,0_1,24391_0,2451
745,745.0,73652.0,2.0,0_1,24351_0,2475
746,746.0,68467.0,2.0,0_1,24691_0,2464
747,747.0,68707.0,2.0,0_1,24661_0,2403
748,748.0,63868.0,2.0,0_1,24541_0,2399
749,749.0,69406.0,2.0,0_1,25031_0,2426
750,750.0,77021.0,2.0,0_1,25141_0,2431
751,751.0,69196.0,2.0,0_1,25091_0,2447
752,752.0,72355.0,2.0,0_1,25051_0,2487
753,753.0,62581.0,2.0,0_1,24531_0,2468
754,754.0,73465.0,2.0,0_1,24531_0,2494
755,755.0,80816.0,2.0,0_1,24481_0,2512
756,756.0,71814.0,2.0,0_1,24601_0,2444
757,757.0,79761.0,2.0,0_1,25011_0,2447
758,758.0,81057.0,2.0,0_1,25181_0,2448
759,759.0,77303.0,2.0,0_1,24931_0,2461
760,760.0,67743.0,2.0,0_1,25141_0,2448
761,761.0,72344.0,2.0,0_1,24951_0,2462
762,762.0,63062.0,2.0,0_1,24761_0,2417
763,763.0,79313.0,2.0,0_1,24451_0,2488
764,764.0,64425.0,2.0,0_1,24611_0,2416
765,765.0,71791.0,2.0,0_1,24921_0,2354
766,766.0,72438.0,2.0,0_1,24781_0,2311
767,767.0,67841.0,2.0,0_1,24121_0,2296
768,768.0,60523.0,2.0,0_1,23481_0,2264
769,769.0,61689.0,2.0,0_1,23261_0,2266
770,770.0,69451.0,2.0,0_1,22991_0,2309
771,771.0,79106.0,2.0,0_1,23151_0,2319
772,772.0,67159.0,2.0,0_1,23641_0,2311
773,773.0,72435.0,2.0,0_1,23451_0,2302
774,774.0,71799.0,2.0,0_1,23001_0,2357
775,775.0,80721.0,2.0,0_1,23131_0,2388
776,776.0,71659.0,2.0,0_1,23211_0,2374
777,777.0,68963.0,2.0,0_1,23681_0,2387
778,778.0,70437.0,2.0,0_1,23691_0,2416
779,779.0,79003.0,2.0,0_1,24071_0,2411
780,780.0,64535.0,2.0,0_1,24461_0,2453
781,781.0,73740.0,2.0,0_1,23971_0,2444
782,782.0,60905.0,2.0,0_1,24331_0,2429
783,783.0,74151.0,2.0,0_1,24651_0,2450
784,784.0,79311.0,2.0,0_1,24841_0,2451
785,785.0,80786.0,2.0,0_1,24431_0,2447
786,786.0,67036.0,2.0,0_1,24551_0,2419
787,787.0,72788.0,2.0,0_1,24711_0,2392
788,788.0,73288.0,2.0,0_1,24951_0,2433
789,789.0,75988.0,2.0,0_1,25031_0,2439
790,790.0,76787.0,2.0,0_1,24771_0,2475
791,791.0,75814.0,2.0,0_1,24971_0,2527
792,792.0,76587.0,2.0,0_1,24871_0,2523
793,793.0,81731.0,2.0,0_1,25081_0,2562
794,794.0,83688.0,2.0,0_1,25611_0,2565
795,795.0,77519.0,2.0,0_1,26091_0,2581
796,796.0,77749.0,2.0,0_1,26271_0,2590
797,797.0,84143.0,2.0,0_1,26591_0,2582
798,798.0,78511.0,2.0,0_1,26881_0,2604
799,799.0,80022.0,2.0,0_1,26851_0,2642
800,800.0,80223.0,2.0,0_1,27151_0,2689
801,801.0,80353.0,2.0,0_1,27441_0,2693
802,802.0,82718.0,2.0,0_1,27671_0,2714
803,803.0,79714.0,2.0,0_1,28141_0,2710
804,804.0,89399.0,2.0,0_1,28141_0,2744
805,805.0,91111.0,2.0,0_1,27901_0,2756
806,806.0,82604.0,2.0,0_1,27851_0,2781
807,807.0,78102.0,2.0,0_1,27781_0,2800
808,808.0,78938.0,2.0,0_1,27241_0,2749
809,809.0,65365.0,2.0,0_1,26351_0,2647
810,810.0,62752.0,2.0,0_1,25271_0,2599
811,811.0,65353.0,2.0,0_1,24391_0,2519
812,812.0,65789.0,2.0,0_1,23131_0,2439
813,813.0,60484.0,2.0,0_1,22341_0,2328
814,814.0,56315.0,2.0,0_1,22031_0,2218
815,815.0,63736.0,2.0,0_1,21821_0,2176
816,816.0,58439.0,2.0,0_1,21351_0,2124
817,817.0,60480.0,2.0,0_1,21321_0,2069
818,818.0,67848.0,2.0,0_1,21241_0,2058
819,819.0,61960.0,2.0,0_1,21151_0,2079
820,820.0,66250.0,2.0,0_1,21191_0,2061
821,821.0,63707.0,2.0,0_1,21121_0,2040
822,822.0,68003.0,2.0,0_1,21441_0,2084
823,823.0,65015.0,2.0,0_1,21241_0,2092
824,824.0,62498.0,2.0,0_1,21091_0,2076
825,825.0,60227.0,2.0,0_1,21581_0,2084
826,826.0,70672.0,2.0,0_1,22211_0,2099
827,827.0,61211.0,2.0,0_1,22761_0,2116
828,828.0,66821.0,2.0,0_1,22911_0,2094
829,829.0,63319.0,2.0,0_1,22861_0,2138
830,830.0,69910.0,2.0,0_1,22671_0,2162
831,831.0,70290.0,2.0,0_1,22541_0,2166
832,832.0,63432.0,2.0,0_1,22431_0,2217
833,833.0,71544.0,2.0,0_1,22881_0,2279
834,834.0,84015.0,2.0,0_1,22841_0,2313
835,835.0,60549.0,2.0,0_1,22791_0,2342
836,836.0,78244.0,2.0,0_1,23021_0,2374
837,837.0,74422.0,2.0,0_1,23361_0,2393
838,838.0,77016.0,2.0,0_1,23771_0,2440
839,839.0,75588.0,2.0,0_1,24041_0,2447
840,840.0,70555.0,2.0,0_1,24341_0,2435
841,841.0,67234.0,2.0,0_1,24971_0,2444
842,842.0,75358.0,2.0,0_1,25261_0,2428
843,843.0,70531.0,2.0,0_1,25751_0,2416
844,844.0,76121.0,2.0,0_1,25701_0,2438
845,845.0,76028.0,2.0,0_1,25351_0,2481
846,846.0,63928.0,2.0,0_1,24991_0,2456
847,847.0,63697.0,2.0,0_1,24491_0,2435
848,848.0,78031.0,2.0,0_1,24951_0,2482
849,849.0,82969.0,2.0,0_1,24731_0,2437
850,850.0,72026.0,2.0,0_1,24961_0,2477
851,851.0,82563.0,2.0,0_1,25181_0,2517
852,852.0,89388.0,2.0,0_1,26011_0,2538
853,853.0,85089.0,2.0,0_1,26681_0,2569
854,854.0,82980.0,2.0,0_1,26211_0,2592
855,855.0,78214.0,2.0,0_1,25391_0,2558
856,856.0,66171.0,2.0,0_1,25451_0,2594
857,857.0,81805.0,2.0,0_1,26041_0,2637
858,858.0,77748.0,2.0,0_1,26811_0,2698
859,859.0,83925.0,2.0,0_1,27261_0,2709
860,860.0,81778.0,2.0,0_1,27321_0,2672
861,861.0,68398.0,2.0,0_1,27311_0,2703
862,862.0,83385.0,2.0,0_1,27411_0,2706
863,863.0,86930.0,2.0,0_1,27721_0,2702
864,864.0,76921.0,2.0,0_1,27161_0,2643
865,865.0,77459.0,2.0,0_1,27721_0,2653
866,866.0,77137.0,2.0,0_1,27241_0,2639
867,867.0,74767.0,2.0,0_1,27251_0,2634
868,868.0,82891.0,2.0,0_1,26951_0,2678
869,869.0,90648.0,2.0,0_1,27611_0,2719
870,870.0,91450.0,2.0,0_1,28041_0,2749
871,871.0,82920.0,2.0,0_1,28071_0,2761
872,872.0,77605.0,2.0,0_1,27991_0,2762
873,873.0,80723.0,2.0,0_1,27821_0,2793
874,874.0,80688.0,2.0,0_1,27711_0,2812
875,875.0,76656.0,2.0,0_1,27611_0,2750
876,876.0,77312.0,2.0,0_1,27481_0,2732
877,877.0,85979.0,2.0,0_1,27591_0,2678
878,878.0,74815.0,2.0,0_1,27521_0,2647
879,879.0,72521.0,2.0,0_1,27081_0,2614
880,880.0,71867.0,2.0,0_1,26551_0,2590
881,881.0,79958.0,2.0,0_1,25901_0,2547
882,882.0,81648.0,2.0,0_1,26381_0,2576
883,883.0,84018.0,2.0,0_1,26791_0,2583
884,884.0,81021.0,2.0,0_1,26771_0,2562
885,885.0,79669.0,2.0,0_1,26831_0,2526
886,886.0,78610.0,2.0,0_1,26141_0,2554
887,887.0,75892.0,2.0,0_1,25811_0,2583
888,888.0,86382.0,2.0,0_1,26341_0,2627
889,889.0,88226.0,2.0,0_1,27021_0,2696
890,890.0,85185.0,2.0,0_1,27821_0,2741
891,891.0,85442.0,2.0,0_1,28441_0,2736
892,892.0,86040.0,2.0,0_1,28411_0,2770
893,893.0,82805.0,2.0,0_1,28121_0,2816
894,894.0,89742.0,2.0,0_1,28201_0,2810
895,895.0,80156.0,2.0,0_1,28331_0,2782
896,896.0,85374.0,2.0,0_1,28151_0,2773
897,897.0,83643.0,2.0,0_1,28281_0,2797
898,898.0,85440.0,2.0,0_1,28381_0,2818
899,899.0,80228.0,2.0,0_1,27731_0,2763
900,900.0,78833.0,2.0,0_1,28131_0,2791
901,901.0,81375.0,2.0,0_1,28271_0,2795
902,902.0,82392.0,2.0,0_1,28411_0,2784
903,903.0,80008.0,2.0,0_1,27851_0,2711
904,904.0,82275.0,2.0,0_1,28121_0,2743
905,905.0,86238.0,2.0,0_1,28651_0,2790
906,906.0,95205.0,2.0,0_1,28961_0,2817
907,907.0,85313.0,2.0,0_1,29141_0,2841
908,908.0,90138.0,2.0,0_1,28971_0,2870
909,909.0,90385.0,2.0,0_1,29181_0,2913
910,910.0,93616.0,2.0,0_1,28981_0,2918
911,911.0,86308.0,2.0,0_1,29211_0,2910
912,912.0,87007.0,2.0,0_1,28731_0,2884
913,913.0,77245.0,2.0,0_1,29021_0,2889
914,914.0,88727.0,2.0,0_1,29241_0,2920
915,915.0,91780.0,2.0,0_1,29411_0,2919
916,916.0,76923.0,2.0,0_1,29831_0,2963
917,917.0,83037.0,2.0,0_1,29791_0,2949
918,918.0,80234.0,2.0,0_1,29181_0,2949
919,919.0,79763.0,2.0,0_1,27991_0,2933
920,920.0,73544.0,2.0,0_1,27421_0,2847
921,921.0,76783.0,2.0,0_1,27261_0,2831
922,922.0,76862.0,2.0,0_1,26821_0,2713
923,923.0,66401.0,2.0,0_1,25871_0,2591
924,924.0,72501.0,2.0,0_1,25451_0,2582
925,925.0,76768.0,2.0,0_1,24781_0,2462
926,926.0,71798.0,2.0,0_1,24941_0,2426
927,927.0,71511.0,2.0,0_1,24781_0,2405
928,928.0,69443.0,2.0,0_1,24961_0,2374
929,929.0,78347.0,2.0,0_1,25291_0,2378
930,930.0,79067.0,2.0,0_1,25471_0,2398
931,931.0,73235.0,2.0,0_1,25611_0,2404
932,932.0,80947.0,2.0,0_1,26011_0,2482
933,933.0,86208.0,2.0,0_1,26521_0,2532
934,934.0,75824.0,2.0,0_1,26731_0,2597
935,935.0,83388.0,2.0,0_1,26651_0,2646
936,936.0,81688.0,2.0,0_1,26371_0,2608
937,937.0,71886.0,2.0,0_1,26431_0,2623
938,938.0,75242.0,2.0,0_1,26421_0,2617
939,939.0,80538.0,2.0,0_1,25861_0,2593
940,940.0,77300.0,2.0,0_1,25751_0,2581
941,941.0,72416.0,2.0,0_1,25671_0,2580
942,942.0,74274.0,2.0,0_1,25671_0,2617
943,943.0,88540.0,2.0,0_1,25971_0,2660
944,944.0,90494.0,2.0,0_1,26281_0,2679
945,945.0,82423.0,2.0,0_1,26481_0,2717
946,946.0,82722.0,2.0,0_1,26871_0,2765
947,947.0,81131.0,2.0,0_1,27141_0,2775
948,948.0,81585.0,2.0,0_1,26911_0,2749
949,949.0,68414.0,2.0,0_1,26451_0,2689
950,950.0,79314.0,2.0,0_1,26381_0,2710
951,951.0,82220.0,2.0,0_1,26601_0,2706
952,952.0,76594.0,2.0,0_1,26471_0,2713
953,953.0,76085.0,2.0,0_1,26321_0,2697
954,954.0,85283.0,2.0,0_1,26071_0,2688
955,955.0,86786.0,2.0,0_1,26431_0,2663
956,956.0,67668.0,2.0,0_1,26521_0,2581
957,957.0,82686.0,2.0,0_1,26811_0,2609
958,958.0,88118.0,2.0,0_1,27231_0,2693
959,959.0,89904.0,2.0,0_1,27791_0,2706
960,960.0,83869.0,2.0,0_1,27821_0,2752
961,961.0,84394.0,2.0,0_1,27931_0,2769
962,962.0,85560.0,2.0,0_1,28151_0,2820
963,963.0,81036.0,2.0,0_1,27851_0,2777
964,964.0,78527.0,2.0,0_1,27901_0,2745
965,965.0,75542.0,2.0,0_1,27581_0,2713
966,966.0,82823.0,2.0,0_1,27441_0,2743
967,967.0,77863.0,2.0,0_1,27361_0,2736
968,968.0,84772.0,2.0,0_1,27231_0,2729
969,969.0,76745.0,2.0,0_1,27511_0,2693
970,970.0,88643.0,2.0,0_1,28081_0,2681
971,971.0,72692.0,2.0,0_1,27351_0,2657
972,972.0,67194.0,2.0,0_1,26901_0,2612
973,973.0,76864.0,2.0,0_1,26281_0,2529
974,974.0,60392.0,2.0,0_1,26051_0,2531
975,975.0,82509.0,2.0,0_1,25651_0,2535
976,976.0,74530.0,2.0,0_1,25461_0,2514
977,977.0,80822.0,2.0,0_1,25201_0,2523
978,978.0,75140.0,2.0,0_1,24911_0,2513
979,979.0,76939.0,2.0,0_1,24741_0,2458
980,980.0,70544.0,2.0,0_1,24511_0,2485
981,981.0,74372.0,2.0,0_1,25001_0,2536
982,982.0,85109.0,2.0,0_1,25331_0,2565
983,983.0,83004.0,2.0,0_1,25831_0,2521
984,984.0,78628.0,2.0,0_1,26411_0,2589
985,985.0,82707.0,2.0,0_1,26701_0,2606
986,986.0,81374.0,2.0,0_1,27081_0,2644
987,987.0,87710.0,2.0,0_1,27821_0,2697
988,988.0,85152.0,2.0,0_1,27971_0,2744
989,989.0,86266.0,2.0,0_1,27741_0,2746
990,990.0,79126.0,2.0,0_1,27861_0,2766
991,991.0,84340.0,2.0,0_1,27841_0,2750
992,992.0,78226.0,2.0,0_1,27391_0,2723
993,993.0,72076.0,2.0,0_1,27111_0,2750
994,994.0,76170.0,2.0,0_1,27231_0,2776
995,995.0,78555.0,2.0,0_1,26971_0,2732
996,996.0,88810.0,2.0,0_1,27161_0,2740
997,997.0,90845.0,2.0,0_1,27841_0,2724
998,998.0,84525.0,2.0,0_1,28471_0,2722
999,999.0,86660.0,2.0,0_1,28441_0,2714
