0,0.0,0.0,2.0,0_1,791_0,96
1,1.0,6478.0,2.0,0_1,991_0,111
2,2.0,3904.0,2.0,0_1,921_0,91
3,3.0,2793.0,2.0,0_1,921_0,85
4,4.0,3517.0,2.0,0_1,901_0,89
5,5.0,3813.0,2.0,0_1,901_0,93
6,6.0,2968.0,2.0,0_1,831_0,94
7,7.0,4061.0,2.0,0_1,881_0,100
8,8.0,3420.0,2.0,0_1,901_0,94
9,9.0,3571.0,2.0,0_1,941_0,99
10,10.0,3994.0,2.0,0_1,1071_0,100
11,11.0,3950.0,2.0,0_1,1121_0,111
12,12.0,5091.0,2.0,0_1,1101_0,110
13,13.0,4080.0,2.0,0_1,1091_0,109
14,14.0,3785.0,2.0,0_1,1171_0,114
15,15.0,4898.0,2.0,0_1,1261_0,124
16,16.0,4833.0,2.0,0_1,1321_0,131
17,17.0,4866.0,2.0,0_1,1411_0,137
18,18.0,5874.0,2.0,0_1,1531_0,148
19,19.0,5933.0,2.0,0_1,1541_0,151
20,20.0,5831.0,2.0,0_1,1621_0,150
21,21.0,5216.0,2.0,0_1,1631_0,153
22,22.0,5003.0,2.0,0_1,1611_0,158
23,23.0,5519.0,2.0,0_1,1621_0,166
24,24.0,6155.0,2.0,0_1,1701_0,176
25,25.0,5620.0,2.0,0_1,1691_0,182
26,26.0,5267.0,2.0,0_1,1721_0,184
27,27.0,6229.0,2.0,0_1,1751_0,183
28,28.0,4417.0,2.0,0_1,1751_0,185
29,29.0,6503.0,2.0,0_1,1711_0,198
30,30.0,6665.0,2.0,0_1,1721_0,202
31,31.0,5869.0,2.0,0_1,1631_0,195
32,32.0,6039.0,2.0,0_1,1671_0,206
33,33.0,6806.0,2.0,0_1,1801_0,213
34,34.0,8409.0,2.0,0_1,1841_0,221
35,35.0,8304.0,2.0,0_1,1981_0,226
36,36.0,9493.0,2.0,0_1,2021_0,225
37,37.0,6600.0,2.0,0_1,2221_0,232
38,38.0,7031.0,2.0,0_1,2391_0,237
39,39.0,8970.0,2.0,0_1,2461_0,252
40,40.0,8039.0,2.0,0_1,2471_0,250
41,41.0,8777.0,2.0,0_1,2501_0,255
42,42.0,8024.0,2.0,0_1,2471_0,253
43,43.0,6906.0,2.0,0_1,2551_0,250
44,44.0,9234.0,2.0,0_1,2591_0,256
45,45.0,8399.0,2.0,0_1,2531_0,266
46,46.0,8527.0,2.0,0_1,2621_0,273
47,47.0,9459.0,2.0,0_1,2701_0,261
48,48.0,9527.0,2.0,0_1,2731_0,266
49,49.0,7893.0,2.0,0_1,2731_0,271
50,50.0,8440.0,2.0,0_1,2761_0,271
51,51.0,8682.0,2.0,0_1,2821_0,263
52,52.0,8421.0,2.0,0_1,2881_0,259
53,53.0,7484.0,2.0,0_1,2921_0,262
54,54.0,8816.0,2.0,0_1,2891_0,272
55,55.0,9467.0,2.0,0_1,2891_0,280
56,56.0,12208.0,2.0,0_1,2971_0,290
57,57.0,10667.0,2.0,0_1,3031_0,295
58,58.0,9497.0,2.0,0_1,3121_0,303
59,59.0,10329.0,2.0,0_1,3201_0,310
60,60.0,10117.0,2.0,0_1,3261_0,316
61,61.0,11271.0,2.0,0_1,3311_0,330
62,62.0,13914.0,2.0,0_1,3391_0,333
63,63.0,10153.0,2.0,0_1,3451_0,345
64,64.0,11253.0,2.0,0_1,3621_0,341
65,65.0,13576.0,2.0,0_1,3721_0,354
66,66.0,12203.0,2.0,0_1,3771_0,366
67,67.0,11202.0,2.0,0_1,3751_0,378
68,68.0,13398.0,2.0,0_1,3761_0,380
69,69.0,14148.0,2.0,0_1,3821_0,391
70,70.0,12452.0,2.0,0_1,3871_0,387
71,71.0,13299.0,2.0,0_1,3901_0,393
72,72.0,13363.0,2.0,0_1,3941_0,397
73,73.0,13228.0,2.0,0_1,3961_0,393
74,74.0,13710.0,2.0,0_1,4001_0,408
75,75.0,15446.0,2.0,0_1,3991_0,408
76,76.0,13872.0,2.0,0_1,4051_0,413
77,77.0,12433.0,2.0,0_1,4131_0,419
78,78.0,13890.0,2.0,0_1,4201_0,412
79,79.0,14489.0,2.0,0_1,4261_0,423
80,80.0,12920.0,2.0,0_1,4291_0,419
81,81.0,14271.0,2.0,0_1,4341_0,432
82,82.0,13874.0,2.0,0_1,4451_0,445
83,83.0,14588.0,2.0,0_1,4601_0,456
84,84.0,20071.0,2.0,0_1,4811_0,488
85,85.0,16766.0,2.0,0_1,5021_0,494
86,86.0,16656.0,2.0,0_1,5181_0,507
87,87.0,18438.0,2.0,0_1,5301_0,534
88,88.0,16562.0,2.0,0_1,5351_0,526
89,89.0,14148.0,2.0,0_1,5381_0,528
90,90.0,16368.0,2.0,0_1,5411_0,527
91,91.0,15137.0,2.0,0_1,5421_0,541
92,92.0,15601.0,2.0,0_1,5361_0,535
93,93.0,15083.0,2.0,0_1,5311_0,524
94,94.0,18777.0,2.0,0_1,5381_0,539
95,95.0,17902.0,2.0,0_1,5391_0,532
96,96.0,17256.0,2.0,0_1,5301_0,559
97,97.0,15598.0,2.0,0_1,5231_0,559
98,98.0,15246.0,2.0,0_1,5321_0,557
99,99.0,17270.0,2.0,0_1,5321_0,569
100,100.0,18435.0,2.0,0_1,5451_0,572
101,101.0,23103.0,2.0,0_1,5511_0,585
102,102.0,18207.0,2.0,0_1,5611_0,601
103,103.0,20767.0,2.0,0_1,5681_0,609
104,104.0,16841.0,2.0,0_1,5751_0,631
105,105.0,22060.0,2.0,0_1,5941_0,641
106,106.0,19910.0,2.0,0_1,5981_0,647
107,107.0,19115.0,2.0,0_1,6101_0,651
108,108.0,17356.0,2.0,0_1,6191_0,641
109,109.0,14843.0,2.0,0_1,6221_0,645
110,110.0,20359.0,2.0,0_1,6221_0,651
111,111.0,19406.0,2.0,0_1,6201_0,650
112,112.0,22022.0,2.0,0_1,6381_0,667
113,113.0,21473.0,2.0,0_1,6401_0,693
114,114.0,19086.0,2.0,0_1,6691_0,691
115,115.0,21821.0,2.0,0_1,6781_0,690
116,116.0,22195.0,2.0,0_1,6891_0,702
117,117.0,24693.0,2.0,0_1,6971_0,729
118,118.0,23618.0,2.0,0_1,7111_0,738
119,119.0,20771.0,2.0,0_1,7021_0,755
120,120.0,22897.0,2.0,0_1,7001_0,743
121,121.0,22154.0,2.0,0_1,7051_0,763
122,122.0,26091.0,2.0,0_1,7141_0,774
123,123.0,21588.0,2.0,0_1,7211_0,788
124,124.0,22449.0,2.0,0_1,7261_0,769
125,125.0,23897.0,2.0,0_1,7341_0,777
126,126.0,23138.0,2.0,0_1,7471_0,787
127,127.0,21500.0,2.0,0_1,7531_0,774
128,128.0,21487.0,2.0,0_1,7531_0,769
129,129.0,21938.0,2.0,0_1,7521_0,778
130,130.0,22147.0,2.0,0_1,7521_0,787
131,131.0,20723.0,2.0,0_1,7491_0,780
132,132.0,20811.0,2.0,0_1,7451_0,778
133,133.0,25108.0,2.0,0_1,7641_0,786
134,134.0,20960.0,2.0,0_1,7851_0,802
135,135.0,23993.0,2.0,0_1,7851_0,814
136,136.0,26695.0,2.0,0_1,7871_0,842
137,137.0,24308.0,2.0,0_1,7841_0,854
138,138.0,26181.0,2.0,0_1,7951_0,877
139,139.0,27230.0,2.0,0_1,8011_0,890
140,140.0,25838.0,2.0,0_1,8171_0,897
141,141.0,27855.0,2.0,0_1,8181_0,901
142,142.0,29028.0,2.0,0_1,8371_0,914
143,143.0,24870.0,2.0,0_1,8581_0,914
144,144.0,24822.0,2.0,0_1,8961_0,905
145,145.0,29705.0,2.0,0_1,9261_0,918
146,146.0,24505.0,2.0,0_1,9131_0,906
147,147.0,26691.0,2.0,0_1,9111_0,892
148,148.0,25803.0,2.0,0_1,9131_0,903
149,149.0,27404.0,2.0,0_1,8851_0,889
150,150.0,25694.0,2.0,0_1,8771_0,882
151,151.0,29352.0,2.0,0_1,8651_0,880
152,152.0,27496.0,2.0,0_1,8511_0,891
153,153.0,29678.0,2.0,0_1,8671_0,896
154,154.0,27307.0,2.0,0_1,8511_0,906
155,155.0,26538.0,2.0,0_1,8591_0,926
156,156.0,26612.0,2.0,0_1,8591_0,928
157,157.0,26238.0,2.0,0_1,8801_0,927
158,158.0,22854.0,2.0,0_1,8741_0,917
159,159.0,28574.0,2.0,0_1,8921_0,913
160,160.0,24737.0,2.0,0_1,8971_0,936
161,161.0,25091.0,2.0,0_1,8641_0,929
162,162.0,20075.0,2.0,0_1,8521_0,938
163,163.0,32976.0,2.0,0_1,8471_0,935
164,164.0,28716.0,2.0,0_1,8591_0,959
165,165.0,28868.0,2.0,0_1,8651_0,939
166,166.0,28551.0,2.0,0_1,8821_0,930
167,167.0,27056.0,2.0,0_1,9131_0,944
168,168.0,29453.0,2.0,0_1,9121_0,926
169,169.0,27577.0,2.0,0_1,9161_0,918
170,170.0,25010.0,2.0,0_1,9301_0,910
171,171.0,29624.0,2.0,0_1,9301_0,929
172,172.0,29349.0,2.0,0_1,9291_0,939
173,173.0,24654.0,2.0,0_1,9361_0,928
174,174.0,24210.0,2.0,0_1,9251_0,902
175,175.0,23370.0,2.0,0_1,9241_0,886
176,176.0,26505.0,2.0,0_1,9441_0,873
177,177.0,28743.0,2.0,0_1,9771_0,879
178,178.0,26619.0,2.0,0_1,9941_0,912
179,179.0,34456.0,2.0,0_1,10061_0,934
180,180.0,32993.0,2.0,0_1,10291_0,981
181,181.0,32120.0,2.0,0_1,10441_0,1000
182,182.0,30204.0,2.0,0_1,10091_0,996
183,183.0,27989.0,2.0,0_1,10231_0,998
184,184.0,29650.0,2.0,0_1,10271_0,1030
185,185.0,27233.0,2.0,0_1,9851_0,1026
186,186.0,30388.0,2.0,0_1,10111_0,1036
187,187.0,23529.0,2.0,0_1,10031_0,1050
188,188.0,33247.0,2.0,0_1,9811_0,1050
189,189.0,29670.0,2.0,0_1,9731_0,1005
190,190.0,27743.0,2.0,0_1,9571_0,983
191,191.0,30460.0,2.0,0_1,9541_0,968
192,192.0,29502.0,2.0,0_1,9491_0,930
193,193.0,25207.0,2.0,0_1,9441_0,924
194,194.0,29583.0,2.0,0_1,9551_0,930
195,195.0,33178.0,2.0,0_1,9641_0,932
196,196.0,27432.0,2.0,0_1,9601_0,930
197,197.0,30324.0,2.0,0_1,9561_0,922
198,198.0,32083.0,2.0,0_1,9661_0,941
199,199.0,34672.0,2.0,0_1,9761_0,969
200,200.0,34110.0,2.0,0_1,9871_0,984
201,201.0,28006.0,2.0,0_1,9901_0,987
202,202.0,28414.0,2.0,0_1,10111_0,1007
203,203.0,30782.0,2.0,0_1,10251_0,1021
204,204.0,35656.0,2.0,0_1,10461_0,1050
205,205.0,31834.0,2.0,0_1,10861_0,1082
206,206.0,35522.0,2.0,0_1,10861_0,1083
207,207.0,32261.0,2.0,0_1,10731_0,1093
208,208.0,33211.0,2.0,0_1,10741_0,1103
209,209.0,34403.0,2.0,0_1,10841_0,1123
210,210.0,36187.0,2.0,0_1,10911_0,1128
211,211.0,31221.0,2.0,0_1,10891_0,1120
212,212.0,34775.0,2.0,0_1,10791_0,1121
213,213.0,33909.0,2.0,0_1,11281_0,1136
214,214.0,36222.0,2.0,0_1,11531_0,1159
215,215.0,37164.0,2.0,0_1,11851_0,1149
216,216.0,32806.0,2.0,0_1,11751_0,1142
217,217.0,36543.0,2.0,0_1,12071_0,1163
218,218.0,34135.0,2.0,0_1,12221_0,1183
219,219.0,38870.0,2.0,0_1,12271_0,1175
220,220.0,36587.0,2.0,0_1,12201_0,1187
221,221.0,38557.0,2.0,0_1,12211_0,1196
222,222.0,39225.0,2.0,0_1,12351_0,1201
223,223.0,36069.0,2.0,0_1,12721_0,1222
224,224.0,34133.0,2.0,0_1,12851_0,1231
225,225.0,41139.0,2.0,0_1,12811_0,1221
226,226.0,35863.0,2.0,0_1,12711_0,1227
227,227.0,34816.0,2.0,0_1,12761_0,1253
228,228.0,43487.0,2.0,0_1,12941_0,1284
229,229.0,38952.0,2.0,0_1,12931_0,1296
230,230.0,35807.0,2.0,0_1,13111_0,1292
231,231.0,40159.0,2.0,0_1,13261_0,1341
232,232.0,41766.0,2.0,0_1,13361_0,1323
233,233.0,41968.0,2.0,0_1,13451_0,1331
234,234.0,37094.0,2.0,0_1,13511_0,1350
235,235.0,40770.0,2.0,0_1,13411_0,1349
236,236.0,42760.0,2.0,0_1,13521_0,1356
237,237.0,38884.0,2.0,0_1,13721_0,1369
238,238.0,39855.0,2.0,0_1,13591_0,1380
239,239.0,39705.0,2.0,0_1,14041_0,1408
240,240.0,45868.0,2.0,0_1,14171_0,1416
241,241.0,39815.0,2.0,0_1,14241_0,1438
242,242.0,47346.0,2.0,0_1,14371_0,1448
243,243.0,42150.0,2.0,0_1,14431_0,1456
244,244.0,40963.0,2.0,0_1,14681_0,1434
245,245.0,42759.0,2.0,0_1,14851_0,1446
246,246.0,46067.0,2.0,0_1,14981_0,1487
247,247.0,43610.0,2.0,0_1,15011_0,1508
248,248.0,46556.0,2.0,0_1,15371_0,1563
249,249.0,56135.0,2.0,0_1,15771_0,1608
250,250.0,46715.0,2.0,0_1,15811_0,1615
251,251.0,38397.0,2.0,0_1,15871_0,1639
252,252.0,42290.0,2.0,0_1,15651_0,1591
253,253.0,41509.0,2.0,0_1,15581_0,1566
254,254.0,38573.0,2.0,0_1,15511_0,1551
255,255.0,47160.0,2.0,0_1,15101_0,1519
256,256.0,48117.0,2.0,0_1,14801_0,1487
257,257.0,44811.0,2.0,0_1,14551_0,1474
258,258.0,52928.0,2.0,0_1,15241_0,1551
259,259.0,59474.0,2.0,0_1,16151_0,1620
260,260.0,51991.0,2.0,0_1,16401_0,1662
261,261.0,52439.0,2.0,0_1,16541_0,1695
262,262.0,51705.0,2.0,0_1,16461_0,1678
263,263.0,45544.0,2.0,0_1,16621_0,1666
264,264.0,45749.0,2.0,0_1,16701_0,1677
265,265.0,49639.0,2.0,0_1,16681_0,1656
266,266.0,47218.0,2.0,0_1,16521_0,1637
267,267.0,41983.0,2.0,0_1,15881_0,1616
268,268.0,35869.0,2.0,0_1,15951_0,1638
269,269.0,45878.0,2.0,0_1,15901_0,1598
270,270.0,46817.0,2.0,0_1,15641_0,1566
271,271.0,53070.0,2.0,0_1,15791_0,1585
272,272.0,47510.0,2.0,0_1,16001_0,1620
273,273.0,45565.0,2.0,0_1,15531_0,1576
274,274.0,39179.0,2.0,0_1,15511_0,1580
275,275.0,47091.0,2.0,0_1,15781_0,1571
276,276.0,50728.0,2.0,0_1,16231_0,1592
277,277.0,50948.0,2.0,0_1,16231_0,1617
278,278.0,51929.0,2.0,0_1,16291_0,1614
279,279.0,47964.0,2.0,0_1,16161_0,1603
280,280.0,42848.0,2.0,0_1,16001_0,1579
281,281.0,44505.0,2.0,0_1,15691_0,1543
282,282.0,36062.0,2.0,0_1,15211_0,1539
283,283.0,42172.0,2.0,0_1,15281_0,1575
284,284.0,49461.0,2.0,0_1,15641_0,1618
285,285.0,52151.0,2.0,0_1,15561_0,1615
286,286.0,43471.0,2.0,0_1,15531_0,1579
287,287.0,43502.0,2.0,0_1,15561_0,1539
288,288.0,37550.0,2.0,0_1,15131_0,1514
289,289.0,44166.0,2.0,0_1,14731_0,1482
290,290.0,47749.0,2.0,0_1,14821_0,1480
291,291.0,39543.0,2.0,0_1,14931_0,1514
292,292.0,51630.0,2.0,0_1,14941_0,1507
293,293.0,49336.0,2.0,0_1,15201_0,1531
294,294.0,50902.0,2.0,0_1,15281_0,1559
295,295.0,46174.0,2.0,0_1,15441_0,1593
296,296.0,50326.0,2.0,0_1,15531_0,1646
297,297.0,52839.0,2.0,0_1,15631_0,1639
298,298.0,50058.0,2.0,0_1,15771_0,1656
299,299.0,49119.0,2.0,0_1,16201_0,1686
300,300.0,50786.0,2.0,0_1,16061_0,1710
301,301.0,49207.0,2.0,0_1,16271_0,1709
302,302.0,44337.0,2.0,0_1,16681_0,1726
303,303.0,50169.0,2.0,0_1,16711_0,1723
304,304.0,44988.0,2.0,0_1,16701_0,1669
305,305.0,46365.0,2.0,0_1,16211_0,1635
306,306.0,41754.0,2.0,0_1,15981_0,1601
307,307.0,46773.0,2.0,0_1,15961_0,1564
308,308.0,47252.0,2.0,0_1,15461_0,1577
309,309.0,45128.0,2.0,0_1,15511_0,1552
310,310.0,45798.0,2.0,0_1,15591_0,1568
311,311.0,48248.0,2.0,0_1,15641_0,1599
312,312.0,51907.0,2.0,0_1,15781_0,1644
313,313.0,50278.0,2.0,0_1,15991_0,1640
314,314.0,57643.0,2.0,0_1,16091_0,1670
315,315.0,50256.0,2.0,0_1,16471_0,1697
316,316.0,52812.0,2.0,0_1,16771_0,1680
317,317.0,50110.0,2.0,0_1,16841_0,1675
318,318.0,46070.0,2.0,0_1,16991_0,1649
319,319.0,51992.0,2.0,0_1,16741_0,1634
320,320.0,49002.0,2.0,0_1,16491_0,1651
321,321.0,51584.0,2.0,0_1,16881_0,1699
322,322.0,45786.0,2.0,0_1,17241_0,1744
323,323.0,52118.0,2.0,0_1,17041_0,1711
324,324.0,41167.0,2.0,0_1,16721_0,1709
325,325.0,50388.0,2.0,0_1,16691_0,1693
326,326.0,49501.0,2.0,0_1,16701_0,1664
327,327.0,46202.0,2.0,0_1,16381_0,1622
328,328.0,45192.0,2.0,0_1,16141_0,1590
329,329.0,50479.0,2.0,0_1,15991_0,1553
330,330.0,46782.0,2.0,0_1,15971_0,1569
331,331.0,50561.0,2.0,0_1,16311_0,1592
332,332.0,44347.0,2.0,0_1,16851_0,1634
333,333.0,52444.0,2.0,0_1,17491_0,1665
334,334.0,44378.0,2.0,0_1,17311_0,1641
335,335.0,50425.0,2.0,0_1,17331_0,1652
336,336.0,54126.0,2.0,0_1,17271_0,1660
337,337.0,49122.0,2.0,0_1,16971_0,1697
338,338.0,53842.0,2.0,0_1,17291_0,1702
339,339.0,53509.0,2.0,0_1,17501_0,1711
340,340.0,56198.0,2.0,0_1,17221_0,1712
341,341.0,54587.0,2.0,0_1,17131_0,1724
342,342.0,48064.0,2.0,0_1,17271_0,1731
343,343.0,57494.0,2.0,0_1,17621_0,1744
344,344.0,57466.0,2.0,0_1,17911_0,1748
345,345.0,56017.0,2.0,0_1,18331_0,1771
346,346.0,55795.0,2.0,0_1,18571_0,1781
347,347.0,54703.0,2.0,0_1,18681_0,1830
348,348.0,56722.0,2.0,0_1,18611_0,1811
349,349.0,44532.0,2.0,0_1,18081_0,1809
350,350.0,52022.0,2.0,0_1,18081_0,1858
351,351.0,59776.0,2.0,0_1,18321_0,1879
352,352.0,54035.0,2.0,0_1,18291_0,1920
353,353.0,54232.0,2.0,0_1,18621_0,1922
354,354.0,58995.0,2.0,0_1,18681_0,1881
355,355.0,51259.0,2.0,0_1,18541_0,1830
356,356.0,51235.0,2.0,0_1,18471_0,1823
357,357.0,51195.0,2.0,0_1,18281_0,1795
358,358.0,43159.0,2.0,0_1,18041_0,1778
359,359.0,44853.0,2.0,0_1,17981_0,1782
360,360.0,53832.0,2.0,0_1,17701_0,1744
361,361.0,58256.0,2.0,0_1,17341_0,1703
362,362.0,51804.0,2.0,0_1,17001_0,1713
363,363.0,50465.0,2.0,0_1,17131_0,1710
364,364.0,52712.0,2.0,0_1,17501_0,1728
365,365.0,52128.0,2.0,0_1,18201_0,1766
366,366.0,59976.0,2.0,0_1,18511_0,1798
367,367.0,54176.0,2.0,0_1,18881_0,1820
368,368.0,57628.0,2.0,0_1,18871_0,1809
369,369.0,55240.0,2.0,0_1,18971_0,1820
370,370.0,53152.0,2.0,0_1,18551_0,1811
371,371.0,53843.0,2.0,0_1,18151_0,1801
372,372.0,50328.0,2.0,0_1,17721_0,1748
373,373.0,51267.0,2.0,0_1,17501_0,1735
374,374.0,49609.0,2.0,0_1,18471_0,1834
375,375.0,63687.0,2.0,0_1,18701_0,1863
376,376.0,65813.0,2.0,0_1,19021_0,1886
377,377.0,57185.0,2.0,0_1,18861_0,1870
378,378.0,48457.0,2.0,0_1,18751_0,1868
379,379.0,52186.0,2.0,0_1,18891_0,1863
380,380.0,53616.0,2.0,0_1,18521_0,1839
381,381.0,48988.0,2.0,0_1,18411_0,1810
382,382.0,50006.0,2.0,0_1,18001_0,1778
383,383.0,51657.0,2.0,0_1,17961_0,1762
384,384.0,56472.0,2.0,0_1,17621_0,1739
385,385.0,57113.0,2.0,0_1,17591_0,1796
386,386.0,52381.0,2.0,0_1,18081_0,1786
387,387.0,59587.0,2.0,0_1,18241_0,1810
388,388.0,58476.0,2.0,0_1,18271_0,1842
389,389.0,45243.0,2.0,0_1,18901_0,1894
390,390.0,57949.0,2.0,0_1,19001_0,1915
391,391.0,52207.0,2.0,0_1,18981_0,1910
392,392.0,49914.0,2.0,0_1,18951_0,1892
393,393.0,54517.0,2.0,0_1,18501_0,1851
394,394.0,51336.0,2.0,0_1,18391_0,1837
395,395.0,59838.0,2.0,0_1,18301_0,1829
396,396.0,54293.0,2.0,0_1,18381_0,1842
397,397.0,57299.0,2.0,0_1,18991_0,1892
398,398.0,58968.0,2.0,0_1,18741_0,1871
399,399.0,52406.0,2.0,0_1,18301_0,1858
400,400.0,59320.0,2.0,0_1,18421_0,1872
401,401.0,59061.0,2.0,0_1,18381_0,1927
402,402.0,55479.0,2.0,0_1,18811_0,2003
403,403.0,67084.0,2.0,0_1,19391_0,2059
404,404.0,60406.0,2.0,0_1,19821_0,2102
405,405.0,60130.0,2.0,0_1,19611_0,2132
406,406.0,62147.0,2.0,0_1,19491_0,2133
407,407.0,55885.0,2.0,0_1,19151_0,2066
408,408.0,48893.0,2.0,0_1,18861_0,1999
409,409.0,57991.0,2.0,0_1,18561_0,1959
410,410.0,50128.0,2.0,0_1,17861_0,1903
411,411.0,45316.0,2.0,0_1,18221_0,1874
412,412.0,57123.0,2.0,0_1,18621_0,1871
413,413.0,50743.0,2.0,0_1,18911_0,1888
414,414.0,60653.0,2.0,0_1,18901_0,1874
415,415.0,57057.0,2.0,0_1,19131_0,1878
416,416.0,57781.0,2.0,0_1,19061_0,1883
417,417.0,62077.0,2.0,0_1,19841_0,1940
418,418.0,64159.0,2.0,0_1,19651_0,1971
419,419.0,62587.0,2.0,0_1,19901_0,1989
420,420.0,62479.0,2.0,0_1,20351_0,2020
421,421.0,63417.0,2.0,0_1,20141_0,2035
422,422.0,57813.0,2.0,0_1,19981_0,2011
423,423.0,57596.0,2.0,0_1,20191_0,2004
424,424.0,62925.0,2.0,0_1,20511_0,2044
425,425.0,62223.0,2.0,0_1,20141_0,2050
426,426.0,65811.0,2.0,0_1,20231_0,2091
427,427.0,63903.0,2.0,0_1,20851_0,2121
428,428.0,70985.0,2.0,0_1,21101_0,2133
429,429.0,70428.0,2.0,0_1,21931_0,2160
430,430.0,66242.0,2.0,0_1,21971_0,2195
431,431.0,61717.0,2.0,0_1,22141_0,2175
432,432.0,59928.0,2.0,0_1,21691_0,2105
433,433.0,56027.0,2.0,0_1,21021_0,2022
434,434.0,54749.0,2.0,0_1,21461_0,2038
435,435.0,72110.0,2.0,0_1,22101_0,2102
436,436.0,71466.0,2.0,0_1,22331_0,2117
437,437.0,63392.0,2.0,0_1,22431_0,2127
438,438.0,69490.0,2.0,0_1,22851_0,2173
439,439.0,80025.0,2.0,0_1,23261_0,2223
440,440.0,64159.0,2.0,0_1,22981_0,2256
441,441.0,70668.0,2.0,0_1,23001_0,2290
442,442.0,67682.0,2.0,0_1,22871_0,2256
443,443.0,70240.0,2.0,0_1,23201_0,2312
444,444.0,72657.0,2.0,0_1,23071_0,2282
445,445.0,68511.0,2.0,0_1,22791_0,2292
446,446.0,65352.0,2.0,0_1,22501_0,2315
447,447.0,59597.0,2.0,0_1,22551_0,2297
448,448.0,69403.0,2.0,0_1,22631_0,2291
449,449.0,67887.0,2.0,0_1,22631_0,2253
450,450.0,62393.0,2.0,0_1,22361_0,2260
451,451.0,67588.0,2.0,0_1,22191_0,2234
452,452.0,65047.0,2.0,0_1,22361_0,2244
453,453.0,67804.0,2.0,0_1,22231_0,2210
454,454.0,59990.0,2.0,0_1,22071_0,2226
455,455.0,60494.0,2.0,0_1,21771_0,2217
456,456.0,60773.0,2.0,0_1,21281_0,2220
457,457.0,60058.0,2.0,0_1,20641_0,2154
458,458.0,57128.0,2.0,0_1,20571_0,2144
459,459.0,54021.0,2.0,0_1,20631_0,2117
460,460.0,67910.0,2.0,0_1,20391_0,2132
461,461.0,58430.0,2.0,0_1,19911_0,2091
462,462.0,52051.0,2.0,0_1,19431_0,2035
463,463.0,56145.0,2.0,0_1,19151_0,1992
464,464.0,55775.0,2.0,0_1,19841_0,2018
465,465.0,73857.0,2.0,0_1,20531_0,2100
466,466.0,66384.0,2.0,0_1,20471_0,2095
467,467.0,63215.0,2.0,0_1,20811_0,2106
468,468.0,56784.0,2.0,0_1,20661_0,2118
469,469.0,56380.0,2.0,0_1,20851_0,2166
470,470.0,68181.0,2.0,0_1,21431_0,2176
471,471.0,71575.0,2.0,0_1,21871_0,2227
472,472.0,68518.0,2.0,0_1,21911_0,2163
473,473.0,53581.0,2.0,0_1,21531_0,2124
474,474.0,64398.0,2.0,0_1,21541_0,2165
475,475.0,63090.0,2.0,0_1,21051_0,2119
476,476.0,54279.0,2.0,0_1,21091_0,2137
477,477.0,64452.0,2.0,0_1,21291_0,2158
478,478.0,59279.0,2.0,0_1,20971_0,2137
479,479.0,58292.0,2.0,0_1,21101_0,2135
480,480.0,60027.0,2.0,0_1,21161_0,2143
481,481.0,71849.0,2.0,0_1,21091_0,2152
482,482.0,72943.0,2.0,0_1,21801_0,2132
483,483.0,66858.0,2.0,0_1,21781_0,2151
484,484.0,63038.0,2.0,0_1,21671_0,2156
485,485.0,68164.0,2.0,0_1,21771_0,2189
486,486.0,71918.0,2.0,0_1,22361_0,2230
487,487.0,69281.0,2.0,0_1,22711_0,2223
488,488.0,66210.0,2.0,0_1,22721_0,2238
489,489.0,56138.0,2.0,0_1,22281_0,2225
490,490.0,57209.0,2.0,0_1,22071_0,2145
491,491.0,62286.0,2.0,0_1,21811_0,2110
492,492.0,64274.0,2.0,0_1,21281_0,2096
493,493.0,60575.0,2.0,0_1,21551_0,2058
494,494.0,61899.0,2.0,0_1,21551_0,2051
495,495.0,59987.0,2.0,0_1,21551_0,2014
496,496.0,59601.0,2.0,0_1,21391_0,2013
497,497.0,57975.0,2.0,0_1,21441_0,1993
498,498.0,62516.0,2.0,0_1,21141_0,1986
499,499.0,57971.0,2.0,0_1,20761_0,1994
500,500.0,64502.0,2.0,0_1,20731_0,2004
501,501.0,65066.0,2.0,0_1,20911_0,2060
502,502.0,66854.0,2.0,0_1,21331_0,2114
503,503.0,66584.0,2.0,0_1,21401_0,2169
504,504.0,64031.0,2.0,0_1,21321_0,2179
505,505.0,61362.0,2.0,0_1,21711_0,2169
506,506.0,68456.0,2.0,0_1,21781_0,2245
507,507.0,66328.0,2.0,0_1,21701_0,2232
508,508.0,61556.0,2.0,0_1,21461_0,2171
509,509.0,61029.0,2.0,0_1,21281_0,2123
510,510.0,61779.0,2.0,0_1,21041_0,2117
511,511.0,68041.0,2.0,0_1,21611_0,2171
512,512.0,61188.0,2.0,0_1,21251_0,2118
513,513.0,59369.0,2.0,0_1,20801_0,2111
514,514.0,62447.0,2.0,0_1,19901_0,2075
515,515.0,61628.0,2.0,0_1,19351_0,2011
516,516.0,58787.0,2.0,0_1,19261_0,1962
517,517.0,59476.0,2.0,0_1,19711_0,2032
518,518.0,66155.0,2.0,0_1,20971_0,2084
519,519.0,76814.0,2.0,0_1,21591_0,2139
520,520.0,66845.0,2.0,0_1,21881_0,2216
521,521.0,61672.0,2.0,0_1,22081_0,2236
522,522.0,68422.0,2.0,0_1,21961_0,2246
523,523.0,64765.0,2.0,0_1,21821_0,2253
524,524.0,57875.0,2.0,0_1,21871_0,2275
525,525.0,74418.0,2.0,0_1,21961_0,2329
526,526.0,74979.0,2.0,0_1,22331_0,2344
527,527.0,76234.0,2.0,0_1,22341_0,2333
528,528.0,72016.0,2.0,0_1,23121_0,2327
529,529.0,72453.0,2.0,0_1,22931_0,2290
530,530.0,66270.0,2.0,0_1,22751_0,2234
531,531.0,62118.0,2.0,0_1,22501_0,2208
532,532.0,65387.0,2.0,0_1,22271_0,2182
533,533.0,59439.0,2.0,0_1,21891_0,2166
534,534.0,58710.0,2.0,0_1,22101_0,2178
535,535.0,59563.0,2.0,0_1,22511_0,2190
536,536.0,63637.0,2.0,0_1,22661_0,2165
537,537.0,51451.0,2.0,0_1,22271_0,2130
538,538.0,54822.0,2.0,0_1,22111_0,2134
539,539.0,62842.0,2.0,0_1,21861_0,2125
540,540.0,70480.0,2.0,0_1,21571_0,2143
541,541.0,71204.0,2.0,0_1,21961_0,2176
542,542.0,73139.0,2.0,0_1,22121_0,2216
543,543.0,72708.0,2.0,0_1,21991_0,2214
544,544.0,67571.0,2.0,0_1,22141_0,2305
545,545.0,74580.0,2.0,0_1,22071_0,2294
546,546.0,67773.0,2.0,0_1,22151_0,2267
547,547.0,60337.0,2.0,0_1,22351_0,2213
548,548.0,67569.0,2.0,0_1,22551_0,2250
549,549.0,67302.0,2.0,0_1,22691_0,2272
550,550.0,72519.0,2.0,0_1,22871_0,2307
551,551.0,65160.0,2.0,0_1,23211_0,2358
552,552.0,75728.0,2.0,0_1,23471_0,2358
553,553.0,71947.0,2.0,0_1,23911_0,2399
554,554.0,68233.0,2.0,0_1,24001_0,2422
555,555.0,70448.0,2.0,0_1,24021_0,2411
556,556.0,72193.0,2.0,0_1,23731_0,2421
557,557.0,74022.0,2.0,0_1,23671_0,2423
558,558.0,74174.0,2.0,0_1,23801_0,2443
559,559.0,74570.0,2.0,0_1,23381_0,2379
560,560.0,63290.0,2.0,0_1,22731_0,2333
561,561.0,67117.0,2.0,0_1,23051_0,2334
562,562.0,72534.0,2.0,0_1,23691_0,2340
563,563.0,69267.0,2.0,0_1,23871_0,2360
564,564.0,68970.0,2.0,0_1,23441_0,2337
565,565.0,63734.0,2.0,0_1,22891_0,2270
566,566.0,61641.0,2.0,0_1,22911_0,2260
567,567.0,66147.0,2.0,0_1,22841_0,2264
568,568.0,67209.0,2.0,0_1,22831_0,2289
569,569.0,72694.0,2.0,0_1,23301_0,2308
570,570.0,67140.0,2.0,0_1,23411_0,2301
571,571.0,66278.0,2.0,0_1,23071_0,2250
572,572.0,70810.0,2.0,0_1,23251_0,2303
573,573.0,70513.0,2.0,0_1,23121_0,2345
574,574.0,63674.0,2.0,0_1,22941_0,2351
575,575.0,70306.0,2.0,0_1,23151_0,2313
576,576.0,67971.0,2.0,0_1,22961_0,2279
577,577.0,66716.0,2.0,0_1,22631_0,2279
578,578.0,68810.0,2.0,0_1,23061_0,2260
579,579.0,69906.0,2.0,0_1,23681_0,2266
580,580.0,75935.0,2.0,0_1,23601_0,2310
581,581.0,71719.0,2.0,0_1,23651_0,2329
582,582.0,79244.0,2.0,0_1,23601_0,2352
583,583.0,69464.0,2.0,0_1,23921_0,2415
584,584.0,76886.0,2.0,0_1,24431_0,2464
585,585.0,77208.0,2.0,0_1,24421_0,2508
586,586.0,75596.0,2.0,0_1,23831_0,2451
587,587.0,62945.0,2.0,0_1,23761_0,2372
588,588.0,70351.0,2.0,0_1,24271_0,2399
589,589.0,75496.0,2.0,0_1,24521_0,2418
590,590.0,73138.0,2.0,0_1,25541_0,2488
591,591.0,79218.0,2.0,0_1,25341_0,2452
592,592.0,70830.0,2.0,0_1,24771_0,2419
593,593.0,64424.0,2.0,0_1,25271_0,2439
594,594.0,76978.0,2.0,0_1,25241_0,2466
595,595.0,78933.0,2.0,0_1,25421_0,2497
596,596.0,84143.0,2.0,0_1,25811_0,2544
597,597.0,72918.0,2.0,0_1,25371_0,2569
598,598.0,84705.0,2.0,0_1,25401_0,2538
599,599.0,69499.0,2.0,0_1,24561_0,2498
600,600.0,61019.0,2.0,0_1,24481_0,2478
601,601.0,72888.0,2.0,0_1,23571_0,2421
602,602.0,74448.0,2.0,0_1,22941_0,2385
603,603.0,67664.0,2.0,0_1,22501_0,2311
604,604.0,72256.0,2.0,0_1,22431_0,2263
605,605.0,69833.0,2.0,0_1,22511_0,2299
606,606.0,65036.0,2.0,0_1,22971_0,2326
607,607.0,61937.0,2.0,0_1,22491_0,2336
608,608.0,58614.0,2.0,0_1,22481_0,2321
609,609.0,57756.0,2.0,0_1,22341_0,2328
610,610.0,58568.0,2.0,0_1,22101_0,2304
611,611.0,72151.0,2.0,0_1,22051_0,2364
612,612.0,73136.0,2.0,0_1,22511_0,2385
613,613.0,71247.0,2.0,0_1,22521_0,2363
614,614.0,66471.0,2.0,0_1,22251_0,2321
615,615.0,65137.0,2.0,0_1,22201_0,2284
616,616.0,61694.0,2.0,0_1,22241_0,2267
617,617.0,71553.0,2.0,0_1,22521_0,2273
618,618.0,60757.0,2.0,0_1,22531_0,2247
619,619.0,66461.0,2.0,0_1,22591_0,2205
620,620.0,69889.0,2.0,0_1,22481_0,2242
621,621.0,65663.0,2.0,0_1,22421_0,2202
622,622.0,58530.0,2.0,0_1,21811_0,2131
623,623.0,60828.0,2.0,0_1,21021_0,2054
624,624.0,59314.0,2.0,0_1,21041_0,2022
625,625.0,60071.0,2.0,0_1,21431_0,2023
626,626.0,62282.0,2.0,0_1,21271_0,2022
627,627.0,62926.0,2.0,0_1,21051_0,2087
628,628.0,66304.0,2.0,0_1,20981_0,2076
629,629.0,56545.0,2.0,0_1,20871_0,2126
630,630.0,61976.0,2.0,0_1,20761_0,2118
631,631.0,65862.0,2.0,0_1,20931_0,2167
632,632.0,71007.0,2.0,0_1,21141_0,2146
633,633.0,60040.0,2.0,0_1,20871_0,2120
634,634.0,63548.0,2.0,0_1,21871_0,2143
635,635.0,68784.0,2.0,0_1,21841_0,2116
636,636.0,62428.0,2.0,0_1,21871_0,2096
637,637.0,51477.0,2.0,0_1,22391_0,2057
638,638.0,64386.0,2.0,0_1,22531_0,2058
639,639.0,63286.0,2.0,0_1,22431_0,2082
640,640.0,63086.0,2.0,0_1,22011_0,2082
641,641.0,59073.0,2.0,0_1,21581_0,2088
642,642.0,62499.0,2.0,0_1,21861_0,2152
643,643.0,71771.0,2.0,0_1,21911_0,2184
644,644.0,75314.0,2.0,0_1,21791_0,2202
645,645.0,65463.0,2.0,0_1,21771_0,2243
646,646.0,71319.0,2.0,0_1,21611_0,2274
647,647.0,66955.0,2.0,0_1,22421_0,2278
648,648.0,69885.0,2.0,0_1,22691_0,2324
649,649.0,68335.0,2.0,0_1,22651_0,2317
650,650.0,67282.0,2.0,0_1,23301_0,2340
651,651.0,64791.0,2.0,0_1,23321_0,2346
652,652.0,66019.0,2.0,0_1,22701_0,2323
653,653.0,61913.0,2.0,0_1,22511_0,2252
654,654.0,63033.0,2.0,0_1,21831_0,2179
655,655.0,51139.0,2.0,0_1,21021_0,2082
656,656.0,57672.0,2.0,0_1,20611_0,2035
657,657.0,57753.0,2.0,0_1,20471_0,2048
658,658.0,59088.0,2.0,0_1,20471_0,2047
659,659.0,64271.0,2.0,0_1,20231_0,2038
660,660.0,65885.0,2.0,0_1,20551_0,2044
661,661.0,72962.0,2.0,0_1,20401_0,2064
662,662.0,60488.0,2.0,0_1,20251_0,2085
663,663.0,62350.0,2.0,0_1,20651_0,2123
664,664.0,69498.0,2.0,0_1,21041_0,2181
665,665.0,63001.0,2.0,0_1,21921_0,2255
666,666.0,80872.0,2.0,0_1,23001_0,2300
667,667.0,71311.0,2.0,0_1,23271_0,2324
668,668.0,72275.0,2.0,0_1,23191_0,2329
669,669.0,70849.0,2.0,0_1,23601_0,2370
670,670.0,72592.0,2.0,0_1,23921_0,2422
671,671.0,76301.0,2.0,0_1,24171_0,2465
672,672.0,75202.0,2.0,0_1,24241_0,2451
673,673.0,67222.0,2.0,0_1,24581_0,2493
674,674.0,67802.0,2.0,0_1,23741_0,2487
675,675.0,60377.0,2.0,0_1,23481_0,2477
676,676.0,72931.0,2.0,0_1,23401_0,2443
677,677.0,73199.0,2.0,0_1,23411_0,2448
678,678.0,73429.0,2.0,0_1,23361_0,2417
679,679.0,74583.0,2.0,0_1,23361_0,2402
680,680.0,64823.0,2.0,0_1,22691_0,2338
681,681.0,65958.0,2.0,0_1,22811_0,2315
682,682.0,68950.0,2.0,0_1,22161_0,2291
683,683.0,73591.0,2.0,0_1,22371_0,2327
684,684.0,79694.0,2.0,0_1,22811_0,2346
685,685.0,68384.0,2.0,0_1,23071_0,2383
686,686.0,74715.0,2.0,0_1,22851_0,2394
687,687.0,66391.0,2.0,0_1,22661_0,2441
688,688.0,67388.0,2.0,0_1,22641_0,2464
689,689.0,68101.0,2.0,0_1,22591_0,2456
690,690.0,70324.0,2.0,0_1,22541_0,2431
691,691.0,69910.0,2.0,0_1,22921_0,2418
692,692.0,71600.0,2.0,0_1,22921_0,2432
693,693.0,75485.0,2.0,0_1,22721_0,2366
694,694.0,70051.0,2.0,0_1,22951_0,2402
695,695.0,73137.0,2.0,0_1,23321_0,2429
696,696.0,74418.0,2.0,0_1,24021_0,2469
697,697.0,83484.0,2.0,0_1,24871_0,2538
698,698.0,77908.0,2.0,0_1,25241_0,2538
699,699.0,69313.0,2.0,0_1,25121_0,2544
700,700.0,70199.0,2.0,0_1,25091_0,2542
701,701.0,68987.0,2.0,0_1,24761_0,2481
702,702.0,68586.0,2.0,0_1,24441_0,2448
703,703.0,68429.0,2.0,0_1,24211_0,2440
704,704.0,74208.0,2.0,0_1,24031_0,2382
705,705.0,68323.0,2.0,0_1,23421_0,2327
706,706.0,63656.0,2.0,0_1,22961_0,2254
707,707.0,58012.0,2.0,0_1,22291_0,2203
708,708.0,65955.0,2.0,0_1,22101_0,2280
709,709.0,66206.0,2.0,0_1,22231_0,2303
710,710.0,68226.0,2.0,0_1,22211_0,2306
711,711.0,66226.0,2.0,0_1,22201_0,2292
712,712.0,66827.0,2.0,0_1,22651_0,2310
713,713.0,70343.0,2.0,0_1,22801_0,2347
714,714.0,73346.0,2.0,0_1,22651_0,2342
715,715.0,69445.0,2.0,0_1,22961_0,2350
716,716.0,64976.0,2.0,0_1,22671_0,2367
717,717.0,72575.0,2.0,0_1,22651_0,2330
718,718.0,62105.0,2.0,0_1,22221_0,2341
719,719.0,73515.0,2.0,0_1,22041_0,2280
720,720.0,68980.0,2.0,0_1,21631_0,2288
721,721.0,60700.0,2.0,0_1,21241_0,2261
722,722.0,59332.0,2.0,0_1,21281_0,2216
723,723.0,60951.0,2.0,0_1,20971_0,2234
724,724.0,64741.0,2.0,0_1,21131_0,2207
725,725.0,58251.0,2.0,0_1,21311_0,2189
726,726.0,64580.0,2.0,0_1,21721_0,2137
727,727.0,65838.0,2.0,0_1,22091_0,2180
728,728.0,68119.0,2.0,0_1,22191_0,2197
729,729.0,63999.0,2.0,0_1,22401_0,2218
730,730.0,71164.0,2.0,0_1,21881_0,2210
731,731.0,57579.0,2.0,0_1,21481_0,2177
732,732.0,73065.0,2.0,0_1,21361_0,2186
733,733.0,70364.0,2.0,0_1,21321_0,2185
734,734.0,57707.0,2.0,0_1,21231_0,2148
735,735.0,67109.0,2.0,0_1,21491_0,2175
736,736.0,76566.0,2.0,0_1,22591_0,2206
737,737.0,69248.0,2.0,0_1,23121_0,2262
738,738.0,75496.0,2.0,0_1,23231_0,2273
739,739.0,69686.0,2.0,0_1,23311_0,2289
740,740.0,67302.0,2.0,0_1,23531_0,2281
741,741.0,67011.0,2.0,0_1,23121_0,2292
742,742.0,63650.0,2.0,0_1,23101_0,2352
743,743.0,72361.0,2.0,0_1,22791_0,2315
744,744.0,57530.0,2.0,0_1,22421_0,2293
745,745.0,61187.0,2.0,0_1,22261_0,2281
746,746.0,72034.0,2.0,0_1,22531_0,2304
747,747.0,73079.0,2.0,0_1,22481_0,2302
748,748.0,66048.0,2.0,0_1,22471_0,2221
749,749.0,61007.0,2.0,0_1,22461_0,2256
750,750.0,69600.0,2.0,0_1,22691_0,2256
751,751.0,72034.0,2.0,0_1,22661_0,2313
752,752.0,75431.0,2.0,0_1,22551_0,2302
753,753.0,62648.0,2.0,0_1,22661_0,2310
754,754.0,70619.0,2.0,0_1,22911_0,2353
755,755.0,69390.0,2.0,0_1,23531_0,2357
756,756.0,78265.0,2.0,0_1,23431_0,2339
757,757.0,60630.0,2.0,0_1,23191_0,2297
758,758.0,64941.0,2.0,0_1,23371_0,2273
759,759.0,65207.0,2.0,0_1,23261_0,2275
760,760.0,67405.0,2.0,0_1,23571_0,2275
761,761.0,74405.0,2.0,0_1,23981_0,2306
762,762.0,67841.0,2.0,0_1,23681_0,2358
763,763.0,72891.0,2.0,0_1,23611_0,2388
764,764.0,75111.0,2.0,0_1,23871_0,2350
765,765.0,60042.0,2.0,0_1,23781_0,2381
766,766.0,75395.0,2.0,0_1,23931_0,2368
767,767.0,78851.0,2.0,0_1,23351_0,2352
768,768.0,67469.0,2.0,0_1,23661_0,2370
769,769.0,77890.0,2.0,0_1,23591_0,2371
770,770.0,70502.0,2.0,0_1,24221_0,2419
771,771.0,72195.0,2.0,0_1,24201_0,2428
772,772.0,61505.0,2.0,0_1,24231_0,2406
773,773.0,69501.0,2.0,0_1,23711_0,2378
774,774.0,69430.0,2.0,0_1,23381_0,2369
775,775.0,66746.0,2.0,0_1,22841_0,2363
776,776.0,70592.0,2.0,0_1,22721_0,2367
777,777.0,69486.0,2.0,0_1,23521_0,2445
778,778.0,80444.0,2.0,0_1,23761_0,2418
779,779.0,66048.0,2.0,0_1,24361_0,2409
780,780.0,74655.0,2.0,0_1,24491_0,2391
781,781.0,72718.0,2.0,0_1,24591_0,2379
782,782.0,69080.0,2.0,0_1,24751_0,2386
783,783.0,69300.0,2.0,0_1,24751_0,2415
784,784.0,75558.0,2.0,0_1,24421_0,2425
785,785.0,74167.0,2.0,0_1,24641_0,2411
786,786.0,72474.0,2.0,0_1,24241_0,2372
787,787.0,75430.0,2.0,0_1,25101_0,2392
788,788.0,92402.0,2.0,0_1,25611_0,2435
789,789.0,75211.0,2.0,0_1,25511_0,2485
790,790.0,71342.0,2.0,0_1,25471_0,2471
791,791.0,77285.0,2.0,0_1,25421_0,2449
792,792.0,71691.0,2.0,0_1,25191_0,2448
793,793.0,75284.0,2.0,0_1,25361_0,2459
794,794.0,75513.0,2.0,0_1,25541_0,2494
795,795.0,81712.0,2.0,0_1,25771_0,2541
796,796.0,78592.0,2.0,0_1,25551_0,2569
797,797.0,71053.0,2.0,0_1,25581_0,2559
798,798.0,77082.0,2.0,0_1,25501_0,2584
799,799.0,87069.0,2.0,0_1,25741_0,2584
800,800.0,93317.0,2.0,0_1,26181_0,2597
801,801.0,81518.0,2.0,0_1,26231_0,2640
802,802.0,76751.0,2.0,0_1,26791_0,2596
803,803.0,84478.0,2.0,0_1,27431_0,2650
804,804.0,89617.0,2.0,0_1,27821_0,2730
805,805.0,90362.0,2.0,0_1,28051_0,2782
806,806.0,88581.0,2.0,0_1,28461_0,2793
807,807.0,91673.0,2.0,0_1,28211_0,2743
808,808.0,80834.0,2.0,0_1,28371_0,2730
809,809.0,85911.0,2.0,0_1,28081_0,2761
810,810.0,82579.0,2.0,0_1,28931_0,2827
811,811.0,89876.0,2.0,0_1,29401_0,2867
812,812.0,80988.0,2.0,0_1,29101_0,2813
813,813.0,71571.0,2.0,0_1,28771_0,2789
814,814.0,69355.0,2.0,0_1,28731_0,2782
815,815.0,70747.0,2.0,0_1,28551_0,2744
816,816.0,84463.0,2.0,0_1,27901_0,2727
817,817.0,69330.0,2.0,0_1,27291_0,2671
818,818.0,69114.0,2.0,0_1,26681_0,2624
819,819.0,69037.0,2.0,0_1,26461_0,2563
820,820.0,67067.0,2.0,0_1,26231_0,2561
821,821.0,86772.0,2.0,0_1,25521_0,2591
822,822.0,73426.0,2.0,0_1,25441_0,2590
823,823.0,79079.0,2.0,0_1,25581_0,2578
824,824.0,80471.0,2.0,0_1,25751_0,2563
825,825.0,78575.0,2.0,0_1,25791_0,2577
826,826.0,75518.0,2.0,0_1,26321_0,2632
827,827.0,87878.0,2.0,0_1,26371_0,2652
828,828.0,85436.0,2.0,0_1,25851_0,2623
829,829.0,74936.0,2.0,0_1,26251_0,2642
830,830.0,79613.0,2.0,0_1,25791_0,2581
831,831.0,67962.0,2.0,0_1,25541_0,2608
832,832.0,80732.0,2.0,0_1,25131_0,2573
833,833.0,68077.0,2.0,0_1,25491_0,2581
834,834.0,85110.0,2.0,0_1,25951_0,2589
835,835.0,81596.0,2.0,0_1,26221_0,2597
836,836.0,85845.0,2.0,0_1,26311_0,2586
837,837.0,75401.0,2.0,0_1,26571_0,2623
838,838.0,75207.0,2.0,0_1,26501_0,2625
839,839.0,86432.0,2.0,0_1,26441_0,2639
840,840.0,80763.0,2.0,0_1,27011_0,2713
841,841.0,91248.0,2.0,0_1,27081_0,2746
842,842.0,75276.0,2.0,0_1,26901_0,2726
843,843.0,78503.0,2.0,0_1,26491_0,2689
844,844.0,62606.0,2.0,0_1,26661_0,2637
845,845.0,82677.0,2.0,0_1,26201_0,2580
846,846.0,72337.0,2.0,0_1,25891_0,2562
847,847.0,76260.0,2.0,0_1,25591_0,2564
848,848.0,68133.0,2.0,0_1,25791_0,2598
849,849.0,71288.0,2.0,0_1,26021_0,2564
850,850.0,67545.0,2.0,0_1,26241_0,2526
851,851.0,81985.0,2.0,0_1,25441_0,2517
852,852.0,84044.0,2.0,0_1,25121_0,2527
853,853.0,67619.0,2.0,0_1,24921_0,2539
854,854.0,77102.0,2.0,0_1,24851_0,2528
855,855.0,71976.0,2.0,0_1,24481_0,2505
856,856.0,70866.0,2.0,0_1,24611_0,2473
857,857.0,73571.0,2.0,0_1,25191_0,2482
858,858.0,71672.0,2.0,0_1,24671_0,2465
859,859.0,62053.0,2.0,0_1,24381_0,2454
860,860.0,74055.0,2.0,0_1,24271_0,2460
861,861.0,74038.0,2.0,0_1,24601_0,2443
862,862.0,75021.0,2.0,0_1,24641_0,2407
863,863.0,72235.0,2.0,0_1,24701_0,2371
864,864.0,71014.0,2.0,0_1,23951_0,2342
865,865.0,55514.0,2.0,0_1,23641_0,2334
866,866.0,68886.0,2.0,0_1,23191_0,2319
867,867.0,63978.0,2.0,0_1,23101_0,2270
868,868.0,65431.0,2.0,0_1,23241_0,2275
869,869.0,81942.0,2.0,0_1,23231_0,2273
870,870.0,71655.0,2.0,0_1,23381_0,2305
871,871.0,74337.0,2.0,0_1,23271_0,2323
872,872.0,66389.0,2.0,0_1,23221_0,2351
873,873.0,77116.0,2.0,0_1,23681_0,2345
874,874.0,66079.0,2.0,0_1,23891_0,2383
875,875.0,72842.0,2.0,0_1,23711_0,2373
876,876.0,66073.0,2.0,0_1,23801_0,2362
877,877.0,70940.0,2.0,0_1,24131_0,2350
878,878.0,80474.0,2.0,0_1,23801_0,2335
879,879.0,67335.0,2.0,0_1,23921_0,2323
880,880.0,78262.0,2.0,0_1,24041_0,2327
881,881.0,78142.0,2.0,0_1,24101_0,2328
882,882.0,72874.0,2.0,0_1,24451_0,2370
883,883.0,78983.0,2.0,0_1,24631_0,2435
884,884.0,74673.0,2.0,0_1,25071_0,2489
885,885.0,80988.0,2.0,0_1,25491_0,2528
886,886.0,76530.0,2.0,0_1,25361_0,2568
887,887.0,83777.0,2.0,0_1,25741_0,2632
888,888.0,73861.0,2.0,0_1,25981_0,2621
889,889.0,75463.0,2.0,0_1,26371_0,2649
890,890.0,76960.0,2.0,0_1,26371_0,2627
891,891.0,77743.0,2.0,0_1,25731_0,2536
892,892.0,64278.0,2.0,0_1,25551_0,2488
893,893.0,67414.0,2.0,0_1,25591_0,2483
894,894.0,84339.0,2.0,0_1,25861_0,2560
895,895.0,84665.0,2.0,0_1,25601_0,2537
896,896.0,77399.0,2.0,0_1,24901_0,2508
897,897.0,73975.0,2.0,0_1,24511_0,2496
898,898.0,82547.0,2.0,0_1,25981_0,2632
899,899.0,92028.0,2.0,0_1,26641_0,2702
900,900.0,82657.0,2.0,0_1,27401_0,2759
901,901.0,88835.0,2.0,0_1,27381_0,2780
902,902.0,82329.0,2.0,0_1,27291_0,2767
903,903.0,67890.0,2.0,0_1,27141_0,2700
904,904.0,69893.0,2.0,0_1,26621_0,2661
905,905.0,76294.0,2.0,0_1,26561_0,2698
906,906.0,79685.0,2.0,0_1,26841_0,2674
907,907.0,84744.0,2.0,0_1,27461_0,2696
908,908.0,78912.0,2.0,0_1,26521_0,2641
909,909.0,64937.0,2.0,0_1,26201_0,2597
910,910.0,73690.0,2.0,0_1,25841_0,2540
911,911.0,73750.0,2.0,0_1,25721_0,2562
912,912.0,79940.0,2.0,0_1,25971_0,2586
913,913.0,73704.0,2.0,0_1,25441_0,2571
914,914.0,68816.0,2.0,0_1,25561_0,2584
915,915.0,86680.0,2.0,0_1,25731_0,2591
916,916.0,74184.0,2.0,0_1,25591_0,2582
917,917.0,76973.0,2.0,0_1,25341_0,2576
918,918.0,78559.0,2.0,0_1,25441_0,2591
919,919.0,77118.0,2.0,0_1,25571_0,2587
920,920.0,80965.0,2.0,0_1,26011_0,2640
921,921.0,78214.0,2.0,0_1,26121_0,2629
922,922.0,79282.0,2.0,0_1,26631_0,2713
923,923.0,86948.0,2.0,0_1,27031_0,2773
924,924.0,83194.0,2.0,0_1,26891_0,2735
925,925.0,72331.0,2.0,0_1,27101_0,2753
926,926.0,82698.0,2.0,0_1,27041_0,2724
927,927.0,80816.0,2.0,0_1,27491_0,2792
928,928.0,90846.0,2.0,0_1,27361_0,2811
929,929.0,84113.0,2.0,0_1,27771_0,2801
930,930.0,80329.0,2.0,0_1,27951_0,2725
931,931.0,79328.0,2.0,0_1,27631_0,2736
932,932.0,59803.0,2.0,0_1,27321_0,2707
933,933.0,78600.0,2.0,0_1,27341_0,2670
934,934.0,76921.0,2.0,0_1,27021_0,2652
935,935.0,79180.0,2.0,0_1,26691_0,2637
936,936.0,85688.0,2.0,0_1,26531_0,2662
937,937.0,80747.0,2.0,0_1,26411_0,2692
938,938.0,78507.0,2.0,0_1,26291_0,2709
939,939.0,82729.0,2.0,0_1,26031_0,2722
940,940.0,84315.0,2.0,0_1,25841_0,2708
941,941.0,78694.0,2.0,0_1,26611_0,2762
942,942.0,92083.0,2.0,0_1,27071_0,2752
943,943.0,80024.0,2.0,0_1,27371_0,2696
944,944.0,81921.0,2.0,0_1,27161_0,2683
945,945.0,79122.0,2.0,0_1,27361_0,2718
946,946.0,79322.0,2.0,0_1,27911_0,2722
947,947.0,74492.0,2.0,0_1,28001_0,2659
948,948.0,71611.0,2.0,0_1,27331_0,2621
949,949.0,70324.0,2.0,0_1,26811_0,2653
950,950.0,79715.0,2.0,0_1,25831_0,2601
951,951.0,72647.0,2.0,0_1,25731_0,2574
952,952.0,82240.0,2.0,0_1,25481_0,2591
953,953.0,82549.0,2.0,0_1,25831_0,2623
954,954.0,81178.0,2.0,0_1,25571_0,2608
955,955.0,68575.0,2.0,0_1,25541_0,2583
956,956.0,70825.0,2.0,0_1,25611_0,2581
957,957.0,84137.0,2.0,0_1,26081_0,2590
958,958.0,87317.0,2.0,0_1,26281_0,2612
959,959.0,82405.0,2.0,0_1,26571_0,2663
960,960.0,76777.0,2.0,0_1,26441_0,2695
961,961.0,85084.0,2.0,0_1,26401_0,2648
962,962.0,84142.0,2.0,0_1,26411_0,2662
963,963.0,80307.0,2.0,0_1,25851_0,2656
964,964.0,65908.0,2.0,0_1,25731_0,2679
965,965.0,75738.0,2.0,0_1,25451_0,2671
966,966.0,73636.0,2.0,0_1,25271_0,2668
967,967.0,68907.0,2.0,0_1,25301_0,2608
968,968.0,71953.0,2.0,0_1,25551_0,2546
969,969.0,81901.0,2.0,0_1,25451_0,2493
970,970.0,73377.0,2.0,0_1,25531_0,2509
971,971.0,70444.0,2.0,0_1,25481_0,2483
972,972.0,69072.0,2.0,0_1,24811_0,2459
973,973.0,73045.0,2.0,0_1,24171_0,2462
974,974.0,67231.0,2.0,0_1,23471_0,2435
975,975.0,74309.0,2.0,0_1,23751_0,2423
976,976.0,74395.0,2.0,0_1,23881_0,2400
977,977.0,72341.0,2.0,0_1,23601_0,2388
978,978.0,68048.0,2.0,0_1,23371_0,2373
979,979.0,70816.0,2.0,0_1,23691_0,2387
980,980.0,78634.0,2.0,0_1,24461_0,2389
981,981.0,72317.0,2.0,0_1,24731_0,2417
982,982.0,79838.0,2.0,0_1,25111_0,2421
983,983.0,70447.0,2.0,0_1,24901_0,2423
984,984.0,73220.0,2.0,0_1,25211_0,2441
985,985.0,82533.0,2.0,0_1,25251_0,2455
986,986.0,75867.0,2.0,0_1,25681_0,2472
987,987.0,61976.0,2.0,0_1,25921_0,2466
988,988.0,78572.0,2.0,0_1,25451_0,2445
989,989.0,73322.0,2.0,0_1,25111_0,2442
990,990.0,69367.0,2.0,0_1,24541_0,2389
991,991.0,58000.0,2.0,0_1,24151_0,2376
992,992.0,66318.0,2.0,0_1,23181_0,2335
993,993.0,58450.0,2.0,0_1,22921_0,2269
994,994.0,70153.0,2.0,0_1,22641_0,2263
995,995.0,63144.0,2.0,0_1,22391_0,2253
996,996.0,72026.0,2.0,0_1,22321_0,2224
997,997.0,73304.0,2.0,0_1,22481_0,2246
998,998.0,65294.0,2.0,0_1,22071_0,2242
999,999.0,65420.0,2.0,0_1,21391_0,2204
