0,0.0,0.0,2.0,0_1,931_0,75
1,1.0,6275.0,2.0,0_1,1121_0,88
2,2.0,3062.0,2.0,0_1,981_0,81
3,3.0,2007.0,2.0,0_1,941_0,78
4,4.0,3485.0,2.0,0_1,951_0,83
5,5.0,4184.0,2.0,0_1,911_0,85
6,6.0,3150.0,2.0,0_1,991_0,94
7,7.0,5482.0,2.0,0_1,1011_0,94
8,8.0,4425.0,2.0,0_1,981_0,97
9,9.0,4152.0,2.0,0_1,1031_0,103
10,10.0,4627.0,2.0,0_1,1021_0,106
11,11.0,4298.0,2.0,0_1,1121_0,119
12,12.0,5530.0,2.0,0_1,1221_0,123
13,13.0,4743.0,2.0,0_1,1361_0,131
14,14.0,5839.0,2.0,0_1,1471_0,135
15,15.0,5298.0,2.0,0_1,1521_0,135
16,16.0,5357.0,2.0,0_1,1621_0,142
17,17.0,7138.0,2.0,0_1,1671_0,151
18,18.0,6327.0,2.0,0_1,1731_0,159
19,19.0,6218.0,2.0,0_1,1771_0,168
20,20.0,5995.0,2.0,0_1,1791_0,176
21,21.0,5775.0,2.0,0_1,1801_0,184
22,22.0,6824.0,2.0,0_1,1841_0,191
23,23.0,7146.0,2.0,0_1,1861_0,197
24,24.0,5507.0,2.0,0_1,1921_0,211
25,25.0,7386.0,2.0,0_1,2001_0,223
26,26.0,8670.0,2.0,0_1,2071_0,225
27,27.0,7111.0,2.0,0_1,2201_0,235
28,28.0,10811.0,2.0,0_1,2231_0,244
29,29.0,8311.0,2.0,0_1,2261_0,253
30,30.0,9418.0,2.0,0_1,2351_0,263
31,31.0,9189.0,2.0,0_1,2511_0,270
32,32.0,11265.0,2.0,0_1,2481_0,275
33,33.0,8677.0,2.0,0_1,2551_0,279
34,34.0,8482.0,2.0,0_1,2691_0,279
35,35.0,10581.0,2.0,0_1,2801_0,271
36,36.0,10058.0,2.0,0_1,2791_0,278
37,37.0,9560.0,2.0,0_1,2881_0,294
38,38.0,9301.0,2.0,0_1,2891_0,296
39,39.0,10409.0,2.0,0_1,2981_0,299
40,40.0,9272.0,2.0,0_1,3051_0,312
41,41.0,12599.0,2.0,0_1,3091_0,318
42,42.0,9583.0,2.0,0_1,3211_0,333
43,43.0,9065.0,2.0,0_1,3291_0,352
44,44.0,12316.0,2.0,0_1,3291_0,353
45,45.0,11670.0,2.0,0_1,3341_0,347
46,46.0,12448.0,2.0,0_1,3391_0,365
47,47.0,13320.0,2.0,0_1,3401_0,366
48,48.0,11480.0,2.0,0_1,3351_0,369
49,49.0,11332.0,2.0,0_1,3471_0,371
50,50.0,13052.0,2.0,0_1,3561_0,370
51,51.0,11574.0,2.0,0_1,3761_0,364
52,52.0,13895.0,2.0,0_1,3911_0,371
53,53.0,12799.0,2.0,0_1,4201_0,386
54,54.0,16592.0,2.0,0_1,4311_0,393
55,55.0,13776.0,2.0,0_1,4301_0,400
56,56.0,12722.0,2.0,0_1,4361_0,419
57,57.0,14506.0,2.0,0_1,4571_0,432
58,58.0,14926.0,2.0,0_1,4571_0,431
59,59.0,12496.0,2.0,0_1,4491_0,444
60,60.0,13284.0,2.0,0_1,4531_0,454
61,61.0,13558.0,2.0,0_1,4431_0,440
62,62.0,11958.0,2.0,0_1,4391_0,450
63,63.0,14817.0,2.0,0_1,4471_0,452
64,64.0,15314.0,2.0,0_1,4661_0,453
65,65.0,14529.0,2.0,0_1,4761_0,461
66,66.0,14603.0,2.0,0_1,4721_0,470
67,67.0,14212.0,2.0,0_1,4871_0,471
68,68.0,15735.0,2.0,0_1,4991_0,481
69,69.0,19347.0,2.0,0_1,5061_0,507
70,70.0,16506.0,2.0,0_1,5211_0,510
71,71.0,19527.0,2.0,0_1,5301_0,516
72,72.0,16464.0,2.0,0_1,5381_0,507
73,73.0,14888.0,2.0,0_1,5401_0,515
74,74.0,15910.0,2.0,0_1,5461_0,522
75,75.0,18608.0,2.0,0_1,5471_0,526
76,76.0,14740.0,2.0,0_1,5361_0,541
77,77.0,14931.0,2.0,0_1,5431_0,538
78,78.0,15126.0,2.0,0_1,5431_0,530
79,79.0,16756.0,2.0,0_1,5451_0,536
80,80.0,16561.0,2.0,0_1,5411_0,538
81,81.0,20039.0,2.0,0_1,5461_0,533
82,82.0,14271.0,2.0,0_1,5531_0,539
83,83.0,18707.0,2.0,0_1,5571_0,530
84,84.0,16686.0,2.0,0_1,5671_0,533
85,85.0,17248.0,2.0,0_1,5691_0,530
86,86.0,16340.0,2.0,0_1,5621_0,546
87,87.0,17799.0,2.0,0_1,5751_0,545
88,88.0,16469.0,2.0,0_1,5771_0,550
89,89.0,17470.0,2.0,0_1,5901_0,552
90,90.0,16530.0,2.0,0_1,5881_0,551
91,91.0,17280.0,2.0,0_1,5841_0,559
92,92.0,15861.0,2.0,0_1,5781_0,556
93,93.0,18760.0,2.0,0_1,5991_0,574
94,94.0,21232.0,2.0,0_1,6031_0,574
95,95.0,19175.0,2.0,0_1,6081_0,592
96,96.0,18767.0,2.0,0_1,5971_0,589
97,97.0,17297.0,2.0,0_1,5921_0,593
98,98.0,18257.0,2.0,0_1,5921_0,588
99,99.0,22298.0,2.0,0_1,6101_0,586
100,100.0,19301.0,2.0,0_1,6241_0,580
101,101.0,19076.0,2.0,0_1,6361_0,607
102,102.0,21701.0,2.0,0_1,6401_0,621
103,103.0,19276.0,2.0,0_1,6331_0,625
104,104.0,19966.0,2.0,0_1,6351_0,627
105,105.0,19606.0,2.0,0_1,6601_0,632
106,106.0,21260.0,2.0,0_1,6841_0,623
107,107.0,19791.0,2.0,0_1,7001_0,638
108,108.0,21744.0,2.0,0_1,6961_0,649
109,109.0,21062.0,2.0,0_1,7021_0,650
110,110.0,23787.0,2.0,0_1,7231_0,660
111,111.0,21326.0,2.0,0_1,7341_0,664
112,112.0,23218.0,2.0,0_1,7371_0,664
113,113.0,22603.0,2.0,0_1,7331_0,671
114,114.0,21340.0,2.0,0_1,7401_0,670
115,115.0,23110.0,2.0,0_1,7351_0,683
116,116.0,23912.0,2.0,0_1,7401_0,702
117,117.0,20719.0,2.0,0_1,7351_0,695
118,118.0,19231.0,2.0,0_1,7241_0,702
119,119.0,20913.0,2.0,0_1,7291_0,729
120,120.0,19379.0,2.0,0_1,7341_0,738
121,121.0,27163.0,2.0,0_1,7361_0,760
122,122.0,26504.0,2.0,0_1,7461_0,774
123,123.0,20912.0,2.0,0_1,7281_0,786
124,124.0,23725.0,2.0,0_1,7161_0,766
125,125.0,20783.0,2.0,0_1,7231_0,769
126,126.0,26270.0,2.0,0_1,7411_0,769
127,127.0,25100.0,2.0,0_1,7581_0,772
128,128.0,23211.0,2.0,0_1,7551_0,746
129,129.0,18267.0,2.0,0_1,7561_0,743
130,130.0,21410.0,2.0,0_1,7501_0,736
131,131.0,26631.0,2.0,0_1,7551_0,729
132,132.0,26128.0,2.0,0_1,7621_0,728
133,133.0,22347.0,2.0,0_1,7691_0,743
134,134.0,20840.0,2.0,0_1,7661_0,756
135,135.0,22037.0,2.0,0_1,7771_0,761
136,136.0,22937.0,2.0,0_1,7471_0,769
137,137.0,20738.0,2.0,0_1,7571_0,780
138,138.0,21318.0,2.0,0_1,7571_0,757
139,139.0,21739.0,2.0,0_1,7541_0,757
140,140.0,23805.0,2.0,0_1,7541_0,751
141,141.0,21569.0,2.0,0_1,7511_0,740
142,142.0,23880.0,2.0,0_1,7581_0,745
143,143.0,29219.0,2.0,0_1,7671_0,764
144,144.0,27724.0,2.0,0_1,7641_0,776
145,145.0,24788.0,2.0,0_1,7921_0,797
146,146.0,25337.0,2.0,0_1,8091_0,807
147,147.0,25858.0,2.0,0_1,8271_0,817
148,148.0,24500.0,2.0,0_1,8461_0,830
149,149.0,25607.0,2.0,0_1,8411_0,844
150,150.0,25261.0,2.0,0_1,8531_0,860
151,151.0,31110.0,2.0,0_1,8681_0,883
152,152.0,29065.0,2.0,0_1,8651_0,883
153,153.0,22627.0,2.0,0_1,8691_0,874
154,154.0,26395.0,2.0,0_1,8801_0,885
155,155.0,24705.0,2.0,0_1,8711_0,894
156,156.0,24040.0,2.0,0_1,8591_0,889
157,157.0,25733.0,2.0,0_1,8701_0,882
158,158.0,25810.0,2.0,0_1,8621_0,887
159,159.0,29763.0,2.0,0_1,8791_0,891
160,160.0,28712.0,2.0,0_1,8731_0,917
161,161.0,29838.0,2.0,0_1,8731_0,927
162,162.0,32200.0,2.0,0_1,8981_0,958
163,163.0,34715.0,2.0,0_1,9351_0,969
164,164.0,33889.0,2.0,0_1,9681_0,965
165,165.0,31045.0,2.0,0_1,9731_0,984
166,166.0,32565.0,2.0,0_1,9741_0,990
167,167.0,27753.0,2.0,0_1,9681_0,1006
168,168.0,29247.0,2.0,0_1,9661_0,1007
169,169.0,26502.0,2.0,0_1,9781_0,1016
170,170.0,29884.0,2.0,0_1,9771_0,1000
171,171.0,28939.0,2.0,0_1,10011_0,1006
172,172.0,27370.0,2.0,0_1,10061_0,1017
173,173.0,28111.0,2.0,0_1,9771_0,1021
174,174.0,29511.0,2.0,0_1,9681_0,994
175,175.0,27972.0,2.0,0_1,9741_0,991
176,176.0,26501.0,2.0,0_1,9661_0,989
177,177.0,24485.0,2.0,0_1,9541_0,999
178,178.0,30255.0,2.0,0_1,9591_0,1004
179,179.0,31355.0,2.0,0_1,9461_0,997
180,180.0,30735.0,2.0,0_1,9491_0,982
181,181.0,28997.0,2.0,0_1,9371_0,973
182,182.0,24768.0,2.0,0_1,9501_0,971
183,183.0,26321.0,2.0,0_1,9551_0,973
184,184.0,28695.0,2.0,0_1,9711_0,941
185,185.0,23569.0,2.0,0_1,9681_0,929
186,186.0,26662.0,2.0,0_1,9601_0,917
187,187.0,25606.0,2.0,0_1,9711_0,914
188,188.0,32565.0,2.0,0_1,9871_0,926
189,189.0,34493.0,2.0,0_1,9901_0,926
190,190.0,27841.0,2.0,0_1,9981_0,921
191,191.0,27650.0,2.0,0_1,10001_0,934
192,192.0,32660.0,2.0,0_1,9901_0,964
193,193.0,24622.0,2.0,0_1,9761_0,948
194,194.0,22991.0,2.0,0_1,9901_0,967
195,195.0,30836.0,2.0,0_1,9911_0,955
196,196.0,26722.0,2.0,0_1,9851_0,978
197,197.0,27795.0,2.0,0_1,9751_0,980
198,198.0,29878.0,2.0,0_1,9751_0,976
199,199.0,31229.0,2.0,0_1,10001_0,972
200,200.0,30443.0,2.0,0_1,10091_0,968
201,201.0,30758.0,2.0,0_1,10261_0,981
202,202.0,32467.0,2.0,0_1,10221_0,992
203,203.0,34012.0,2.0,0_1,10491_0,1017
204,204.0,33568.0,2.0,0_1,10811_0,1015
205,205.0,25120.0,2.0,0_1,10701_0,1030
206,206.0,34139.0,2.0,0_1,10971_0,1034
207,207.0,35873.0,2.0,0_1,10941_0,1041
208,208.0,31440.0,2.0,0_1,10891_0,1030
209,209.0,24817.0,2.0,0_1,10731_0,1027
210,210.0,31225.0,2.0,0_1,10781_0,1015
211,211.0,31042.0,2.0,0_1,10711_0,1024
212,212.0,30255.0,2.0,0_1,10801_0,1043
213,213.0,33827.0,2.0,0_1,10651_0,1042
214,214.0,31473.0,2.0,0_1,10681_0,1062
215,215.0,34479.0,2.0,0_1,10801_0,1053
216,216.0,29155.0,2.0,0_1,10811_0,1059
217,217.0,36909.0,2.0,0_1,11021_0,1062
218,218.0,31632.0,2.0,0_1,11071_0,1068
219,219.0,31482.0,2.0,0_1,10961_0,1093
220,220.0,29132.0,2.0,0_1,10741_0,1062
221,221.0,28187.0,2.0,0_1,10511_0,1032
222,222.0,28515.0,2.0,0_1,10681_0,1061
223,223.0,32019.0,2.0,0_1,10631_0,1091
224,224.0,30433.0,2.0,0_1,10641_0,1093
225,225.0,33542.0,2.0,0_1,10801_0,1106
226,226.0,38501.0,2.0,0_1,10991_0,1129
227,227.0,34487.0,2.0,0_1,11161_0,1133
228,228.0,34878.0,2.0,0_1,11241_0,1126
229,229.0,33341.0,2.0,0_1,11131_0,1113
230,230.0,32046.0,2.0,0_1,11401_0,1115
231,231.0,34658.0,2.0,0_1,11111_0,1109
232,232.0,34914.0,2.0,0_1,11221_0,1123
233,233.0,36381.0,2.0,0_1,11011_0,1111
234,234.0,35355.0,2.0,0_1,11031_0,1106
235,235.0,31867.0,2.0,0_1,11081_0,1097
236,236.0,36435.0,2.0,0_1,11251_0,1103
237,237.0,34535.0,2.0,0_1,11491_0,1109
238,238.0,37984.0,2.0,0_1,11881_0,1127
239,239.0,34238.0,2.0,0_1,11871_0,1122
240,240.0,28871.0,2.0,0_1,11991_0,1136
241,241.0,38818.0,2.0,0_1,11971_0,1133
242,242.0,30672.0,2.0,0_1,12011_0,1124
243,243.0,32533.0,2.0,0_1,11991_0,1182
244,244.0,37064.0,2.0,0_1,12211_0,1199
245,245.0,37249.0,2.0,0_1,12161_0,1232
246,246.0,34756.0,2.0,0_1,12111_0,1224
247,247.0,34626.0,2.0,0_1,12061_0,1227
248,248.0,38121.0,2.0,0_1,11991_0,1230
249,249.0,34559.0,2.0,0_1,11911_0,1252
250,250.0,39968.0,2.0,0_1,12041_0,1259
251,251.0,36266.0,2.0,0_1,12251_0,1282
252,252.0,39996.0,2.0,0_1,12351_0,1292
253,253.0,40325.0,2.0,0_1,12261_0,1292
254,254.0,35029.0,2.0,0_1,12521_0,1298
255,255.0,35034.0,2.0,0_1,12251_0,1273
256,256.0,35116.0,2.0,0_1,12491_0,1258
257,257.0,39591.0,2.0,0_1,12581_0,1246
258,258.0,40520.0,2.0,0_1,12511_0,1236
259,259.0,35640.0,2.0,0_1,12541_0,1240
260,260.0,35572.0,2.0,0_1,12561_0,1250
261,261.0,33199.0,2.0,0_1,12661_0,1253
262,262.0,37516.0,2.0,0_1,12561_0,1240
263,263.0,33893.0,2.0,0_1,12511_0,1223
264,264.0,34707.0,2.0,0_1,12661_0,1260
265,265.0,37000.0,2.0,0_1,12411_0,1274
266,266.0,36652.0,2.0,0_1,12301_0,1261
267,267.0,40813.0,2.0,0_1,12341_0,1274
268,268.0,40705.0,2.0,0_1,12361_0,1265
269,269.0,37016.0,2.0,0_1,12891_0,1294
270,270.0,42453.0,2.0,0_1,13061_0,1322
271,271.0,42476.0,2.0,0_1,12921_0,1354
272,272.0,35919.0,2.0,0_1,13081_0,1366
273,273.0,42693.0,2.0,0_1,13221_0,1359
274,274.0,44390.0,2.0,0_1,13201_0,1378
275,275.0,36429.0,2.0,0_1,13531_0,1391
276,276.0,48046.0,2.0,0_1,13481_0,1399
277,277.0,38350.0,2.0,0_1,13551_0,1414
278,278.0,47223.0,2.0,0_1,13581_0,1382
279,279.0,35984.0,2.0,0_1,13581_0,1345
280,280.0,38153.0,2.0,0_1,13741_0,1314
281,281.0,40708.0,2.0,0_1,13641_0,1300
282,282.0,41146.0,2.0,0_1,13681_0,1313
283,283.0,35348.0,2.0,0_1,13721_0,1300
284,284.0,40799.0,2.0,0_1,13831_0,1301
285,285.0,39360.0,2.0,0_1,13611_0,1304
286,286.0,38619.0,2.0,0_1,13601_0,1354
287,287.0,47095.0,2.0,0_1,13711_0,1367
288,288.0,45926.0,2.0,0_1,13731_0,1383
289,289.0,41756.0,2.0,0_1,13901_0,1391
290,290.0,41569.0,2.0,0_1,14131_0,1388
291,291.0,39754.0,2.0,0_1,14421_0,1420
292,292.0,42218.0,2.0,0_1,14501_0,1409
293,293.0,39882.0,2.0,0_1,14031_0,1393
294,294.0,33209.0,2.0,0_1,13921_0,1372
295,295.0,38620.0,2.0,0_1,13981_0,1359
296,296.0,46706.0,2.0,0_1,14161_0,1364
297,297.0,43592.0,2.0,0_1,14351_0,1388
298,298.0,50715.0,2.0,0_1,14581_0,1395
299,299.0,45922.0,2.0,0_1,14681_0,1395
300,300.0,45409.0,2.0,0_1,14761_0,1394
301,301.0,37286.0,2.0,0_1,14901_0,1405
302,302.0,43926.0,2.0,0_1,14851_0,1413
303,303.0,44551.0,2.0,0_1,15091_0,1475
304,304.0,49143.0,2.0,0_1,15251_0,1498
305,305.0,45398.0,2.0,0_1,15391_0,1510
306,306.0,42163.0,2.0,0_1,15271_0,1487
307,307.0,47341.0,2.0,0_1,15231_0,1511
308,308.0,41317.0,2.0,0_1,15181_0,1503
309,309.0,39502.0,2.0,0_1,14871_0,1487
310,310.0,40883.0,2.0,0_1,14861_0,1482
311,311.0,47381.0,2.0,0_1,14901_0,1447
312,312.0,44454.0,2.0,0_1,14941_0,1433
313,313.0,51089.0,2.0,0_1,15061_0,1437
314,314.0,42381.0,2.0,0_1,15111_0,1447
315,315.0,46821.0,2.0,0_1,15701_0,1520
316,316.0,48663.0,2.0,0_1,15761_0,1512
317,317.0,36082.0,2.0,0_1,15841_0,1521
318,318.0,44507.0,2.0,0_1,16081_0,1531
319,319.0,47204.0,2.0,0_1,16101_0,1516
320,320.0,48154.0,2.0,0_1,15801_0,1514
321,321.0,38766.0,2.0,0_1,15641_0,1529
322,322.0,49432.0,2.0,0_1,15841_0,1569
323,323.0,53984.0,2.0,0_1,15871_0,1588
324,324.0,48300.0,2.0,0_1,16021_0,1574
325,325.0,44215.0,2.0,0_1,15811_0,1536
326,326.0,46519.0,2.0,0_1,16231_0,1568
327,327.0,43236.0,2.0,0_1,15901_0,1542
328,328.0,45792.0,2.0,0_1,15901_0,1527
329,329.0,49366.0,2.0,0_1,15581_0,1521
330,330.0,41847.0,2.0,0_1,15241_0,1528
331,331.0,43509.0,2.0,0_1,15651_0,1545
332,332.0,48704.0,2.0,0_1,15811_0,1556
333,333.0,44509.0,2.0,0_1,16251_0,1592
334,334.0,52068.0,2.0,0_1,16171_0,1588
335,335.0,44926.0,2.0,0_1,15651_0,1532
336,336.0,39405.0,2.0,0_1,15501_0,1542
337,337.0,46262.0,2.0,0_1,15501_0,1539
338,338.0,44547.0,2.0,0_1,15721_0,1551
339,339.0,46350.0,2.0,0_1,15811_0,1567
340,340.0,51240.0,2.0,0_1,16091_0,1592
341,341.0,50790.0,2.0,0_1,16631_0,1644
342,342.0,54696.0,2.0,0_1,16311_0,1643
343,343.0,45785.0,2.0,0_1,16161_0,1611
344,344.0,46550.0,2.0,0_1,16131_0,1553
345,345.0,42453.0,2.0,0_1,16291_0,1582
346,346.0,55542.0,2.0,0_1,16401_0,1605
347,347.0,48653.0,2.0,0_1,17091_0,1682
348,348.0,54591.0,2.0,0_1,17271_0,1713
349,349.0,51490.0,2.0,0_1,17451_0,1726
350,350.0,49966.0,2.0,0_1,17541_0,1715
351,351.0,56613.0,2.0,0_1,17681_0,1669
352,352.0,48692.0,2.0,0_1,17881_0,1680
353,353.0,51654.0,2.0,0_1,17861_0,1720
354,354.0,48787.0,2.0,0_1,17771_0,1728
355,355.0,55516.0,2.0,0_1,17891_0,1778
356,356.0,63375.0,2.0,0_1,18201_0,1788
357,357.0,58559.0,2.0,0_1,18031_0,1745
358,358.0,46021.0,2.0,0_1,17831_0,1720
359,359.0,54914.0,2.0,0_1,18311_0,1777
360,360.0,57847.0,2.0,0_1,18441_0,1830
361,361.0,56997.0,2.0,0_1,18521_0,1867
362,362.0,61444.0,2.0,0_1,18521_0,1871
363,363.0,58736.0,2.0,0_1,18591_0,1844
364,364.0,57461.0,2.0,0_1,18531_0,1855
365,365.0,47930.0,2.0,0_1,17921_0,1826
366,366.0,43260.0,2.0,0_1,17811_0,1824
367,367.0,38168.0,2.0,0_1,17701_0,1810
368,368.0,48617.0,2.0,0_1,17271_0,1793
369,369.0,51350.0,2.0,0_1,17341_0,1781
370,370.0,46716.0,2.0,0_1,17341_0,1756
371,371.0,49486.0,2.0,0_1,17611_0,1770
372,372.0,53781.0,2.0,0_1,17791_0,1757
373,373.0,46558.0,2.0,0_1,18051_0,1760
374,374.0,52890.0,2.0,0_1,18081_0,1733
375,375.0,47097.0,2.0,0_1,17701_0,1684
376,376.0,47160.0,2.0,0_1,17571_0,1655
377,377.0,56063.0,2.0,0_1,17081_0,1645
378,378.0,49192.0,2.0,0_1,16791_0,1639
379,379.0,45256.0,2.0,0_1,16841_0,1657
380,380.0,46330.0,2.0,0_1,16841_0,1636
381,381.0,50750.0,2.0,0_1,16331_0,1571
382,382.0,46269.0,2.0,0_1,16731_0,1614
383,383.0,51939.0,2.0,0_1,16621_0,1607
384,384.0,45138.0,2.0,0_1,16571_0,1612
385,385.0,46218.0,2.0,0_1,16641_0,1628
386,386.0,56937.0,2.0,0_1,16621_0,1652
387,387.0,48280.0,2.0,0_1,16631_0,1656
388,388.0,54874.0,2.0,0_1,16591_0,1632
389,389.0,42868.0,2.0,0_1,16341_0,1595
390,390.0,49997.0,2.0,0_1,17201_0,1671
391,391.0,56826.0,2.0,0_1,17531_0,1721
392,392.0,52968.0,2.0,0_1,17731_0,1702
393,393.0,54406.0,2.0,0_1,17701_0,1719
394,394.0,42443.0,2.0,0_1,17431_0,1683
395,395.0,46819.0,2.0,0_1,17091_0,1699
396,396.0,43769.0,2.0,0_1,16711_0,1711
397,397.0,49798.0,2.0,0_1,16331_0,1700
398,398.0,45031.0,2.0,0_1,15901_0,1661
399,399.0,47051.0,2.0,0_1,15801_0,1653
400,400.0,46293.0,2.0,0_1,15891_0,1658
401,401.0,50120.0,2.0,0_1,15881_0,1632
402,402.0,58479.0,2.0,0_1,16251_0,1625
403,403.0,58213.0,2.0,0_1,16531_0,1665
404,404.0,60096.0,2.0,0_1,17051_0,1707
405,405.0,60448.0,2.0,0_1,17211_0,1706
406,406.0,52433.0,2.0,0_1,17401_0,1749
407,407.0,55115.0,2.0,0_1,17841_0,1741
408,408.0,65308.0,2.0,0_1,18041_0,1721
409,409.0,64232.0,2.0,0_1,18291_0,1767
410,410.0,61208.0,2.0,0_1,18471_0,1776
411,411.0,55211.0,2.0,0_1,18641_0,1795
412,412.0,51001.0,2.0,0_1,18321_0,1800
413,413.0,54622.0,2.0,0_1,18581_0,1838
414,414.0,60391.0,2.0,0_1,18611_0,1846
415,415.0,62012.0,2.0,0_1,18741_0,1872
416,416.0,70047.0,2.0,0_1,19011_0,1947
417,417.0,77854.0,2.0,0_1,19711_0,1987
418,418.0,71673.0,2.0,0_1,20341_0,2036
419,419.0,70182.0,2.0,0_1,20431_0,2065
420,420.0,64689.0,2.0,0_1,20221_0,2048
421,421.0,67399.0,2.0,0_1,20321_0,2094
422,422.0,71380.0,2.0,0_1,20191_0,2086
423,423.0,69032.0,2.0,0_1,20691_0,2129
424,424.0,78631.0,2.0,0_1,21161_0,2162
425,425.0,74624.0,2.0,0_1,21351_0,2187
426,426.0,79515.0,2.0,0_1,21751_0,2194
427,427.0,72866.0,2.0,0_1,22301_0,2242
428,428.0,79343.0,2.0,0_1,22711_0,2278
429,429.0,78283.0,2.0,0_1,22871_0,2292
430,430.0,82070.0,2.0,0_1,22851_0,2294
431,431.0,77710.0,2.0,0_1,23401_0,2351
432,432.0,80614.0,2.0,0_1,23341_0,2349
433,433.0,79876.0,2.0,0_1,23751_0,2370
434,434.0,89703.0,2.0,0_1,24101_0,2399
435,435.0,77665.0,2.0,0_1,24331_0,2450
436,436.0,86969.0,2.0,0_1,24591_0,2492
437,437.0,86032.0,2.0,0_1,24921_0,2510
438,438.0,86567.0,2.0,0_1,25011_0,2522
439,439.0,79739.0,2.0,0_1,25341_0,2589
440,440.0,86080.0,2.0,0_1,25621_0,2599
441,441.0,88441.0,2.0,0_1,25581_0,2584
442,442.0,84943.0,2.0,0_1,25921_0,2617
443,443.0,90074.0,2.0,0_1,26161_0,2670
444,444.0,83471.0,2.0,0_1,26291_0,2679
445,445.0,84746.0,2.0,0_1,26521_0,2710
446,446.0,97422.0,2.0,0_1,27051_0,2746
447,447.0,95478.0,2.0,0_1,27851_0,2784
448,448.0,98356.0,2.0,0_1,28241_0,2810
449,449.0,99202.0,2.0,0_1,28591_0,2862
450,450.0,101055.0,2.0,0_1,29181_0,2876
451,451.0,96842.0,2.0,0_1,28851_0,2943
452,452.0,97818.0,2.0,0_1,29321_0,2969
453,453.0,97384.0,2.0,0_1,29641_0,3001
454,454.0,105846.0,2.0,0_1,30091_0,3017
455,455.0,90018.0,2.0,0_1,30131_0,3024
456,456.0,104863.0,2.0,0_1,30381_0,3071
457,457.0,108888.0,2.0,0_1,30511_0,3119
458,458.0,105836.0,2.0,0_1,30831_0,3136
459,459.0,100550.0,2.0,0_1,31181_0,3173
460,460.0,108139.0,2.0,0_1,31781_0,3176
461,461.0,90378.0,2.0,0_1,31971_0,3192
462,462.0,110569.0,2.0,0_1,31961_0,3216
463,463.0,115241.0,2.0,0_1,32401_0,3223
464,464.0,104680.0,2.0,0_1,32241_0,3280
465,465.0,103781.0,2.0,0_1,32681_0,3282
466,466.0,105456.0,2.0,0_1,32631_0,3300
467,467.0,105092.0,2.0,0_1,33291_0,3310
468,468.0,114103.0,2.0,0_1,33401_0,3313
469,469.0,110534.0,2.0,0_1,33281_0,3338
470,470.0,104423.0,2.0,0_1,33341_0,3370
471,471.0,114116.0,2.0,0_1,33181_0,3397
472,472.0,112343.0,2.0,0_1,33251_0,3413
473,473.0,113641.0,2.0,0_1,33841_0,3421
474,474.0,118973.0,2.0,0_1,33901_0,3456
475,475.0,111044.0,2.0,0_1,33921_0,3451
476,476.0,106834.0,2.0,0_1,34171_0,3468
477,477.0,122418.0,2.0,0_1,34651_0,3528
478,478.0,124016.0,2.0,0_1,35421_0,3574
479,479.0,134752.0,2.0,0_1,35991_0,3615
480,480.0,115834.0,2.0,0_1,36101_0,3623
481,481.0,130994.0,2.0,0_1,36691_0,3658
482,482.0,133258.0,2.0,0_1,37181_0,3644
483,483.0,102711.0,2.0,0_1,37541_0,3650
484,484.0,120162.0,2.0,0_1,37731_0,3594
485,485.0,100652.0,2.0,0_1,37541_0,3567
486,486.0,114837.0,2.0,0_1,37081_0,3541
487,487.0,103021.0,2.0,0_1,36731_0,3499
488,488.0,106614.0,2.0,0_1,36841_0,3532
489,489.0,124556.0,2.0,0_1,37171_0,3594
490,490.0,126342.0,2.0,0_1,37101_0,3630
491,491.0,118609.0,2.0,0_1,37091_0,3617
492,492.0,112573.0,2.0,0_1,37741_0,3659
493,493.0,119862.0,2.0,0_1,37411_0,3671
494,494.0,117436.0,2.0,0_1,37741_0,3719
495,495.0,126043.0,2.0,0_1,37521_0,3766
496,496.0,124335.0,2.0,0_1,36941_0,3717
497,497.0,113982.0,2.0,0_1,36801_0,3742
498,498.0,128261.0,2.0,0_1,36941_0,3748
499,499.0,137802.0,2.0,0_1,37231_0,3700
500,500.0,119788.0,2.0,0_1,37351_0,3677
501,501.0,99098.0,2.0,0_1,37501_0,3753
502,502.0,115460.0,2.0,0_1,37401_0,3775
503,503.0,109041.0,2.0,0_1,36881_0,3808
504,504.0,103867.0,2.0,0_1,36641_0,3788
505,505.0,99596.0,2.0,0_1,36461_0,3729
506,506.0,101881.0,2.0,0_1,36161_0,3638
507,507.0,79430.0,2.0,0_1,35801_0,3574
508,508.0,99307.0,2.0,0_1,35021_0,3515
509,509.0,101457.0,2.0,0_1,34721_0,3457
510,510.0,98905.0,2.0,0_1,34371_0,3405
511,511.0,86422.0,2.0,0_1,35091_0,3435
512,512.0,92913.0,2.0,0_1,35411_0,3465
513,513.0,106518.0,2.0,0_1,35431_0,3415
514,514.0,94592.0,2.0,0_1,35201_0,3379
515,515.0,101875.0,2.0,0_1,34911_0,3410
516,516.0,114484.0,2.0,0_1,34151_0,3399
517,517.0,85079.0,2.0,0_1,33691_0,3391
518,518.0,99563.0,2.0,0_1,32981_0,3352
519,519.0,102513.0,2.0,0_1,33211_0,3365
520,520.0,100019.0,2.0,0_1,33071_0,3341
521,521.0,99331.0,2.0,0_1,32661_0,3364
522,522.0,92180.0,2.0,0_1,32981_0,3376
523,523.0,93959.0,2.0,0_1,32881_0,3330
524,524.0,91129.0,2.0,0_1,32451_0,3256
525,525.0,81959.0,2.0,0_1,31371_0,3158
526,526.0,75846.0,2.0,0_1,31291_0,3129
527,527.0,101740.0,2.0,0_1,31381_0,3097
528,528.0,103595.0,2.0,0_1,31791_0,3077
529,529.0,94501.0,2.0,0_1,31841_0,3034
530,530.0,91347.0,2.0,0_1,32851_0,3055
531,531.0,97824.0,2.0,0_1,32451_0,3052
532,532.0,94478.0,2.0,0_1,32621_0,3070
533,533.0,97102.0,2.0,0_1,32621_0,3134
534,534.0,101037.0,2.0,0_1,32451_0,3167
535,535.0,84526.0,2.0,0_1,32201_0,3203
536,536.0,92319.0,2.0,0_1,31001_0,3124
537,537.0,70283.0,2.0,0_1,30541_0,3026
538,538.0,84833.0,2.0,0_1,30061_0,3049
539,539.0,77700.0,2.0,0_1,30091_0,3027
540,540.0,85510.0,2.0,0_1,29591_0,2948
541,541.0,92764.0,2.0,0_1,29501_0,2916
542,542.0,86358.0,2.0,0_1,28981_0,2931
543,543.0,80104.0,2.0,0_1,28101_0,2913
544,544.0,83217.0,2.0,0_1,28581_0,2955
545,545.0,87703.0,2.0,0_1,28651_0,2942
546,546.0,86498.0,2.0,0_1,28421_0,2899
547,547.0,76434.0,2.0,0_1,28271_0,2887
548,548.0,93894.0,2.0,0_1,28761_0,2890
549,549.0,85062.0,2.0,0_1,28511_0,2905
550,550.0,97523.0,2.0,0_1,28801_0,2919
551,551.0,79950.0,2.0,0_1,28681_0,2901
552,552.0,73279.0,2.0,0_1,28411_0,2873
553,553.0,86152.0,2.0,0_1,28791_0,2909
554,554.0,97745.0,2.0,0_1,28731_0,2900
555,555.0,86129.0,2.0,0_1,28771_0,2868
556,556.0,78714.0,2.0,0_1,28651_0,2818
557,557.0,73189.0,2.0,0_1,28031_0,2753
558,558.0,73360.0,2.0,0_1,27421_0,2701
559,559.0,68892.0,2.0,0_1,27431_0,2721
560,560.0,90922.0,2.0,0_1,27481_0,2739
561,561.0,89329.0,2.0,0_1,28311_0,2756
562,562.0,93324.0,2.0,0_1,28331_0,2758
563,563.0,85673.0,2.0,0_1,28351_0,2759
564,564.0,76674.0,2.0,0_1,28081_0,2750
565,565.0,78256.0,2.0,0_1,28391_0,2716
566,566.0,101883.0,2.0,0_1,28931_0,2790
567,567.0,96133.0,2.0,0_1,29741_0,2880
568,568.0,89894.0,2.0,0_1,29481_0,2937
569,569.0,87551.0,2.0,0_1,29921_0,2967
570,570.0,96278.0,2.0,0_1,30521_0,3004
571,571.0,93475.0,2.0,0_1,30111_0,2965
572,572.0,83925.0,2.0,0_1,30011_0,3000
573,573.0,79062.0,2.0,0_1,30301_0,3039
574,574.0,88939.0,2.0,0_1,30511_0,2998
575,575.0,91054.0,2.0,0_1,30291_0,2990
576,576.0,89324.0,2.0,0_1,30111_0,2986
577,577.0,92542.0,2.0,0_1,30211_0,2997
578,578.0,83933.0,2.0,0_1,30031_0,3006
579,579.0,97731.0,2.0,0_1,30261_0,3005
580,580.0,99367.0,2.0,0_1,30751_0,3027
581,581.0,101618.0,2.0,0_1,31641_0,3077
582,582.0,108729.0,2.0,0_1,32031_0,3082
583,583.0,106201.0,2.0,0_1,33081_0,3082
584,584.0,98267.0,2.0,0_1,32911_0,3122
585,585.0,78096.0,2.0,0_1,33071_0,3125
586,586.0,91447.0,2.0,0_1,33141_0,3119
587,587.0,104628.0,2.0,0_1,33281_0,3160
588,588.0,89766.0,2.0,0_1,32881_0,3179
589,589.0,92583.0,2.0,0_1,32861_0,3168
590,590.0,102964.0,2.0,0_1,33261_0,3207
591,591.0,99328.0,2.0,0_1,32791_0,3206
592,592.0,91428.0,2.0,0_1,33171_0,3226
593,593.0,92986.0,2.0,0_1,32291_0,3145
594,594.0,92023.0,2.0,0_1,31611_0,3098
595,595.0,85052.0,2.0,0_1,31811_0,3088
596,596.0,98082.0,2.0,0_1,31431_0,3057
597,597.0,92867.0,2.0,0_1,30641_0,3000
598,598.0,78869.0,2.0,0_1,30301_0,2976
599,599.0,94301.0,2.0,0_1,29771_0,2902
600,600.0,88331.0,2.0,0_1,30021_0,2974
601,601.0,96970.0,2.0,0_1,29831_0,2993
602,602.0,77191.0,2.0,0_1,30561_0,3038
603,603.0,93174.0,2.0,0_1,31551_0,3122
604,604.0,105553.0,2.0,0_1,32431_0,3254
605,605.0,110376.0,2.0,0_1,32921_0,3312
606,606.0,99366.0,2.0,0_1,33371_0,3355
607,607.0,90488.0,2.0,0_1,32751_0,3304
608,608.0,90561.0,2.0,0_1,32151_0,3227
609,609.0,87632.0,2.0,0_1,31771_0,3164
610,610.0,85385.0,2.0,0_1,31321_0,3120
611,611.0,91658.0,2.0,0_1,30581_0,3030
612,612.0,88696.0,2.0,0_1,29791_0,2936
613,613.0,88725.0,2.0,0_1,29391_0,2909
614,614.0,81600.0,2.0,0_1,28911_0,2897
615,615.0,84374.0,2.0,0_1,28991_0,2904
616,616.0,83066.0,2.0,0_1,28731_0,2914
617,617.0,81636.0,2.0,0_1,28401_0,2873
618,618.0,74541.0,2.0,0_1,28201_0,2840
619,619.0,82258.0,2.0,0_1,28411_0,2837
620,620.0,79776.0,2.0,0_1,28621_0,2776
621,621.0,91014.0,2.0,0_1,29421_0,2837
622,622.0,90565.0,2.0,0_1,30021_0,2851
623,623.0,83183.0,2.0,0_1,30271_0,2927
624,624.0,101018.0,2.0,0_1,30421_0,2915
625,625.0,87990.0,2.0,0_1,30461_0,2956
626,626.0,97877.0,2.0,0_1,30571_0,3007
627,627.0,93464.0,2.0,0_1,30961_0,3040
628,628.0,84227.0,2.0,0_1,30851_0,3035
629,629.0,93395.0,2.0,0_1,30981_0,2989
630,630.0,74164.0,2.0,0_1,30201_0,2970
631,631.0,81020.0,2.0,0_1,29391_0,2890
632,632.0,66632.0,2.0,0_1,27921_0,2753
633,633.0,55705.0,2.0,0_1,26841_0,2675
634,634.0,62906.0,2.0,0_1,25651_0,2591
635,635.0,65476.0,2.0,0_1,24721_0,2584
636,636.0,75739.0,2.0,0_1,23631_0,2507
637,637.0,68322.0,2.0,0_1,23311_0,2475
638,638.0,79431.0,2.0,0_1,23691_0,2492
639,639.0,89148.0,2.0,0_1,23791_0,2534
640,640.0,67857.0,2.0,0_1,23531_0,2544
641,641.0,74159.0,2.0,0_1,24221_0,2583
642,642.0,85567.0,2.0,0_1,24661_0,2573
643,643.0,76398.0,2.0,0_1,25011_0,2620
644,644.0,84937.0,2.0,0_1,25401_0,2597
645,645.0,79699.0,2.0,0_1,25811_0,2575
646,646.0,76755.0,2.0,0_1,26591_0,2608
647,647.0,84025.0,2.0,0_1,26791_0,2620
648,648.0,77921.0,2.0,0_1,27601_0,2696
649,649.0,84620.0,2.0,0_1,27881_0,2732
650,650.0,77651.0,2.0,0_1,27931_0,2790
651,651.0,91453.0,2.0,0_1,28311_0,2796
652,652.0,90502.0,2.0,0_1,28561_0,2827
653,653.0,90326.0,2.0,0_1,28981_0,2834
654,654.0,88110.0,2.0,0_1,29191_0,2851
655,655.0,88464.0,2.0,0_1,29401_0,2821
656,656.0,74806.0,2.0,0_1,29361_0,2797
657,657.0,84776.0,2.0,0_1,29261_0,2795
658,658.0,84888.0,2.0,0_1,29141_0,2833
659,659.0,81557.0,2.0,0_1,28621_0,2789
660,660.0,69849.0,2.0,0_1,28121_0,2730
661,661.0,72994.0,2.0,0_1,27911_0,2680
662,662.0,76249.0,2.0,0_1,27081_0,2609
663,663.0,55219.0,2.0,0_1,26671_0,2542
664,664.0,74992.0,2.0,0_1,26561_0,2480
665,665.0,80397.0,2.0,0_1,26151_0,2515
666,666.0,78285.0,2.0,0_1,25741_0,2466
667,667.0,71908.0,2.0,0_1,25721_0,2488
668,668.0,78938.0,2.0,0_1,25871_0,2579
669,669.0,79726.0,2.0,0_1,25311_0,2524
670,670.0,68800.0,2.0,0_1,25511_0,2544
671,671.0,84580.0,2.0,0_1,25971_0,2626
672,672.0,78632.0,2.0,0_1,25641_0,2651
673,673.0,79761.0,2.0,0_1,25361_0,2665
674,674.0,84850.0,2.0,0_1,25471_0,2612
675,675.0,78243.0,2.0,0_1,25511_0,2642
676,676.0,84652.0,2.0,0_1,26381_0,2718
677,677.0,90161.0,2.0,0_1,27091_0,2752
678,678.0,83419.0,2.0,0_1,27181_0,2791
679,679.0,92881.0,2.0,0_1,27571_0,2765
680,680.0,75720.0,2.0,0_1,26801_0,2693
681,681.0,68909.0,2.0,0_1,27321_0,2773
682,682.0,81577.0,2.0,0_1,27791_0,2757
683,683.0,75505.0,2.0,0_1,28141_0,2804
684,684.0,73161.0,2.0,0_1,27621_0,2802
685,685.0,88270.0,2.0,0_1,27751_0,2773
686,686.0,77552.0,2.0,0_1,27521_0,2769
687,687.0,89659.0,2.0,0_1,27261_0,2762
688,688.0,80360.0,2.0,0_1,26981_0,2780
689,689.0,72585.0,2.0,0_1,27121_0,2778
690,690.0,89451.0,2.0,0_1,27321_0,2803
691,691.0,85930.0,2.0,0_1,28131_0,2830
692,692.0,96666.0,2.0,0_1,28881_0,2878
693,693.0,100232.0,2.0,0_1,28831_0,2829
694,694.0,83442.0,2.0,0_1,29191_0,2886
695,695.0,89183.0,2.0,0_1,29811_0,2917
696,696.0,91195.0,2.0,0_1,30411_0,2956
697,697.0,94586.0,2.0,0_1,30081_0,2926
698,698.0,76461.0,2.0,0_1,29921_0,2902
699,699.0,80398.0,2.0,0_1,29371_0,2881
700,700.0,83789.0,2.0,0_1,28421_0,2842
701,701.0,82592.0,2.0,0_1,28231_0,2761
702,702.0,80388.0,2.0,0_1,28851_0,2804
703,703.0,91698.0,2.0,0_1,29701_0,2876
704,704.0,98079.0,2.0,0_1,30071_0,2893
705,705.0,91804.0,2.0,0_1,29751_0,2969
706,706.0,98433.0,2.0,0_1,30421_0,3023
707,707.0,84897.0,2.0,0_1,29931_0,3028
708,708.0,83676.0,2.0,0_1,29641_0,3042
709,709.0,85415.0,2.0,0_1,29271_0,3037
710,710.0,81988.0,2.0,0_1,29711_0,3027
711,711.0,82964.0,2.0,0_1,29561_0,3026
712,712.0,87836.0,2.0,0_1,29871_0,3042
713,713.0,83425.0,2.0,0_1,29931_0,3050
714,714.0,84714.0,2.0,0_1,29741_0,2993
715,715.0,76170.0,2.0,0_1,28961_0,2888
716,716.0,86072.0,2.0,0_1,27901_0,2810
717,717.0,82062.0,2.0,0_1,28101_0,2813
718,718.0,77668.0,2.0,0_1,28381_0,2809
719,719.0,79534.0,2.0,0_1,27761_0,2722
720,720.0,69591.0,2.0,0_1,27001_0,2660
721,721.0,85673.0,2.0,0_1,27611_0,2714
722,722.0,87518.0,2.0,0_1,27671_0,2706
723,723.0,80354.0,2.0,0_1,27201_0,2672
724,724.0,76997.0,2.0,0_1,26751_0,2630
725,725.0,75683.0,2.0,0_1,26521_0,2624
726,726.0,76444.0,2.0,0_1,26601_0,2634
727,727.0,85246.0,2.0,0_1,26881_0,2649
728,728.0,80637.0,2.0,0_1,26591_0,2610
729,729.0,82514.0,2.0,0_1,26431_0,2605
730,730.0,82647.0,2.0,0_1,26611_0,2611
731,731.0,81920.0,2.0,0_1,26421_0,2619
732,732.0,66176.0,2.0,0_1,26451_0,2638
733,733.0,70880.0,2.0,0_1,27001_0,2707
734,734.0,96775.0,2.0,0_1,27291_0,2741
735,735.0,90148.0,2.0,0_1,27701_0,2726
736,736.0,79940.0,2.0,0_1,27861_0,2746
737,737.0,83359.0,2.0,0_1,27881_0,2731
738,738.0,83929.0,2.0,0_1,27991_0,2719
739,739.0,79397.0,2.0,0_1,28231_0,2790
740,740.0,87019.0,2.0,0_1,28421_0,2830
741,741.0,90651.0,2.0,0_1,28441_0,2920
742,742.0,93345.0,2.0,0_1,28561_0,2879
743,743.0,92354.0,2.0,0_1,29591_0,2944
744,744.0,88184.0,2.0,0_1,29541_0,2897
745,745.0,86876.0,2.0,0_1,29531_0,2923
746,746.0,87295.0,2.0,0_1,29661_0,2937
747,747.0,91423.0,2.0,0_1,30161_0,2954
748,748.0,91019.0,2.0,0_1,30201_0,2946
749,749.0,83249.0,2.0,0_1,30071_0,2931
750,750.0,98290.0,2.0,0_1,30431_0,2998
751,751.0,96263.0,2.0,0_1,30681_0,3023
752,752.0,83579.0,2.0,0_1,30571_0,3064
753,753.0,87879.0,2.0,0_1,30701_0,3077
754,754.0,97956.0,2.0,0_1,30781_0,3120
755,755.0,100216.0,2.0,0_1,30951_0,3161
756,756.0,95818.0,2.0,0_1,30941_0,3147
757,757.0,93763.0,2.0,0_1,30651_0,3127
758,758.0,84275.0,2.0,0_1,30321_0,3036
759,759.0,76569.0,2.0,0_1,29481_0,2991
760,760.0,75316.0,2.0,0_1,29191_0,2928
761,761.0,81005.0,2.0,0_1,29661_0,2930
762,762.0,83267.0,2.0,0_1,29581_0,2909
763,763.0,97505.0,2.0,0_1,29141_0,2844
764,764.0,79163.0,2.0,0_1,29331_0,2885
765,765.0,84379.0,2.0,0_1,29031_0,2906
766,766.0,86095.0,2.0,0_1,28461_0,2912
767,767.0,82260.0,2.0,0_1,28611_0,2906
768,768.0,94668.0,2.0,0_1,28331_0,2912
769,769.0,89270.0,2.0,0_1,27991_0,2932
770,770.0,88211.0,2.0,0_1,28301_0,2969
771,771.0,94931.0,2.0,0_1,28641_0,3015
772,772.0,92594.0,2.0,0_1,29171_0,3035
773,773.0,92581.0,2.0,0_1,29351_0,3047
774,774.0,98091.0,2.0,0_1,30121_0,3086
775,775.0,87654.0,2.0,0_1,30751_0,3103
776,776.0,92557.0,2.0,0_1,31091_0,3135
777,777.0,102229.0,2.0,0_1,31241_0,3113
778,778.0,91422.0,2.0,0_1,30841_0,3046
779,779.0,81402.0,2.0,0_1,31671_0,3061
780,780.0,110665.0,2.0,0_1,32261_0,3135
781,781.0,92738.0,2.0,0_1,32221_0,3168
782,782.0,90908.0,2.0,0_1,32391_0,3154
783,783.0,84187.0,2.0,0_1,31501_0,3173
784,784.0,89597.0,2.0,0_1,30341_0,3081
785,785.0,83292.0,2.0,0_1,30171_0,3114
786,786.0,89093.0,2.0,0_1,30351_0,3097
787,787.0,91271.0,2.0,0_1,29981_0,3108
788,788.0,93165.0,2.0,0_1,29861_0,3117
789,789.0,86251.0,2.0,0_1,29731_0,3137
790,790.0,93871.0,2.0,0_1,30191_0,3082
791,791.0,91062.0,2.0,0_1,30851_0,3087
792,792.0,98331.0,2.0,0_1,30881_0,3070
793,793.0,91578.0,2.0,0_1,30941_0,3049
794,794.0,90783.0,2.0,0_1,30831_0,3079
795,795.0,93782.0,2.0,0_1,30481_0,3099
796,796.0,80123.0,2.0,0_1,29941_0,3109
797,797.0,96076.0,2.0,0_1,29701_0,3101
798,798.0,92846.0,2.0,0_1,29471_0,3102
799,799.0,91932.0,2.0,0_1,29451_0,3071
800,800.0,80230.0,2.0,0_1,30101_0,3128
801,801.0,87896.0,2.0,0_1,30071_0,3127
802,802.0,98732.0,2.0,0_1,30331_0,3132
803,803.0,97231.0,2.0,0_1,29981_0,3130
804,804.0,76025.0,2.0,0_1,30421_0,3096
805,805.0,92349.0,2.0,0_1,30371_0,3025
806,806.0,88950.0,2.0,0_1,30751_0,3042
807,807.0,100875.0,2.0,0_1,31321_0,3072
808,808.0,93186.0,2.0,0_1,31591_0,3069
809,809.0,89934.0,2.0,0_1,31191_0,3077
810,810.0,96930.0,2.0,0_1,30501_0,2994
811,811.0,88401.0,2.0,0_1,30671_0,2983
812,812.0,87776.0,2.0,0_1,30291_0,3022
813,813.0,79234.0,2.0,0_1,30191_0,3021
814,814.0,70607.0,2.0,0_1,29861_0,2964
815,815.0,84749.0,2.0,0_1,29131_0,2914
816,816.0,72820.0,2.0,0_1,27861_0,2829
817,817.0,80150.0,2.0,0_1,27751_0,2829
818,818.0,78495.0,2.0,0_1,27751_0,2772
819,819.0,75910.0,2.0,0_1,27241_0,2714
820,820.0,74571.0,2.0,0_1,27221_0,2731
821,821.0,88451.0,2.0,0_1,27071_0,2786
822,822.0,81131.0,2.0,0_1,27481_0,2803
823,823.0,92131.0,2.0,0_1,27721_0,2862
824,824.0,88786.0,2.0,0_1,28381_0,2896
825,825.0,89561.0,2.0,0_1,28741_0,2916
826,826.0,84759.0,2.0,0_1,28151_0,2908
827,827.0,85529.0,2.0,0_1,28111_0,2853
828,828.0,70853.0,2.0,0_1,27971_0,2830
829,829.0,83827.0,2.0,0_1,27721_0,2783
830,830.0,74176.0,2.0,0_1,27481_0,2800
831,831.0,89575.0,2.0,0_1,27841_0,2861
832,832.0,95578.0,2.0,0_1,28111_0,2922
833,833.0,98664.0,2.0,0_1,28621_0,2960
834,834.0,86270.0,2.0,0_1,28971_0,2898
835,835.0,79904.0,2.0,0_1,28911_0,2924
836,836.0,93932.0,2.0,0_1,28681_0,2925
837,837.0,97943.0,2.0,0_1,29241_0,2972
838,838.0,87302.0,2.0,0_1,29741_0,2979
839,839.0,93082.0,2.0,0_1,29951_0,3046
840,840.0,87743.0,2.0,0_1,30331_0,3080
841,841.0,100040.0,2.0,0_1,30801_0,3122
842,842.0,102194.0,2.0,0_1,31431_0,3134
843,843.0,87769.0,2.0,0_1,31121_0,3102
844,844.0,86960.0,2.0,0_1,31261_0,3060
845,845.0,94355.0,2.0,0_1,31551_0,3085
846,846.0,96053.0,2.0,0_1,31241_0,3088
847,847.0,91875.0,2.0,0_1,31481_0,3099
848,848.0,93264.0,2.0,0_1,31511_0,3118
849,849.0,97079.0,2.0,0_1,31411_0,3096
850,850.0,101617.0,2.0,0_1,31341_0,3104
851,851.0,98304.0,2.0,0_1,31511_0,3192
852,852.0,94920.0,2.0,0_1,31571_0,3165
853,853.0,90224.0,2.0,0_1,31281_0,3195
854,854.0,94796.0,2.0,0_1,31821_0,3233
855,855.0,97465.0,2.0,0_1,32541_0,3252
856,856.0,100392.0,2.0,0_1,32691_0,3323
857,857.0,89760.0,2.0,0_1,32911_0,3350
858,858.0,94783.0,2.0,0_1,32951_0,3383
859,859.0,107814.0,2.0,0_1,32251_0,3327
860,860.0,91457.0,2.0,0_1,32601_0,3365
861,861.0,107767.0,2.0,0_1,33061_0,3419
862,862.0,103967.0,2.0,0_1,32721_0,3373
863,863.0,92199.0,2.0,0_1,32931_0,3400
864,864.0,107793.0,2.0,0_1,33171_0,3373
865,865.0,95111.0,2.0,0_1,32841_0,3233
866,866.0,87978.0,2.0,0_1,32691_0,3257
867,867.0,102786.0,2.0,0_1,32961_0,3277
868,868.0,99002.0,2.0,0_1,33351_0,3265
869,869.0,87380.0,2.0,0_1,33361_0,3255
870,870.0,101495.0,2.0,0_1,32461_0,3217
871,871.0,84771.0,2.0,0_1,33071_0,3244
872,872.0,103600.0,2.0,0_1,33341_0,3300
873,873.0,103771.0,2.0,0_1,33631_0,3357
874,874.0,106986.0,2.0,0_1,34211_0,3348
875,875.0,94829.0,2.0,0_1,33391_0,3264
876,876.0,91735.0,2.0,0_1,33171_0,3223
877,877.0,80881.0,2.0,0_1,31951_0,3146
878,878.0,92471.0,2.0,0_1,31901_0,3140
879,879.0,97678.0,2.0,0_1,31661_0,3138
880,880.0,85188.0,2.0,0_1,31871_0,3202
881,881.0,102262.0,2.0,0_1,32211_0,3225
882,882.0,98503.0,2.0,0_1,32351_0,3215
883,883.0,102790.0,2.0,0_1,31561_0,3177
884,884.0,82069.0,2.0,0_1,31221_0,3165
885,885.0,94809.0,2.0,0_1,30841_0,3131
886,886.0,92977.0,2.0,0_1,31421_0,3102
887,887.0,101649.0,2.0,0_1,31451_0,3085
888,888.0,90229.0,2.0,0_1,30831_0,3042
889,889.0,88133.0,2.0,0_1,30621_0,3018
890,890.0,90451.0,2.0,0_1,30201_0,2974
891,891.0,79451.0,2.0,0_1,30111_0,3049
892,892.0,94516.0,2.0,0_1,30731_0,3071
893,893.0,93816.0,2.0,0_1,30671_0,3101
894,894.0,90544.0,2.0,0_1,31641_0,3157
895,895.0,106230.0,2.0,0_1,32121_0,3164
896,896.0,94317.0,2.0,0_1,32121_0,3126
897,897.0,90929.0,2.0,0_1,32231_0,3148
898,898.0,86086.0,2.0,0_1,32551_0,3135
899,899.0,90604.0,2.0,0_1,32211_0,3161
900,900.0,88596.0,2.0,0_1,31851_0,3067
901,901.0,91976.0,2.0,0_1,31871_0,3028
902,902.0,91507.0,2.0,0_1,31641_0,3047
903,903.0,90780.0,2.0,0_1,31401_0,2996
904,904.0,81116.0,2.0,0_1,30321_0,2895
905,905.0,83195.0,2.0,0_1,29881_0,2871
906,906.0,90449.0,2.0,0_1,29501_0,2880
907,907.0,86544.0,2.0,0_1,28941_0,2799
908,908.0,83416.0,2.0,0_1,28831_0,2826
909,909.0,87436.0,2.0,0_1,29071_0,2821
910,910.0,80899.0,2.0,0_1,29601_0,2881
911,911.0,88709.0,2.0,0_1,29581_0,2878
912,912.0,81821.0,2.0,0_1,30021_0,2923
913,913.0,83456.0,2.0,0_1,29481_0,2891
914,914.0,81466.0,2.0,0_1,29291_0,2856
915,915.0,88379.0,2.0,0_1,29731_0,2790
916,916.0,95318.0,2.0,0_1,29681_0,2845
917,917.0,88781.0,2.0,0_1,29421_0,2822
918,918.0,85206.0,2.0,0_1,29591_0,2852
919,919.0,88221.0,2.0,0_1,29601_0,2939
920,920.0,84221.0,2.0,0_1,29711_0,2958
921,921.0,79984.0,2.0,0_1,29371_0,2924
922,922.0,86956.0,2.0,0_1,29421_0,2950
923,923.0,87141.0,2.0,0_1,28991_0,2897
924,924.0,82984.0,2.0,0_1,29181_0,2888
925,925.0,97304.0,2.0,0_1,29001_0,2897
926,926.0,90279.0,2.0,0_1,28851_0,2911
927,927.0,87821.0,2.0,0_1,28101_0,2942
928,928.0,92130.0,2.0,0_1,28541_0,2966
929,929.0,90522.0,2.0,0_1,29041_0,3027
930,930.0,95052.0,2.0,0_1,29661_0,3072
931,931.0,95724.0,2.0,0_1,30221_0,3114
932,932.0,89210.0,2.0,0_1,30381_0,3111
933,933.0,92857.0,2.0,0_1,30591_0,3162
934,934.0,93452.0,2.0,0_1,30601_0,3161
935,935.0,97692.0,2.0,0_1,30651_0,3170
936,936.0,80916.0,2.0,0_1,30171_0,3103
937,937.0,72941.0,2.0,0_1,29801_0,3086
938,938.0,83760.0,2.0,0_1,29331_0,3109
939,939.0,88717.0,2.0,0_1,28341_0,3007
940,940.0,74135.0,2.0,0_1,27471_0,2925
941,941.0,73640.0,2.0,0_1,26961_0,2867
942,942.0,83248.0,2.0,0_1,26731_0,2820
943,943.0,68088.0,2.0,0_1,26441_0,2751
944,944.0,84183.0,2.0,0_1,26111_0,2699
945,945.0,77167.0,2.0,0_1,25701_0,2639
946,946.0,75178.0,2.0,0_1,25021_0,2605
947,947.0,67270.0,2.0,0_1,24861_0,2568
948,948.0,84040.0,2.0,0_1,24491_0,2561
949,949.0,71022.0,2.0,0_1,24651_0,2524
950,950.0,65986.0,2.0,0_1,24961_0,2528
951,951.0,77315.0,2.0,0_1,25301_0,2539
952,952.0,78619.0,2.0,0_1,25611_0,2485
953,953.0,72229.0,2.0,0_1,25681_0,2462
954,954.0,68795.0,2.0,0_1,25891_0,2463
955,955.0,81196.0,2.0,0_1,26291_0,2524
956,956.0,77380.0,2.0,0_1,25901_0,2542
957,957.0,70185.0,2.0,0_1,26111_0,2504
958,958.0,69031.0,2.0,0_1,26271_0,2443
959,959.0,78406.0,2.0,0_1,26431_0,2470
960,960.0,82574.0,2.0,0_1,26331_0,2516
961,961.0,71938.0,2.0,0_1,25911_0,2487
962,962.0,73857.0,2.0,0_1,25821_0,2469
963,963.0,72245.0,2.0,0_1,25801_0,2474
964,964.0,80931.0,2.0,0_1,25521_0,2474
965,965.0,76618.0,2.0,0_1,25361_0,2520
966,966.0,72285.0,2.0,0_1,25821_0,2509
967,967.0,78907.0,2.0,0_1,25751_0,2478
968,968.0,73964.0,2.0,0_1,25681_0,2502
969,969.0,81925.0,2.0,0_1,25321_0,2537
970,970.0,78423.0,2.0,0_1,25821_0,2539
971,971.0,79167.0,2.0,0_1,25951_0,2549
972,972.0,75756.0,2.0,0_1,26081_0,2555
973,973.0,83075.0,2.0,0_1,25871_0,2600
974,974.0,83450.0,2.0,0_1,26731_0,2688
975,975.0,83199.0,2.0,0_1,26871_0,2702
976,976.0,80419.0,2.0,0_1,27471_0,2748
977,977.0,89577.0,2.0,0_1,27621_0,2811
978,978.0,85336.0,2.0,0_1,28031_0,2813
979,979.0,81452.0,2.0,0_1,28761_0,2824
980,980.0,83149.0,2.0,0_1,27971_0,2834
981,981.0,70676.0,2.0,0_1,27161_0,2817
982,982.0,75825.0,2.0,0_1,27041_0,2832
983,983.0,78655.0,2.0,0_1,26901_0,2761
984,984.0,86522.0,2.0,0_1,26931_0,2760
985,985.0,90784.0,2.0,0_1,27591_0,2738
986,986.0,80589.0,2.0,0_1,27541_0,2724
987,987.0,80680.0,2.0,0_1,27431_0,2714
988,988.0,83627.0,2.0,0_1,27621_0,2746
989,989.0,81744.0,2.0,0_1,27421_0,2738
990,990.0,74390.0,2.0,0_1,27181_0,2709
991,991.0,75003.0,2.0,0_1,26671_0,2667
992,992.0,77603.0,2.0,0_1,27281_0,2677
993,993.0,77133.0,2.0,0_1,27011_0,2646
994,994.0,82691.0,2.0,0_1,27181_0,2675
995,995.0,81954.0,2.0,0_1,27251_0,2688
996,996.0,89382.0,2.0,0_1,27551_0,2729
997,997.0,91995.0,2.0,0_1,27411_0,2781
998,998.0,78589.0,2.0,0_1,28001_0,2778
999,999.0,92747.0,2.0,0_1,28121_0,2769
