0.0,0.0
7784.0,1.0
5998.0,2.0
5746.0,3.0
4726.0,4.0
5439.0,5.0
6831.0,6.0
5992.0,7.0
5317.0,8.0
5829.0,9.0
7655.0,10.0
7329.0,11.0
8628.0,12.0
6951.0,13.0
7888.0,14.0
8482.0,15.0
8194.0,16.0
10743.0,17.0
9471.0,18.0
12716.0,19.0
10367.0,20.0
13568.0,21.0
10311.0,22.0
11945.0,23.0
13447.0,24.0
11652.0,25.0
15603.0,26.0
13462.0,27.0
14724.0,28.0
15169.0,29.0
16916.0,30.0
14980.0,31.0
16276.0,32.0
16188.0,33.0
15401.0,34.0
21620.0,35.0
23135.0,36.0
17766.0,37.0
17733.0,38.0
15539.0,39.0
9266.0,40.0
9037.0,41.0
8842.0,42.0
12589.0,43.0
11715.0,44.0
14705.0,45.0
12013.0,46.0
13300.0,47.0
14563.0,48.0
13812.0,49.0
9827.0,50.0
13404.0,51.0
11438.0,52.0
14647.0,53.0
12950.0,54.0
15312.0,55.0
14384.0,56.0
14727.0,57.0
18037.0,58.0
13949.0,59.0
15966.0,60.0
15752.0,61.0
14321.0,62.0
11804.0,63.0
10786.0,64.0
10813.0,65.0
14968.0,66.0
17833.0,67.0
12400.0,68.0
12034.0,69.0
12723.0,70.0
12579.0,71.0
15516.0,72.0
16503.0,73.0
16465.0,74.0
17674.0,75.0
19229.0,76.0
16206.0,77.0
14907.0,78.0
14597.0,79.0
16970.0,80.0
16033.0,81.0
15654.0,82.0
14718.0,83.0
19883.0,84.0
13538.0,85.0
15380.0,86.0
13815.0,87.0
16139.0,88.0
17739.0,89.0
17826.0,90.0
14912.0,91.0
15381.0,92.0
17412.0,93.0
16200.0,94.0
21230.0,95.0
15596.0,96.0
14708.0,97.0
16006.0,98.0
15450.0,99.0
13918.0,100.0
16197.0,101.0
15655.0,102.0
17228.0,103.0
15362.0,104.0
15958.0,105.0
16081.0,106.0
16249.0,107.0
15569.0,108.0
17596.0,109.0
14683.0,110.0
14369.0,111.0
17692.0,112.0
15065.0,113.0
17622.0,114.0
17089.0,115.0
13724.0,116.0
10238.0,117.0
14377.0,118.0
13727.0,119.0
13420.0,120.0
14275.0,121.0
15226.0,122.0
15800.0,123.0
13733.0,124.0
14897.0,125.0
12269.0,126.0
16341.0,127.0
16551.0,128.0
14533.0,129.0
12079.0,130.0
11333.0,131.0
15362.0,132.0
15492.0,133.0
13844.0,134.0
17702.0,135.0
15505.0,136.0
17320.0,137.0
16315.0,138.0
19319.0,139.0
19669.0,140.0
19911.0,141.0
18049.0,142.0
16775.0,143.0
16357.0,144.0
20104.0,145.0
21136.0,146.0
17829.0,147.0
18096.0,148.0
19149.0,149.0
21379.0,150.0
19205.0,151.0
17336.0,152.0
17200.0,153.0
16621.0,154.0
18022.0,155.0
19339.0,156.0
17836.0,157.0
19945.0,158.0
18040.0,159.0
15091.0,160.0
18863.0,161.0
17112.0,162.0
15696.0,163.0
21499.0,164.0
18225.0,165.0
16801.0,166.0
23648.0,167.0
19975.0,168.0
21221.0,169.0
20081.0,170.0
16297.0,171.0
21581.0,172.0
21619.0,173.0
21277.0,174.0
19883.0,175.0
21315.0,176.0
18499.0,177.0
21047.0,178.0
20561.0,179.0
21989.0,180.0
18723.0,181.0
20004.0,182.0
18675.0,183.0
18107.0,184.0
20031.0,185.0
21565.0,186.0
19022.0,187.0
19718.0,188.0
24960.0,189.0
22462.0,190.0
19224.0,191.0
24739.0,192.0
22030.0,193.0
19957.0,194.0
24466.0,195.0
24273.0,196.0
22711.0,197.0
25904.0,198.0
25609.0,199.0
24348.0,200.0
23446.0,201.0
20381.0,202.0
21330.0,203.0
21668.0,204.0
23892.0,205.0
19158.0,206.0
21069.0,207.0
24332.0,208.0
26702.0,209.0
27838.0,210.0
27200.0,211.0
26497.0,212.0
24447.0,213.0
24568.0,214.0
28681.0,215.0
27738.0,216.0
23086.0,217.0
20326.0,218.0
26864.0,219.0
26940.0,220.0
26802.0,221.0
25301.0,222.0
29795.0,223.0
28823.0,224.0
24294.0,225.0
28670.0,226.0
27929.0,227.0
29744.0,228.0
26224.0,229.0
26950.0,230.0
21061.0,231.0
28982.0,232.0
25566.0,233.0
26190.0,234.0
28160.0,235.0
30135.0,236.0
25615.0,237.0
24492.0,238.0
28531.0,239.0
25345.0,240.0
23608.0,241.0
23683.0,242.0
26440.0,243.0
31053.0,244.0
30473.0,245.0
23799.0,246.0
25310.0,247.0
28397.0,248.0
21160.0,249.0
27172.0,250.0
28814.0,251.0
38043.0,252.0
27454.0,253.0
30511.0,254.0
26780.0,255.0
33184.0,256.0
25802.0,257.0
30441.0,258.0
28606.0,259.0
30219.0,260.0
28764.0,261.0
26203.0,262.0
28702.0,263.0
27252.0,264.0
27173.0,265.0
28938.0,266.0
30197.0,267.0
32035.0,268.0
36601.0,269.0
29514.0,270.0
35538.0,271.0
31650.0,272.0
27462.0,273.0
32778.0,274.0
30241.0,275.0
28817.0,276.0
30938.0,277.0
32288.0,278.0
29649.0,279.0
33301.0,280.0
33279.0,281.0
30029.0,282.0
27855.0,283.0
27821.0,284.0
26876.0,285.0
31542.0,286.0
29669.0,287.0
31998.0,288.0
31407.0,289.0
32462.0,290.0
29922.0,291.0
32227.0,292.0
33032.0,293.0
33234.0,294.0
31325.0,295.0
33517.0,296.0
29488.0,297.0
25122.0,298.0
28831.0,299.0
32829.0,300.0
31867.0,301.0
28241.0,302.0
28095.0,303.0
31503.0,304.0
33019.0,305.0
29333.0,306.0
31299.0,307.0
28273.0,308.0
37576.0,309.0
35653.0,310.0
35193.0,311.0
32514.0,312.0
33369.0,313.0
27863.0,314.0
33610.0,315.0
37944.0,316.0
38545.0,317.0
32739.0,318.0
35635.0,319.0
35234.0,320.0
34920.0,321.0
29374.0,322.0
35322.0,323.0
40853.0,324.0
39102.0,325.0
34474.0,326.0
41172.0,327.0
35711.0,328.0
32884.0,329.0
37296.0,330.0
39247.0,331.0
36200.0,332.0
32919.0,333.0
36575.0,334.0
35300.0,335.0
39660.0,336.0
35069.0,337.0
38250.0,338.0
37156.0,339.0
37032.0,340.0
34967.0,341.0
36429.0,342.0
34070.0,343.0
42755.0,344.0
39599.0,345.0
38209.0,346.0
37447.0,347.0
37662.0,348.0
38978.0,349.0
30328.0,350.0
35449.0,351.0
34222.0,352.0
35771.0,353.0
37730.0,354.0
41968.0,355.0
44059.0,356.0
40702.0,357.0
41101.0,358.0
34249.0,359.0
41197.0,360.0
40028.0,361.0
39429.0,362.0
36818.0,363.0
39355.0,364.0
41872.0,365.0
37969.0,366.0
45064.0,367.0
34864.0,368.0
44486.0,369.0
39989.0,370.0
36714.0,371.0
38947.0,372.0
39854.0,373.0
42764.0,374.0
39756.0,375.0
40491.0,376.0
36706.0,377.0
39066.0,378.0
45972.0,379.0
43298.0,380.0
43694.0,381.0
42096.0,382.0
39726.0,383.0
39009.0,384.0
38299.0,385.0
49306.0,386.0
42234.0,387.0
38285.0,388.0
44284.0,389.0
38356.0,390.0
44981.0,391.0
38799.0,392.0
38414.0,393.0
40360.0,394.0
42948.0,395.0
39189.0,396.0
44382.0,397.0
45354.0,398.0
44091.0,399.0
38269.0,400.0
41488.0,401.0
38326.0,402.0
34610.0,403.0
34441.0,404.0
40932.0,405.0
48908.0,406.0
45157.0,407.0
44377.0,408.0
42586.0,409.0
47791.0,410.0
41119.0,411.0
43105.0,412.0
55975.0,413.0
42506.0,414.0
45223.0,415.0
41776.0,416.0
43177.0,417.0
45047.0,418.0
47731.0,419.0
50357.0,420.0
43758.0,421.0
45252.0,422.0
53935.0,423.0
42384.0,424.0
40455.0,425.0
47302.0,426.0
41524.0,427.0
39866.0,428.0
51549.0,429.0
45249.0,430.0
46108.0,431.0
45781.0,432.0
33768.0,433.0
38291.0,434.0
46963.0,435.0
36155.0,436.0
39526.0,437.0
40757.0,438.0
39259.0,439.0
37051.0,440.0
41899.0,441.0
41862.0,442.0
40214.0,443.0
38700.0,444.0
39984.0,445.0
40480.0,446.0
44483.0,447.0
40607.0,448.0
44431.0,449.0
37982.0,450.0
43930.0,451.0
42393.0,452.0
41625.0,453.0
48752.0,454.0
41631.0,455.0
40754.0,456.0
42676.0,457.0
45197.0,458.0
50789.0,459.0
46943.0,460.0
41506.0,461.0
32254.0,462.0
43744.0,463.0
39578.0,464.0
45960.0,465.0
33788.0,466.0
47460.0,467.0
45308.0,468.0
42978.0,469.0
38990.0,470.0
40174.0,471.0
47667.0,472.0
38494.0,473.0
47224.0,474.0
45034.0,475.0
47960.0,476.0
45437.0,477.0
42276.0,478.0
42099.0,479.0
47296.0,480.0
44474.0,481.0
45567.0,482.0
42324.0,483.0
37309.0,484.0
50249.0,485.0
46921.0,486.0
44491.0,487.0
55564.0,488.0
51053.0,489.0
53071.0,490.0
52030.0,491.0
41408.0,492.0
41303.0,493.0
48383.0,494.0
48915.0,495.0
47845.0,496.0
47796.0,497.0
44612.0,498.0
44630.0,499.0
54032.0,500.0
50752.0,501.0
53995.0,502.0
35410.0,503.0
45112.0,504.0
51377.0,505.0
37578.0,506.0
45874.0,507.0
46066.0,508.0
47981.0,509.0
43505.0,510.0
48859.0,511.0
47184.0,512.0
46603.0,513.0
46144.0,514.0
42433.0,515.0
46483.0,516.0
42351.0,517.0
32111.0,518.0
36203.0,519.0
40206.0,520.0
42306.0,521.0
48819.0,522.0
43789.0,523.0
46393.0,524.0
29065.0,525.0
43542.0,526.0
44630.0,527.0
44108.0,528.0
42587.0,529.0
44628.0,530.0
46019.0,531.0
46632.0,532.0
44182.0,533.0
51625.0,534.0
49422.0,535.0
42226.0,536.0
47098.0,537.0
49724.0,538.0
47948.0,539.0
52686.0,540.0
46096.0,541.0
49306.0,542.0
52250.0,543.0
46705.0,544.0
47744.0,545.0
40727.0,546.0
51987.0,547.0
51501.0,548.0
53025.0,549.0
48934.0,550.0
43053.0,551.0
42152.0,552.0
50673.0,553.0
52269.0,554.0
50584.0,555.0
44412.0,556.0
48324.0,557.0
47279.0,558.0
48339.0,559.0
51459.0,560.0
44198.0,561.0
54710.0,562.0
53587.0,563.0
56262.0,564.0
53453.0,565.0
45032.0,566.0
55602.0,567.0
49771.0,568.0
55174.0,569.0
48555.0,570.0
44572.0,571.0
54170.0,572.0
56921.0,573.0
52561.0,574.0
45815.0,575.0
49904.0,576.0
58262.0,577.0
55532.0,578.0
64060.0,579.0
57902.0,580.0
56472.0,581.0
55078.0,582.0
51574.0,583.0
59429.0,584.0
61049.0,585.0
58013.0,586.0
53713.0,587.0
56455.0,588.0
49857.0,589.0
55740.0,590.0
58205.0,591.0
59783.0,592.0
52957.0,593.0
52982.0,594.0
54503.0,595.0
54556.0,596.0
59162.0,597.0
54110.0,598.0
63142.0,599.0
58419.0,600.0
58222.0,601.0
68172.0,602.0
59436.0,603.0
62806.0,604.0
65964.0,605.0
62532.0,606.0
65668.0,607.0
61665.0,608.0
65086.0,609.0
51634.0,610.0
60891.0,611.0
66054.0,612.0
62473.0,613.0
66452.0,614.0
67766.0,615.0
60201.0,616.0
64668.0,617.0
68958.0,618.0
68508.0,619.0
69624.0,620.0
74256.0,621.0
60904.0,622.0
69691.0,623.0
64227.0,624.0
58418.0,625.0
64693.0,626.0
72434.0,627.0
59114.0,628.0
63177.0,629.0
72095.0,630.0
60324.0,631.0
52186.0,632.0
61357.0,633.0
54799.0,634.0
58901.0,635.0
70242.0,636.0
69181.0,637.0
65124.0,638.0
64482.0,639.0
59113.0,640.0
65119.0,641.0
62638.0,642.0
68843.0,643.0
72771.0,644.0
65754.0,645.0
71511.0,646.0
58817.0,647.0
72479.0,648.0
67420.0,649.0
70784.0,650.0
70083.0,651.0
61955.0,652.0
65206.0,653.0
70378.0,654.0
65174.0,655.0
60091.0,656.0
72476.0,657.0
77747.0,658.0
69256.0,659.0
59693.0,660.0
53193.0,661.0
65654.0,662.0
64954.0,663.0
65882.0,664.0
74975.0,665.0
68590.0,666.0
67080.0,667.0
63499.0,668.0
66520.0,669.0
66401.0,670.0
74349.0,671.0
67179.0,672.0
71568.0,673.0
56741.0,674.0
57613.0,675.0
68681.0,676.0
68192.0,677.0
65490.0,678.0
81840.0,679.0
72546.0,680.0
66216.0,681.0
63877.0,682.0
74048.0,683.0
72277.0,684.0
61284.0,685.0
65166.0,686.0
83356.0,687.0
82100.0,688.0
75340.0,689.0
67519.0,690.0
60920.0,691.0
61355.0,692.0
71237.0,693.0
67317.0,694.0
72002.0,695.0
62149.0,696.0
74309.0,697.0
65767.0,698.0
67253.0,699.0
72179.0,700.0
76422.0,701.0
70395.0,702.0
69581.0,703.0
77232.0,704.0
76845.0,705.0
72838.0,706.0
80795.0,707.0
75457.0,708.0
85154.0,709.0
76996.0,710.0
76096.0,711.0
80660.0,712.0
68269.0,713.0
70114.0,714.0
70422.0,715.0
76750.0,716.0
84691.0,717.0
69134.0,718.0
83195.0,719.0
83433.0,720.0
77471.0,721.0
82925.0,722.0
74988.0,723.0
81004.0,724.0
77003.0,725.0
73555.0,726.0
86188.0,727.0
93810.0,728.0
75561.0,729.0
76915.0,730.0
80106.0,731.0
75004.0,732.0
77430.0,733.0
77602.0,734.0
79308.0,735.0
73626.0,736.0
70750.0,737.0
83893.0,738.0
77027.0,739.0
75890.0,740.0
67636.0,741.0
84093.0,742.0
82000.0,743.0
85020.0,744.0
76383.0,745.0
87344.0,746.0
87621.0,747.0
87844.0,748.0
89789.0,749.0
80544.0,750.0
71755.0,751.0
77314.0,752.0
74155.0,753.0
88937.0,754.0
77613.0,755.0
79403.0,756.0
76144.0,757.0
74887.0,758.0
80368.0,759.0
86347.0,760.0
75457.0,761.0
86575.0,762.0
74105.0,763.0
67473.0,764.0
68898.0,765.0
78486.0,766.0
85484.0,767.0
83317.0,768.0
81444.0,769.0
72798.0,770.0
74650.0,771.0
65488.0,772.0
70360.0,773.0
79147.0,774.0
74366.0,775.0
81034.0,776.0
83888.0,777.0
82432.0,778.0
81282.0,779.0
75379.0,780.0
75588.0,781.0
79536.0,782.0
80673.0,783.0
82462.0,784.0
84729.0,785.0
78870.0,786.0
81823.0,787.0
84730.0,788.0
78503.0,789.0
82870.0,790.0
91747.0,791.0
95977.0,792.0
82133.0,793.0
89991.0,794.0
90654.0,795.0
93147.0,796.0
85464.0,797.0
90350.0,798.0
76521.0,799.0
87794.0,800.0
87968.0,801.0
81363.0,802.0
86702.0,803.0
86847.0,804.0
82760.0,805.0
90924.0,806.0
58508.0,807.0
74745.0,808.0
82921.0,809.0
80106.0,810.0
75074.0,811.0
74289.0,812.0
84809.0,813.0
78610.0,814.0
87324.0,815.0
77375.0,816.0
84128.0,817.0
81877.0,818.0
79450.0,819.0
86452.0,820.0
89805.0,821.0
92526.0,822.0
72379.0,823.0
82467.0,824.0
79430.0,825.0
80330.0,826.0
82555.0,827.0
63490.0,828.0
75139.0,829.0
67946.0,830.0
77511.0,831.0
69873.0,832.0
76024.0,833.0
75338.0,834.0
81373.0,835.0
81333.0,836.0
82421.0,837.0
84256.0,838.0
89574.0,839.0
89029.0,840.0
91142.0,841.0
78827.0,842.0
82764.0,843.0
78777.0,844.0
81541.0,845.0
71709.0,846.0
85712.0,847.0
84360.0,848.0
80277.0,849.0
80404.0,850.0
68510.0,851.0
73285.0,852.0
64472.0,853.0
75884.0,854.0
69192.0,855.0
73355.0,856.0
66350.0,857.0
66473.0,858.0
70778.0,859.0
65644.0,860.0
72841.0,861.0
69774.0,862.0
82186.0,863.0
78479.0,864.0
70914.0,865.0
76528.0,866.0
79667.0,867.0
67094.0,868.0
69656.0,869.0
76402.0,870.0
70935.0,871.0
72657.0,872.0
62469.0,873.0
66021.0,874.0
59234.0,875.0
57624.0,876.0
56926.0,877.0
66972.0,878.0
55919.0,879.0
58448.0,880.0
52824.0,881.0
71100.0,882.0
75389.0,883.0
69037.0,884.0
63136.0,885.0
61988.0,886.0
76308.0,887.0
71213.0,888.0
74923.0,889.0
79702.0,890.0
76843.0,891.0
77168.0,892.0
77630.0,893.0
86017.0,894.0
77911.0,895.0
78297.0,896.0
82497.0,897.0
70427.0,898.0
72280.0,899.0
67290.0,900.0
66230.0,901.0
68636.0,902.0
62433.0,903.0
82028.0,904.0
63416.0,905.0
70487.0,906.0
73292.0,907.0
86446.0,908.0
78679.0,909.0
90316.0,910.0
89147.0,911.0
76892.0,912.0
75388.0,913.0
79279.0,914.0
76208.0,915.0
76144.0,916.0
79755.0,917.0
75131.0,918.0
75911.0,919.0
62236.0,920.0
58272.0,921.0
70853.0,922.0
77186.0,923.0
83171.0,924.0
69315.0,925.0
59008.0,926.0
58791.0,927.0
58932.0,928.0
67680.0,929.0
67812.0,930.0
78503.0,931.0
71165.0,932.0
67635.0,933.0
65102.0,934.0
72008.0,935.0
73748.0,936.0
76135.0,937.0
80639.0,938.0
69204.0,939.0
70714.0,940.0
73039.0,941.0
63929.0,942.0
72526.0,943.0
72644.0,944.0
61598.0,945.0
69721.0,946.0
83005.0,947.0
75281.0,948.0
75051.0,949.0
81409.0,950.0
74192.0,951.0
80240.0,952.0
73654.0,953.0
69866.0,954.0
81210.0,955.0
83485.0,956.0
85013.0,957.0
74843.0,958.0
72490.0,959.0
85667.0,960.0
84825.0,961.0
77179.0,962.0
87416.0,963.0
77734.0,964.0
78899.0,965.0
84127.0,966.0
88148.0,967.0
85905.0,968.0
84134.0,969.0
91031.0,970.0
76235.0,971.0
85661.0,972.0
83109.0,973.0
73051.0,974.0
72233.0,975.0
75280.0,976.0
82128.0,977.0
75666.0,978.0
86096.0,979.0
82086.0,980.0
90200.0,981.0
72340.0,982.0
80737.0,983.0
77699.0,984.0
88177.0,985.0
83633.0,986.0
76489.0,987.0
88224.0,988.0
79870.0,989.0
81502.0,990.0
86112.0,991.0
88264.0,992.0
79883.0,993.0
70496.0,994.0
80129.0,995.0
82735.0,996.0
84049.0,997.0
75388.0,998.0
84092.0,999.0
