0,0.0,0.0,256.0,0.0015778186274509804,103.0,
1,1.0,5873.0,256.0,0.0017003676470588236,111.0,
2,2.0,6501.0,256.0,0.0016697303921568627,109.0,
3,3.0,4047.0,256.0,0.0017003676470588236,111.0,
4,4.0,2988.0,256.0,0.0016237745098039217,106.0,
5,5.0,2427.0,256.0,0.0015471813725490195,101.0,
6,6.0,3813.0,256.0,0.0015165441176470589,99.0,
7,7.0,4832.0,256.0,0.0015471813725490195,101.0,
8,8.0,3625.0,256.0,0.0015012254901960785,98.0,
9,9.0,4030.0,256.0,0.001485906862745098,97.0,
10,10.0,3659.0,256.0,0.001485906862745098,97.0,
11,11.0,2814.0,256.0,0.0014552696078431373,95.0,
12,12.0,4059.0,256.0,0.001485906862745098,97.0,
13,13.0,3628.0,256.0,0.0014705882352941176,96.0,
14,14.0,3695.0,256.0,0.001409313725490196,92.0,
15,15.0,4082.0,256.0,0.0013174019607843138,86.0,
16,16.0,4076.0,256.0,0.0013633578431372548,89.0,
17,17.0,5643.0,256.0,0.0014705882352941176,96.0,
18,18.0,5373.0,256.0,0.001485906862745098,97.0,
19,19.0,5188.0,256.0,0.0014552696078431373,95.0,
20,20.0,6688.0,256.0,0.0014552696078431373,95.0,
21,21.0,8185.0,256.0,0.001439950980392157,94.0,
22,22.0,7298.0,256.0,0.0015778186274509804,103.0,
23,23.0,8262.0,256.0,0.001608455882352941,105.0,
24,24.0,8815.0,256.0,0.0015931372549019608,104.0,
25,25.0,8942.0,256.0,0.0015778186274509804,103.0,
26,26.0,9402.0,256.0,0.0016850490196078432,110.0,
27,27.0,9712.0,256.0,0.0017922794117647058,117.0,
28,28.0,8291.0,256.0,0.002022058823529412,132.0,
29,29.0,11485.0,256.0,0.0021599264705882354,141.0,
30,30.0,10453.0,256.0,0.002236519607843137,146.0,
31,31.0,10967.0,256.0,0.0021752450980392158,142.0,
32,32.0,7817.0,256.0,0.0022058823529411764,144.0,
33,33.0,8874.0,256.0,0.002144607843137255,140.0,
34,34.0,7230.0,256.0,0.00234375,153.0,
35,35.0,10191.0,256.0,0.0022824754901960786,149.0,
36,36.0,9289.0,256.0,0.00234375,153.0,
37,37.0,6893.0,256.0,0.0023131127450980392,151.0,
38,38.0,7037.0,256.0,0.0023284313725490196,152.0,
39,39.0,7007.0,256.0,0.0022824754901960786,149.0,
40,40.0,8104.0,256.0,0.002236519607843137,146.0,
41,41.0,9842.0,256.0,0.002297794117647059,150.0,
42,42.0,9610.0,256.0,0.00234375,153.0,
43,43.0,5712.0,256.0,0.0023131127450980392,151.0,
44,44.0,6792.0,256.0,0.0022518382352941175,147.0,
45,45.0,7353.0,256.0,0.0022824754901960786,149.0,
46,46.0,7213.0,256.0,0.002190563725490196,143.0,
47,47.0,5947.0,256.0,0.002190563725490196,143.0,
48,48.0,8043.0,256.0,0.0022518382352941175,147.0,
49,49.0,9153.0,256.0,0.0022824754901960786,149.0,
50,50.0,6064.0,256.0,0.002236519607843137,146.0,
51,51.0,4978.0,256.0,0.0022518382352941175,147.0,
52,52.0,4940.0,256.0,0.0022518382352941175,147.0,
53,53.0,6595.0,256.0,0.0022058823529411764,144.0,
54,54.0,5265.0,256.0,0.002068014705882353,135.0,
55,55.0,4783.0,256.0,0.001991421568627451,130.0,
56,56.0,3714.0,256.0,0.0019301470588235295,126.0,
57,57.0,4126.0,256.0,0.0019761029411764705,129.0,
58,58.0,4759.0,256.0,0.001868872549019608,122.0,
59,59.0,4163.0,256.0,0.0017463235294117648,114.0,
60,60.0,3550.0,256.0,0.0016697303921568627,109.0,
61,61.0,3515.0,256.0,0.0016544117647058823,108.0,
62,62.0,3693.0,256.0,0.0015471813725490195,101.0,
63,63.0,3608.0,256.0,0.0015318627450980392,100.0,
64,64.0,4195.0,256.0,0.0015012254901960785,98.0,
65,65.0,3813.0,256.0,0.0015012254901960785,98.0,
66,66.0,4412.0,256.0,0.0015471813725490195,101.0,
67,67.0,4702.0,256.0,0.0015471813725490195,101.0,
68,68.0,3789.0,256.0,0.0015931372549019608,104.0,
69,69.0,5217.0,256.0,0.001485906862745098,97.0,
70,70.0,5020.0,256.0,0.0014705882352941176,96.0,
71,71.0,4765.0,256.0,0.001439950980392157,94.0,
72,72.0,4043.0,256.0,0.001485906862745098,97.0,
73,73.0,4163.0,256.0,0.0014552696078431373,95.0,
74,74.0,3858.0,256.0,0.0014246323529411764,93.0,
75,75.0,3547.0,256.0,0.001409313725490196,92.0,
76,76.0,3774.0,256.0,0.0013786764705882354,90.0,
77,77.0,4255.0,256.0,0.0013939950980392157,91.0,
78,78.0,3804.0,256.0,0.0013480392156862745,88.0,
79,79.0,3819.0,256.0,0.0013939950980392157,91.0,
80,80.0,3623.0,256.0,0.0013480392156862745,88.0,
81,81.0,3584.0,256.0,0.0013020833333333333,85.0,
82,82.0,5452.0,256.0,0.0012408088235294117,81.0,
83,83.0,4302.0,256.0,0.0012561274509803922,82.0,
84,84.0,5012.0,256.0,0.0012714460784313726,83.0,
85,85.0,5342.0,256.0,0.0012561274509803922,82.0,
86,86.0,4939.0,256.0,0.0013174019607843138,86.0,
87,87.0,4387.0,256.0,0.0013786764705882354,90.0,
88,88.0,4519.0,256.0,0.0013480392156862745,88.0,
89,89.0,6208.0,256.0,0.0013939950980392157,91.0,
90,90.0,5308.0,256.0,0.0013939950980392157,91.0,
91,91.0,6226.0,256.0,0.0013939950980392157,91.0,
92,92.0,6699.0,256.0,0.0014705882352941176,96.0,
93,93.0,6129.0,256.0,0.001485906862745098,97.0,
94,94.0,6403.0,256.0,0.0014246323529411764,93.0,
95,95.0,6520.0,256.0,0.0015165441176470589,99.0,
96,96.0,7473.0,256.0,0.0015625,102.0,
97,97.0,6592.0,256.0,0.0017003676470588236,111.0,
98,98.0,6489.0,256.0,0.0016850490196078432,110.0,
99,99.0,6388.0,256.0,0.0016850490196078432,110.0,
100,100.0,7357.0,256.0,0.0015931372549019608,104.0,
101,101.0,6212.0,256.0,0.0016697303921568627,109.0,
102,102.0,7252.0,256.0,0.0017616421568627451,115.0,
103,103.0,5713.0,256.0,0.0017616421568627451,115.0,
104,104.0,6690.0,256.0,0.0016850490196078432,110.0,
105,105.0,6212.0,256.0,0.0016697303921568627,109.0,
106,106.0,5627.0,256.0,0.0016237745098039217,106.0,
107,107.0,5228.0,256.0,0.0015318627450980392,100.0,
108,108.0,4144.0,256.0,0.001439950980392157,94.0,
109,109.0,4621.0,256.0,0.001409313725490196,92.0,
110,110.0,4754.0,256.0,0.0013786764705882354,90.0,
111,111.0,5061.0,256.0,0.0013327205882352942,87.0,
112,112.0,4709.0,256.0,0.0013480392156862745,88.0,
113,113.0,3545.0,256.0,0.0013327205882352942,87.0,
114,114.0,5103.0,256.0,0.0013174019607843138,86.0,
115,115.0,4132.0,256.0,0.0012561274509803922,82.0,
116,116.0,3983.0,256.0,0.0013020833333333333,85.0,
117,117.0,3226.0,256.0,0.0012408088235294117,81.0,
118,118.0,4044.0,256.0,0.0011948529411764707,78.0,
119,119.0,3259.0,256.0,0.0011335784313725491,74.0,
120,120.0,4131.0,256.0,0.0011488970588235295,75.0,
121,121.0,4143.0,256.0,0.0011182598039215686,73.0,
122,122.0,4895.0,256.0,0.0010876225490196079,71.0,
123,123.0,3819.0,256.0,0.0010416666666666667,68.0,
124,124.0,3694.0,256.0,0.0010416666666666667,68.0,
125,125.0,5446.0,256.0,0.0010416666666666667,68.0,
126,126.0,4486.0,256.0,0.001011029411764706,66.0,
127,127.0,5128.0,256.0,0.0010416666666666667,68.0,
128,128.0,5110.0,256.0,0.001011029411764706,66.0,
129,129.0,5272.0,256.0,0.001056985294117647,69.0,
130,130.0,5164.0,256.0,0.0010723039215686275,70.0,
131,131.0,4701.0,256.0,0.001056985294117647,69.0,
132,132.0,4875.0,256.0,0.0011029411764705882,72.0,
133,133.0,4068.0,256.0,0.0011642156862745098,76.0,
134,134.0,4106.0,256.0,0.0011642156862745098,76.0,
135,135.0,4033.0,256.0,0.0011029411764705882,72.0,
136,136.0,4116.0,256.0,0.0011335784313725491,74.0,
137,137.0,3851.0,256.0,0.0011488970588235295,75.0,
138,138.0,4891.0,256.0,0.001210171568627451,79.0,
139,139.0,3260.0,256.0,0.001056985294117647,69.0,
140,140.0,3952.0,256.0,0.001011029411764706,66.0,
141,141.0,3683.0,256.0,0.001011029411764706,66.0,
142,142.0,2697.0,256.0,9.957107843137254E-4,65.0,
143,143.0,3244.0,256.0,9.191176470588235E-4,60.0,
144,144.0,3415.0,256.0,9.037990196078432E-4,59.0,
145,145.0,3663.0,256.0,8.884803921568627E-4,58.0,
146,146.0,2952.0,256.0,8.731617647058824E-4,57.0,
147,147.0,4295.0,256.0,8.272058823529412E-4,54.0,
148,148.0,3214.0,256.0,7.04656862745098E-4,46.0,
149,149.0,2819.0,256.0,7.199754901960785E-4,47.0,
150,150.0,4301.0,256.0,7.8125E-4,51.0,
151,151.0,3812.0,256.0,7.659313725490196E-4,50.0,
152,152.0,4674.0,256.0,8.57843137254902E-4,56.0,
153,153.0,4658.0,256.0,9.191176470588235E-4,60.0,
154,154.0,4954.0,256.0,9.650735294117647E-4,63.0,
155,155.0,4531.0,256.0,9.037990196078432E-4,59.0,
156,156.0,5650.0,256.0,9.497549019607843E-4,62.0,
157,157.0,4872.0,256.0,0.0010263480392156863,67.0,
158,158.0,5808.0,256.0,0.0010876225490196079,71.0,
159,159.0,5453.0,256.0,0.0011182598039215686,73.0,
160,160.0,3681.0,256.0,0.0011335784313725491,74.0,
161,161.0,5313.0,256.0,0.0011182598039215686,73.0,
162,162.0,5751.0,256.0,0.0010876225490196079,71.0,
163,163.0,5944.0,256.0,0.0010876225490196079,71.0,
164,164.0,5142.0,256.0,0.0011182598039215686,73.0,
165,165.0,4724.0,256.0,0.0011335784313725491,74.0,
166,166.0,6085.0,256.0,0.0010876225490196079,71.0,
167,167.0,5268.0,256.0,0.0011335784313725491,74.0,
168,168.0,5396.0,256.0,0.0011182598039215686,73.0,
169,169.0,7648.0,256.0,0.0011488970588235295,75.0,
170,170.0,6892.0,256.0,0.0011948529411764707,78.0,
171,171.0,6820.0,256.0,0.0011488970588235295,75.0,
172,172.0,6111.0,256.0,0.0011029411764705882,72.0,
173,173.0,7295.0,256.0,0.001210171568627451,79.0,
174,174.0,8003.0,256.0,0.0013020833333333333,85.0,
175,175.0,7579.0,256.0,0.0013020833333333333,85.0,
176,176.0,6937.0,256.0,0.0013939950980392157,91.0,
177,177.0,7795.0,256.0,0.0013786764705882354,90.0,
178,178.0,7194.0,256.0,0.0014246323529411764,93.0,
179,179.0,9348.0,256.0,0.0014705882352941176,96.0,
180,180.0,8968.0,256.0,0.0014705882352941176,96.0,
181,181.0,9378.0,256.0,0.0015012254901960785,98.0,
182,182.0,8825.0,256.0,0.0016237745098039217,106.0,
183,183.0,9691.0,256.0,0.0016237745098039217,106.0,
184,184.0,8737.0,256.0,0.001639093137254902,107.0,
185,185.0,10598.0,256.0,0.001639093137254902,107.0,
186,186.0,11358.0,256.0,0.0015931372549019608,104.0,
187,187.0,11559.0,256.0,0.0017310049019607842,113.0,
188,188.0,10146.0,256.0,0.0016850490196078432,110.0,
189,189.0,13197.0,256.0,0.0017463235294117648,114.0,
190,190.0,13086.0,256.0,0.001838235294117647,120.0,
191,191.0,12047.0,256.0,0.001868872549019608,122.0,
192,192.0,14646.0,256.0,0.002006740196078431,131.0,
193,193.0,13890.0,256.0,0.0020526960784313726,134.0,
194,194.0,11712.0,256.0,0.002144607843137255,140.0,
195,195.0,15221.0,256.0,0.0020833333333333333,136.0,
196,196.0,15023.0,256.0,0.002144607843137255,140.0,
197,197.0,16805.0,256.0,0.002190563725490196,143.0,
198,198.0,13956.0,256.0,0.0023131127450980392,151.0,
199,199.0,14917.0,256.0,0.0022824754901960786,149.0,
200,200.0,18443.0,256.0,0.0022671568627450982,148.0,
201,201.0,14245.0,256.0,0.0022824754901960786,149.0,
202,202.0,14793.0,256.0,0.0022671568627450982,148.0,
203,203.0,13686.0,256.0,0.0022671568627450982,148.0,
204,204.0,14063.0,256.0,0.0021599264705882354,141.0,
205,205.0,16360.0,256.0,0.0023131127450980392,151.0,
206,206.0,19845.0,256.0,0.0023131127450980392,151.0,
207,207.0,16916.0,256.0,0.0024050245098039217,157.0,
208,208.0,15023.0,256.0,0.0022518382352941175,147.0,
209,209.0,15870.0,256.0,0.0022518382352941175,147.0,
210,210.0,18846.0,256.0,0.002190563725490196,143.0,
211,211.0,17961.0,256.0,0.00234375,153.0,
212,212.0,18589.0,256.0,0.0023743872549019606,155.0,
213,213.0,19474.0,256.0,0.0025122549019607845,164.0,
214,214.0,21741.0,256.0,0.0024816176470588234,162.0,
215,215.0,22101.0,256.0,0.0025582107843137255,167.0,
216,216.0,22781.0,256.0,0.0024816176470588234,162.0,
217,217.0,20236.0,256.0,0.002527573529411765,165.0,
218,218.0,23867.0,256.0,0.0025582107843137255,167.0,
219,219.0,21624.0,256.0,0.0026654411764705883,174.0,
220,220.0,20212.0,256.0,0.0026348039215686276,172.0,
221,221.0,20983.0,256.0,0.002650122549019608,173.0,
222,222.0,19888.0,256.0,0.002772671568627451,181.0,
223,223.0,22899.0,256.0,0.002864583333333333,187.0,
224,224.0,22587.0,256.0,0.0028952205882352942,189.0,
225,225.0,24017.0,256.0,0.0029564950980392156,193.0,
226,226.0,22294.0,256.0,0.0029564950980392156,193.0,
227,227.0,21600.0,256.0,0.0030177696078431374,197.0,
228,228.0,25404.0,256.0,0.0030637254901960784,200.0,
229,229.0,23548.0,256.0,0.003002450980392157,196.0,
230,230.0,23527.0,256.0,0.0031862745098039215,208.0,
231,231.0,22541.0,256.0,0.0032628676470588236,213.0,
232,232.0,28491.0,256.0,0.003125,204.0,
233,233.0,25263.0,256.0,0.003094362745098039,202.0,
234,234.0,25881.0,256.0,0.0032322303921568625,211.0,
235,235.0,26572.0,256.0,0.003170955882352941,207.0,
236,236.0,22164.0,256.0,0.003477328431372549,227.0,
237,237.0,26180.0,256.0,0.003553921568627451,232.0,
238,238.0,27409.0,256.0,0.003599877450980392,235.0,
239,239.0,23937.0,256.0,0.0036458333333333334,238.0,
240,240.0,24241.0,256.0,0.0037071078431372547,242.0,
241,241.0,26952.0,256.0,0.003676470588235294,240.0,
242,242.0,23669.0,256.0,0.003446691176470588,225.0,
243,243.0,25478.0,256.0,0.0033547794117647057,219.0,
244,244.0,30367.0,256.0,0.0033088235294117647,216.0,
245,245.0,25573.0,256.0,0.0033854166666666668,221.0,
246,246.0,25391.0,256.0,0.003400735294117647,222.0,
247,247.0,25449.0,256.0,0.00350796568627451,229.0,
248,248.0,29528.0,256.0,0.003737745098039216,244.0,
249,249.0,26910.0,256.0,0.0037683823529411765,246.0,
250,250.0,29858.0,256.0,0.0036458333333333334,238.0,
251,251.0,26756.0,256.0,0.0038143382352941175,249.0,
252,252.0,30186.0,256.0,0.003753063725490196,245.0,
253,253.0,28747.0,256.0,0.0037071078431372547,242.0,
254,254.0,27471.0,256.0,0.0037071078431372547,242.0,
255,255.0,25027.0,256.0,0.003753063725490196,245.0,
256,256.0,26976.0,256.0,0.003676470588235294,240.0,
257,257.0,26856.0,256.0,0.003431372549019608,224.0,
258,258.0,29214.0,256.0,0.0036151960784313727,236.0,
259,259.0,31321.0,256.0,0.0036917892156862744,241.0,
260,260.0,30438.0,256.0,0.003630514705882353,237.0,
261,261.0,27765.0,256.0,0.0038756127450980393,253.0,
262,262.0,27155.0,256.0,0.004028799019607844,263.0,
263,263.0,31252.0,256.0,0.003998161764705882,261.0,
264,264.0,29908.0,256.0,0.004013480392156862,262.0,
265,265.0,31497.0,256.0,0.004074754901960785,266.0,
266,266.0,33725.0,256.0,0.004227941176470588,276.0,
267,267.0,32415.0,256.0,0.004381127450980392,286.0,
268,268.0,28278.0,256.0,0.004365808823529412,285.0,
269,269.0,30936.0,256.0,0.004411764705882353,288.0,
270,270.0,35885.0,256.0,0.0045343137254901964,296.0,
271,271.0,28574.0,256.0,0.0046721813725490195,305.0,
272,272.0,36411.0,256.0,0.004764093137254902,311.0,
273,273.0,35388.0,256.0,0.004810049019607843,314.0,
274,274.0,33143.0,256.0,0.004901960784313725,320.0,
275,275.0,32513.0,256.0,0.004901960784313725,320.0,
276,276.0,30068.0,256.0,0.004963235294117647,324.0,
277,277.0,29328.0,256.0,0.004856004901960784,317.0,
278,278.0,36000.0,256.0,0.004810049019607843,314.0,
279,279.0,33428.0,256.0,0.004825367647058824,315.0,
280,280.0,30789.0,256.0,0.004963235294117647,324.0,
281,281.0,31370.0,256.0,0.004963235294117647,324.0,
282,282.0,30638.0,256.0,0.005101102941176471,333.0,
283,283.0,35251.0,256.0,0.005177696078431372,338.0,
284,284.0,32890.0,256.0,0.005162377450980392,337.0,
285,285.0,29531.0,256.0,0.005009191176470589,327.0,
286,286.0,34136.0,256.0,0.005039828431372549,329.0,
287,287.0,40864.0,256.0,0.004978553921568627,325.0,
288,288.0,37401.0,256.0,0.004963235294117647,324.0,
289,289.0,31832.0,256.0,0.00505514705882353,330.0,
290,290.0,29913.0,256.0,0.00505514705882353,330.0,
291,291.0,33092.0,256.0,0.005254289215686275,343.0,
292,292.0,34143.0,256.0,0.005315563725490196,347.0,
293,293.0,33466.0,256.0,0.005269607843137255,344.0,
294,294.0,33623.0,256.0,0.005392156862745098,352.0,
295,295.0,29448.0,256.0,0.005422794117647059,354.0,
296,296.0,36472.0,256.0,0.005422794117647059,354.0,
297,297.0,37259.0,256.0,0.005254289215686275,343.0,
298,298.0,32407.0,256.0,0.005238970588235294,342.0,
299,299.0,30975.0,256.0,0.005284926470588236,345.0,
300,300.0,32872.0,256.0,0.005131740196078431,335.0,
301,301.0,29133.0,256.0,0.004978553921568627,325.0,
302,302.0,32965.0,256.0,0.004917279411764706,321.0,
303,303.0,39325.0,256.0,0.004810049019607843,314.0,
304,304.0,33584.0,256.0,0.004840686274509804,316.0,
305,305.0,31768.0,256.0,0.004856004901960784,317.0,
306,306.0,36528.0,256.0,0.004825367647058824,315.0,
307,307.0,35576.0,256.0,0.004932598039215686,322.0,
308,308.0,31282.0,256.0,0.004840686274509804,316.0,
309,309.0,38899.0,256.0,0.004871323529411765,318.0,
310,310.0,31950.0,256.0,0.0049479166666666664,323.0,
311,311.0,36798.0,256.0,0.005193014705882353,339.0,
312,312.0,36110.0,256.0,0.005238970588235294,342.0,
313,313.0,39346.0,256.0,0.005101102941176471,333.0,
314,314.0,33136.0,256.0,0.00508578431372549,332.0,
315,315.0,37331.0,256.0,0.005101102941176471,333.0,
316,316.0,40415.0,256.0,0.005039828431372549,329.0,
317,317.0,35701.0,256.0,0.00505514705882353,330.0,
318,318.0,33940.0,256.0,0.0049938725490196074,326.0,
319,319.0,31523.0,256.0,0.00508578431372549,332.0,
320,320.0,36124.0,256.0,0.004901960784313725,320.0,
321,321.0,43602.0,256.0,0.00507046568627451,331.0,
322,322.0,37796.0,256.0,0.004901960784313725,320.0,
323,323.0,38412.0,256.0,0.0049938725490196074,326.0,
324,324.0,39294.0,256.0,0.0049938725490196074,326.0,
325,325.0,35230.0,256.0,0.00508578431372549,332.0,
326,326.0,34166.0,256.0,0.0049938725490196074,326.0,
327,327.0,39848.0,256.0,0.0049938725490196074,326.0,
328,328.0,34546.0,256.0,0.00505514705882353,330.0,
329,329.0,30087.0,256.0,0.005024509803921569,328.0,
330,330.0,38609.0,256.0,0.00508578431372549,332.0,
331,331.0,38583.0,256.0,0.0049938725490196074,326.0,
332,332.0,41461.0,256.0,0.00508578431372549,332.0,
333,333.0,38361.0,256.0,0.005131740196078431,335.0,
334,334.0,36868.0,256.0,0.00505514705882353,330.0,
335,335.0,40572.0,256.0,0.005116421568627451,334.0,
336,336.0,37073.0,256.0,0.00507046568627451,331.0,
337,337.0,35634.0,256.0,0.005039828431372549,329.0,
338,338.0,41372.0,256.0,0.005009191176470589,327.0,
339,339.0,38274.0,256.0,0.005147058823529412,336.0,
340,340.0,42689.0,256.0,0.005315563725490196,347.0,
341,341.0,39050.0,256.0,0.00548406862745098,358.0,
342,342.0,39627.0,256.0,0.005591299019607843,365.0,
343,343.0,37781.0,256.0,0.005775122549019608,377.0,
344,344.0,34586.0,256.0,0.005683210784313725,371.0,
345,345.0,40513.0,256.0,0.005575980392156863,364.0,
346,346.0,42209.0,256.0,0.005422794117647059,354.0,
347,347.0,35520.0,256.0,0.005376838235294118,351.0,
348,348.0,38339.0,256.0,0.005300245098039216,346.0,
349,349.0,40558.0,256.0,0.005376838235294118,351.0,
350,350.0,43059.0,256.0,0.005361519607843137,350.0,
351,351.0,44391.0,256.0,0.0055147058823529415,360.0,
352,352.0,47094.0,256.0,0.005545343137254902,362.0,
353,353.0,44910.0,256.0,0.00548406862745098,358.0,
354,354.0,43517.0,256.0,0.00546875,357.0,
355,355.0,34651.0,256.0,0.005499387254901961,359.0,
356,356.0,35901.0,256.0,0.005530024509803922,361.0,
357,357.0,37792.0,256.0,0.00546875,357.0,
358,358.0,41456.0,256.0,0.005637254901960784,368.0,
359,359.0,45613.0,256.0,0.005545343137254902,362.0,
360,360.0,49895.0,256.0,0.0056066176470588236,366.0,
361,361.0,37565.0,256.0,0.005407475490196078,353.0,
362,362.0,42371.0,256.0,0.005361519607843137,350.0,
363,363.0,41593.0,256.0,0.005330882352941177,348.0,
364,364.0,45025.0,256.0,0.00546875,357.0,
365,365.0,35231.0,256.0,0.005637254901960784,368.0,
366,366.0,39961.0,256.0,0.005805759803921569,379.0,
367,367.0,35266.0,256.0,0.00586703431372549,383.0,
368,368.0,40217.0,256.0,0.005775122549019608,377.0,
369,369.0,44485.0,256.0,0.005713848039215686,373.0,
370,370.0,41718.0,256.0,0.005897671568627451,385.0,
371,371.0,47311.0,256.0,0.005805759803921569,379.0,
372,372.0,43602.0,256.0,0.0057904411764705885,378.0,
373,373.0,47052.0,256.0,0.005545343137254902,362.0,
374,374.0,35640.0,256.0,0.005438112745098039,355.0,
375,375.0,41933.0,256.0,0.005193014705882353,339.0,
376,376.0,42336.0,256.0,0.005208333333333333,340.0,
377,377.0,40082.0,256.0,0.005116421568627451,334.0,
378,378.0,40124.0,256.0,0.005009191176470589,327.0,
379,379.0,37830.0,256.0,0.005039828431372549,329.0,
380,380.0,41595.0,256.0,0.004963235294117647,324.0,
381,381.0,43131.0,256.0,0.00508578431372549,332.0,
382,382.0,50085.0,256.0,0.005284926470588236,345.0,
383,383.0,37477.0,256.0,0.0055147058823529415,360.0,
384,384.0,46254.0,256.0,0.005453431372549019,356.0,
385,385.0,46248.0,256.0,0.005729166666666666,374.0,
386,386.0,44413.0,256.0,0.005637254901960784,368.0,
387,387.0,42790.0,256.0,0.005499387254901961,359.0,
388,388.0,48496.0,256.0,0.00548406862745098,358.0,
389,389.0,40049.0,256.0,0.005621936274509804,367.0,
390,390.0,43853.0,256.0,0.005667892156862745,370.0,
391,391.0,43271.0,256.0,0.0057444852941176475,375.0,
392,392.0,42929.0,256.0,0.005683210784313725,371.0,
393,393.0,45241.0,256.0,0.005729166666666666,374.0,
394,394.0,46020.0,256.0,0.005759803921568628,376.0,
395,395.0,45446.0,256.0,0.0058823529411764705,384.0,
396,396.0,56462.0,256.0,0.005775122549019608,377.0,
397,397.0,47535.0,256.0,0.005821078431372549,380.0,
398,398.0,43296.0,256.0,0.005775122549019608,377.0,
399,399.0,41888.0,256.0,0.005821078431372549,380.0,
400,400.0,43422.0,256.0,0.005683210784313725,371.0,
401,401.0,39779.0,256.0,0.0056066176470588236,366.0,
402,402.0,41568.0,256.0,0.005499387254901961,359.0,
403,403.0,36143.0,256.0,0.00548406862745098,358.0,
404,404.0,37489.0,256.0,0.005637254901960784,368.0,
405,405.0,39676.0,256.0,0.0055606617647058825,363.0,
406,406.0,41514.0,256.0,0.005575980392156863,364.0,
407,407.0,45739.0,256.0,0.005637254901960784,368.0,
408,408.0,40330.0,256.0,0.005545343137254902,362.0,
409,409.0,41520.0,256.0,0.005361519607843137,350.0,
410,410.0,50061.0,256.0,0.005193014705882353,339.0,
411,411.0,43732.0,256.0,0.005024509803921569,328.0,
412,412.0,45240.0,256.0,0.005193014705882353,339.0,
413,413.0,48713.0,256.0,0.005330882352941177,348.0,
414,414.0,44646.0,256.0,0.005575980392156863,364.0,
415,415.0,49973.0,256.0,0.0058363970588235295,381.0,
416,416.0,43722.0,256.0,0.005912990196078431,386.0,
417,417.0,43724.0,256.0,0.005958946078431372,389.0,
418,418.0,46445.0,256.0,0.005958946078431372,389.0,
419,419.0,43190.0,256.0,0.006066176470588235,396.0,
420,420.0,42659.0,256.0,0.006020220588235294,393.0,
421,421.0,43918.0,256.0,0.005989583333333334,391.0,
422,422.0,44474.0,256.0,0.006020220588235294,393.0,
423,423.0,55446.0,256.0,0.005989583333333334,391.0,
424,424.0,48559.0,256.0,0.006096813725490196,398.0,
425,425.0,48396.0,256.0,0.005943627450980392,388.0,
426,426.0,44030.0,256.0,0.005805759803921569,379.0,
427,427.0,54185.0,256.0,0.005989583333333334,391.0,
428,428.0,48150.0,256.0,0.00623468137254902,407.0,
429,429.0,51313.0,256.0,0.00625,408.0,
430,430.0,50080.0,256.0,0.006096813725490196,398.0,
431,431.0,46167.0,256.0,0.005989583333333334,391.0,
432,432.0,49244.0,256.0,0.006096813725490196,398.0,
433,433.0,54334.0,256.0,0.006357230392156863,415.0,
434,434.0,51294.0,256.0,0.006341911764705882,414.0,
435,435.0,54683.0,256.0,0.006311274509803922,412.0,
436,436.0,59036.0,256.0,0.006525735294117647,426.0,
437,437.0,51176.0,256.0,0.006571691176470588,429.0,
438,438.0,44760.0,256.0,0.006403186274509804,418.0,
439,439.0,47333.0,256.0,0.006403186274509804,418.0,
440,440.0,48288.0,256.0,0.0062040441176470585,405.0,
441,441.0,43896.0,256.0,0.006280637254901961,410.0,
442,442.0,51992.0,256.0,0.006387867647058823,417.0,
443,443.0,46999.0,256.0,0.006127450980392157,400.0,
444,444.0,47545.0,256.0,0.006066176470588235,396.0,
445,445.0,47973.0,256.0,0.005989583333333334,391.0,
446,446.0,42010.0,256.0,0.00585171568627451,382.0,
447,447.0,50087.0,256.0,0.005989583333333334,391.0,
448,448.0,46745.0,256.0,0.005912990196078431,386.0,
449,449.0,45262.0,256.0,0.005958946078431372,389.0,
450,450.0,46551.0,256.0,0.006035539215686275,394.0,
451,451.0,43615.0,256.0,0.006066176470588235,396.0,
452,452.0,44952.0,256.0,0.006127450980392157,400.0,
453,453.0,53028.0,256.0,0.006295955882352941,411.0,
454,454.0,48680.0,256.0,0.006372549019607843,416.0,
455,455.0,52877.0,256.0,0.006556372549019608,428.0,
456,456.0,54801.0,256.0,0.0067248774509803926,439.0,
457,457.0,54399.0,256.0,0.006908700980392157,451.0,
458,458.0,52237.0,256.0,0.007123161764705882,465.0,
459,459.0,54315.0,256.0,0.007107843137254902,464.0,
460,460.0,56370.0,256.0,0.0070465686274509805,460.0,
461,461.0,47670.0,256.0,0.0070006127450980395,457.0,
462,462.0,53148.0,256.0,0.006924019607843137,452.0,
463,463.0,52718.0,256.0,0.006786151960784314,443.0,
464,464.0,60054.0,256.0,0.006847426470588235,447.0,
465,465.0,54801.0,256.0,0.006908700980392157,451.0,
466,466.0,56081.0,256.0,0.006816789215686275,445.0,
467,467.0,50192.0,256.0,0.006740196078431373,440.0,
468,468.0,54348.0,256.0,0.006801470588235294,444.0,
469,469.0,51334.0,256.0,0.0070006127450980395,457.0,
470,470.0,50557.0,256.0,0.006939338235294117,453.0,
471,471.0,47203.0,256.0,0.006847426470588235,447.0,
472,472.0,53856.0,256.0,0.0070465686274509805,460.0,
473,473.0,56979.0,256.0,0.007107843137254902,464.0,
474,474.0,50358.0,256.0,0.007123161764705882,465.0,
475,475.0,59838.0,256.0,0.007199754901960784,470.0,
476,476.0,47243.0,256.0,0.007061887254901961,461.0,
477,477.0,61155.0,256.0,0.0070465686274509805,460.0,
478,478.0,55360.0,256.0,0.007107843137254902,464.0,
479,479.0,68575.0,256.0,0.006954656862745098,454.0,
480,480.0,56827.0,256.0,0.006832107843137255,446.0,
481,481.0,57556.0,256.0,0.006862745098039216,448.0,
482,482.0,54984.0,256.0,0.0070006127450980395,457.0,
483,483.0,57839.0,256.0,0.007107843137254902,464.0,
484,484.0,58552.0,256.0,0.007199754901960784,470.0,
485,485.0,59685.0,256.0,0.007598039215686274,496.0,
486,486.0,56518.0,256.0,0.007598039215686274,496.0,
487,487.0,56504.0,256.0,0.007521446078431373,491.0,
488,488.0,54964.0,256.0,0.007643995098039215,499.0,
489,489.0,56427.0,256.0,0.007766544117647059,507.0,
490,490.0,63256.0,256.0,0.00779718137254902,509.0,
491,491.0,65640.0,256.0,0.007781862745098039,508.0,
492,492.0,62539.0,256.0,0.007996323529411764,522.0,
493,493.0,59099.0,256.0,0.007965686274509803,520.0,
494,494.0,56549.0,256.0,0.007965686274509803,520.0,
495,495.0,52232.0,256.0,0.007766544117647059,507.0,
496,496.0,48727.0,256.0,0.007521446078431373,491.0,
497,497.0,62190.0,256.0,0.0073223039215686275,478.0,
498,498.0,57211.0,256.0,0.007659313725490196,500.0,
499,499.0,64676.0,256.0,0.007781862745098039,508.0,
500,500.0,58423.0,256.0,0.00779718137254902,509.0,
501,501.0,62278.0,256.0,0.007751225490196079,506.0,
502,502.0,52494.0,256.0,0.007735906862745098,505.0,
503,503.0,55487.0,256.0,0.007781862745098039,508.0,
504,504.0,53889.0,256.0,0.007613357843137255,497.0,
505,505.0,56199.0,256.0,0.007352941176470588,480.0,
506,506.0,50054.0,256.0,0.0074142156862745095,484.0,
507,507.0,59285.0,256.0,0.007705269607843138,503.0,
508,508.0,53302.0,256.0,0.007674632352941176,501.0,
509,509.0,59094.0,256.0,0.007705269607843138,503.0,
510,510.0,55544.0,256.0,0.007889093137254902,515.0,
511,511.0,61400.0,256.0,0.0078125,510.0,
512,512.0,58395.0,256.0,0.007751225490196079,506.0,
513,513.0,62872.0,256.0,0.007659313725490196,500.0,
514,514.0,63824.0,256.0,0.00779718137254902,509.0,
515,515.0,57039.0,256.0,0.007735906862745098,505.0,
516,516.0,56236.0,256.0,0.007889093137254902,515.0,
517,517.0,59491.0,256.0,0.00784313725490196,512.0,
518,518.0,53820.0,256.0,0.007904411764705882,516.0,
519,519.0,59859.0,256.0,0.008057598039215687,526.0,
520,520.0,61325.0,256.0,0.00784313725490196,512.0,
521,521.0,59942.0,256.0,0.007889093137254902,515.0,
522,522.0,51158.0,256.0,0.007766544117647059,507.0,
523,523.0,60928.0,256.0,0.007536764705882353,492.0,
524,524.0,64160.0,256.0,0.007536764705882353,492.0,
525,525.0,63176.0,256.0,0.0078125,510.0,
526,526.0,66115.0,256.0,0.00784313725490196,512.0,
527,527.0,62767.0,256.0,0.007965686274509803,520.0,
528,528.0,70540.0,256.0,0.007889093137254902,515.0,
529,529.0,60214.0,256.0,0.007751225490196079,506.0,
530,530.0,65613.0,256.0,0.007735906862745098,505.0,
531,531.0,59036.0,256.0,0.007873774509803921,514.0,
532,532.0,54959.0,256.0,0.007904411764705882,516.0,
533,533.0,58143.0,256.0,0.007889093137254902,515.0,
534,534.0,49682.0,256.0,0.007751225490196079,506.0,
535,535.0,66597.0,256.0,0.00784313725490196,512.0,
536,536.0,60844.0,256.0,0.007904411764705882,516.0,
537,537.0,60257.0,256.0,0.007889093137254902,515.0,
538,538.0,51829.0,256.0,0.007598039215686274,496.0,
539,539.0,57438.0,256.0,0.007552083333333333,493.0,
540,540.0,59459.0,256.0,0.007720588235294118,504.0,
541,541.0,60610.0,256.0,0.008011642156862744,523.0,
542,542.0,59079.0,256.0,0.007751225490196079,506.0,
543,543.0,57088.0,256.0,0.007735906862745098,505.0,
544,544.0,58105.0,256.0,0.007858455882352941,513.0,
545,545.0,64762.0,256.0,0.007781862745098039,508.0,
546,546.0,60568.0,256.0,0.007935049019607843,518.0,
547,547.0,65115.0,256.0,0.008088235294117648,528.0,
548,548.0,64586.0,256.0,0.008103553921568628,529.0,
549,549.0,66741.0,256.0,0.008318014705882353,543.0,
550,550.0,61544.0,256.0,0.008455882352941176,552.0,
551,551.0,66313.0,256.0,0.008471200980392156,553.0,
552,552.0,47923.0,256.0,0.008471200980392156,553.0,
553,553.0,59076.0,256.0,0.008318014705882353,543.0,
554,554.0,53977.0,256.0,0.008425245098039215,550.0,
555,555.0,59447.0,256.0,0.008532475490196078,557.0,
556,556.0,56882.0,256.0,0.008425245098039215,550.0,
557,557.0,64509.0,256.0,0.00819546568627451,535.0,
558,558.0,50860.0,256.0,0.008103553921568628,529.0,
559,559.0,70033.0,256.0,0.008455882352941176,552.0,
560,560.0,75412.0,256.0,0.008471200980392156,553.0,
561,561.0,63462.0,256.0,0.008792892156862745,574.0,
562,562.0,62096.0,256.0,0.008716299019607843,569.0,
563,563.0,57249.0,256.0,0.008655024509803922,565.0,
564,564.0,60963.0,256.0,0.008609068627450981,562.0,
565,565.0,62636.0,256.0,0.00856311274509804,559.0,
566,566.0,65306.0,256.0,0.008471200980392156,553.0,
567,567.0,56465.0,256.0,0.008348651960784314,545.0,
568,568.0,56401.0,256.0,0.008287377450980392,541.0,
569,569.0,54486.0,256.0,0.00821078431372549,536.0,
570,570.0,61658.0,256.0,0.00819546568627451,535.0,
571,571.0,55322.0,256.0,0.007950367647058823,519.0,
572,572.0,61749.0,256.0,0.007766544117647059,507.0,
573,573.0,63155.0,256.0,0.007889093137254902,515.0,
574,574.0,65628.0,256.0,0.007582720588235294,495.0,
575,575.0,49268.0,256.0,0.007536764705882353,492.0,
576,576.0,60028.0,256.0,0.007552083333333333,493.0,
577,577.0,56430.0,256.0,0.007628676470588235,498.0,
578,578.0,57234.0,256.0,0.007598039215686274,496.0,
579,579.0,66992.0,256.0,0.007705269607843138,503.0,
580,580.0,65718.0,256.0,0.0078125,510.0,
581,581.0,59097.0,256.0,0.007674632352941176,501.0,
582,582.0,60970.0,256.0,0.007261029411764706,474.0,
583,583.0,50650.0,256.0,0.007261029411764706,474.0,
584,584.0,56184.0,256.0,0.007123161764705882,465.0,
585,585.0,51697.0,256.0,0.007306985294117647,477.0,
586,586.0,66669.0,256.0,0.007521446078431373,491.0,
587,587.0,64134.0,256.0,0.007506127450980392,490.0,
588,588.0,60189.0,256.0,0.007598039215686274,496.0,
589,589.0,65430.0,256.0,0.007904411764705882,516.0,
590,590.0,68385.0,256.0,0.007751225490196079,506.0,
591,591.0,52404.0,256.0,0.007858455882352941,513.0,
592,592.0,65472.0,256.0,0.007720588235294118,504.0,
593,593.0,56475.0,256.0,0.007781862745098039,508.0,
594,594.0,61578.0,256.0,0.007751225490196079,506.0,
595,595.0,61528.0,256.0,0.0078125,510.0,
596,596.0,63239.0,256.0,0.00782781862745098,511.0,
597,597.0,60159.0,256.0,0.007935049019607843,518.0,
598,598.0,66151.0,256.0,0.007689950980392156,502.0,
599,599.0,58432.0,256.0,0.00782781862745098,511.0,
600,600.0,66875.0,256.0,0.007766544117647059,507.0,
601,601.0,51061.0,256.0,0.0078125,510.0,
602,602.0,63782.0,256.0,0.007873774509803921,514.0,
603,603.0,65485.0,256.0,0.00784313725490196,512.0,
604,604.0,66210.0,256.0,0.00779718137254902,509.0,
605,605.0,63689.0,256.0,0.007889093137254902,515.0,
606,606.0,63565.0,256.0,0.007996323529411764,522.0,
607,607.0,71139.0,256.0,0.008103553921568628,529.0,
608,608.0,65786.0,256.0,0.00822610294117647,537.0,
609,609.0,59155.0,256.0,0.008134191176470589,531.0,
610,610.0,71494.0,256.0,0.008348651960784314,545.0,
611,611.0,56172.0,256.0,0.007965686274509803,520.0,
612,612.0,50068.0,256.0,0.0078125,510.0,
613,613.0,59525.0,256.0,0.00784313725490196,512.0,
614,614.0,59083.0,256.0,0.007689950980392156,502.0,
615,615.0,64860.0,256.0,0.007521446078431373,491.0,
616,616.0,57407.0,256.0,0.007337622549019608,479.0,
617,617.0,57897.0,256.0,0.007475490196078432,488.0,
618,618.0,55285.0,256.0,0.007598039215686274,496.0,
619,619.0,62748.0,256.0,0.007659313725490196,500.0,
620,620.0,61376.0,256.0,0.007659313725490196,500.0,
621,621.0,59110.0,256.0,0.007659313725490196,500.0,
622,622.0,57596.0,256.0,0.007613357843137255,497.0,
623,623.0,59889.0,256.0,0.007735906862745098,505.0,
624,624.0,66978.0,256.0,0.007674632352941176,501.0,
625,625.0,69132.0,256.0,0.008026960784313725,524.0,
626,626.0,58426.0,256.0,0.008057598039215687,526.0,
627,627.0,69980.0,256.0,0.008042279411764705,525.0,
628,628.0,68004.0,256.0,0.007919730392156862,517.0,
629,629.0,67136.0,256.0,0.007889093137254902,515.0,
630,630.0,59113.0,256.0,0.008103553921568628,529.0,
631,631.0,70303.0,256.0,0.00816482843137255,533.0,
632,632.0,59594.0,256.0,0.008272058823529412,540.0,
633,633.0,56942.0,256.0,0.00819546568627451,535.0,
634,634.0,57163.0,256.0,0.008088235294117648,528.0,
635,635.0,66918.0,256.0,0.007981004901960784,521.0,
636,636.0,66359.0,256.0,0.008011642156862744,523.0,
637,637.0,58338.0,256.0,0.00819546568627451,535.0,
638,638.0,67966.0,256.0,0.008088235294117648,528.0,
639,639.0,62513.0,256.0,0.008103553921568628,529.0,
640,640.0,65859.0,256.0,0.008256740196078432,539.0,
641,641.0,61807.0,256.0,0.00822610294117647,537.0,
642,642.0,65747.0,256.0,0.008287377450980392,541.0,
643,643.0,70911.0,256.0,0.008088235294117648,528.0,
644,644.0,60188.0,256.0,0.007950367647058823,519.0,
645,645.0,62751.0,256.0,0.007935049019607843,518.0,
646,646.0,63326.0,256.0,0.007965686274509803,520.0,
647,647.0,58936.0,256.0,0.007965686274509803,520.0,
648,648.0,62345.0,256.0,0.007873774509803921,514.0,
649,649.0,66089.0,256.0,0.008072916666666667,527.0,
650,650.0,64117.0,256.0,0.00818014705882353,534.0,
651,651.0,66033.0,256.0,0.008394607843137255,548.0,
652,652.0,65745.0,256.0,0.008486519607843137,554.0,
653,653.0,69560.0,256.0,0.008486519607843137,554.0,
654,654.0,67349.0,256.0,0.008409926470588235,549.0,
655,655.0,68560.0,256.0,0.008333333333333333,544.0,
656,656.0,64254.0,256.0,0.008486519607843137,554.0,
657,657.0,61252.0,256.0,0.008501838235294117,555.0,
658,658.0,72603.0,256.0,0.008624387254901961,563.0,
659,659.0,74130.0,256.0,0.008731617647058824,570.0,
660,660.0,72706.0,256.0,0.008639705882352942,564.0,
661,661.0,69792.0,256.0,0.008609068627450981,562.0,
662,662.0,77942.0,256.0,0.008792892156862745,574.0,
663,663.0,70830.0,256.0,0.008808210784313725,575.0,
664,664.0,68384.0,256.0,0.008946078431372548,584.0,
665,665.0,69176.0,256.0,0.009129901960784314,596.0,
666,666.0,68508.0,256.0,0.009037990196078432,590.0,
667,667.0,60699.0,256.0,0.009129901960784314,596.0,
668,668.0,67582.0,256.0,0.008915441176470588,582.0,
669,669.0,56183.0,256.0,0.008808210784313725,575.0,
670,670.0,62973.0,256.0,0.008685661764705883,567.0,
671,671.0,70647.0,256.0,0.008777573529411765,573.0,
672,672.0,66225.0,256.0,0.008823529411764706,576.0,
673,673.0,61151.0,256.0,0.008746936274509804,571.0,
674,674.0,67541.0,256.0,0.008838848039215686,577.0,
675,675.0,76519.0,256.0,0.008930759803921568,583.0,
676,676.0,67903.0,256.0,0.00899203431372549,587.0,
677,677.0,61871.0,256.0,0.009068627450980393,592.0,
678,678.0,66249.0,256.0,0.008823529411764706,576.0,
679,679.0,49578.0,256.0,0.00854779411764706,558.0,
680,680.0,70402.0,256.0,0.008685661764705883,567.0,
681,681.0,65027.0,256.0,0.008532475490196078,557.0,
682,682.0,62044.0,256.0,0.008685661764705883,567.0,
683,683.0,67301.0,256.0,0.008685661764705883,567.0,
684,684.0,58721.0,256.0,0.008792892156862745,574.0,
685,685.0,57720.0,256.0,0.008808210784313725,575.0,
686,686.0,50445.0,256.0,0.008946078431372548,584.0,
687,687.0,55759.0,256.0,0.00899203431372549,587.0,
688,688.0,60180.0,256.0,0.008946078431372548,584.0,
689,689.0,68792.0,256.0,0.008792892156862745,574.0,
690,690.0,56951.0,256.0,0.008716299019607843,569.0,
691,691.0,63570.0,256.0,0.00854779411764706,558.0,
692,692.0,57425.0,256.0,0.00816482843137255,533.0,
693,693.0,51216.0,256.0,0.007950367647058823,519.0,
694,694.0,45985.0,256.0,0.007643995098039215,499.0,
695,695.0,52518.0,256.0,0.007460171568627451,487.0,
696,696.0,55116.0,256.0,0.007582720588235294,495.0,
697,697.0,56516.0,256.0,0.007398897058823529,483.0,
698,698.0,50121.0,256.0,0.007352941176470588,480.0,
699,699.0,48211.0,256.0,0.007291666666666667,476.0,
700,700.0,60663.0,256.0,0.007398897058823529,483.0,
701,701.0,59518.0,256.0,0.007460171568627451,487.0,
702,702.0,53986.0,256.0,0.007490808823529412,489.0,
703,703.0,55907.0,256.0,0.00744485294117647,486.0,
704,704.0,52914.0,256.0,0.0073682598039215685,481.0,
705,705.0,61625.0,256.0,0.007659313725490196,500.0,
706,706.0,61501.0,256.0,0.007751225490196079,506.0,
707,707.0,56965.0,256.0,0.007705269607843138,503.0,
708,708.0,57890.0,256.0,0.007766544117647059,507.0,
709,709.0,56714.0,256.0,0.008088235294117648,528.0,
710,710.0,60600.0,256.0,0.008072916666666667,527.0,
711,711.0,63327.0,256.0,0.008134191176470589,531.0,
712,712.0,61055.0,256.0,0.008241421568627451,538.0,
713,713.0,61260.0,256.0,0.008318014705882353,543.0,
714,714.0,60570.0,256.0,0.00859375,561.0,
715,715.0,65566.0,256.0,0.008609068627450981,562.0,
716,716.0,58173.0,256.0,0.008762254901960784,572.0,
717,717.0,63129.0,256.0,0.008762254901960784,572.0,
718,718.0,66159.0,256.0,0.008869485294117647,579.0,
719,719.0,69523.0,256.0,0.008869485294117647,579.0,
720,720.0,66641.0,256.0,0.008900122549019607,581.0,
721,721.0,63124.0,256.0,0.008900122549019607,581.0,
722,722.0,60886.0,256.0,0.008762254901960784,572.0,
723,723.0,57034.0,256.0,0.00857843137254902,560.0,
724,724.0,55044.0,256.0,0.008333333333333333,544.0,
725,725.0,59058.0,256.0,0.008241421568627451,538.0,
726,726.0,67014.0,256.0,0.008609068627450981,562.0,
727,727.0,68200.0,256.0,0.008425245098039215,550.0,
728,728.0,66424.0,256.0,0.008363970588235294,546.0,
729,729.0,63277.0,256.0,0.008379289215686274,547.0,
730,730.0,58597.0,256.0,0.008471200980392156,553.0,
731,731.0,70731.0,256.0,0.008409926470588235,549.0,
732,732.0,59131.0,256.0,0.008685661764705883,567.0,
733,733.0,63377.0,256.0,0.008670343137254902,566.0,
734,734.0,66842.0,256.0,0.008501838235294117,555.0,
735,735.0,70693.0,256.0,0.008517156862745097,556.0,
736,736.0,71219.0,256.0,0.008486519607843137,554.0,
737,737.0,65811.0,256.0,0.008471200980392156,553.0,
738,738.0,66613.0,256.0,0.008685661764705883,567.0,
739,739.0,70320.0,256.0,0.008762254901960784,572.0,
740,740.0,67305.0,256.0,0.008624387254901961,563.0,
741,741.0,65591.0,256.0,0.008501838235294117,555.0,
742,742.0,70576.0,256.0,0.008471200980392156,553.0,
743,743.0,69387.0,256.0,0.008808210784313725,575.0,
744,744.0,70033.0,256.0,0.008792892156862745,574.0,
745,745.0,63400.0,256.0,0.00897671568627451,586.0,
746,746.0,52605.0,256.0,0.008777573529411765,573.0,
747,747.0,61248.0,256.0,0.009053308823529413,591.0,
748,748.0,81077.0,256.0,0.009175857843137255,599.0,
749,749.0,76537.0,256.0,0.009160539215686275,598.0,
750,750.0,70073.0,256.0,0.009237132352941177,603.0,
751,751.0,76140.0,256.0,0.009053308823529413,591.0,
752,752.0,65220.0,256.0,0.008854166666666666,578.0,
753,753.0,72860.0,256.0,0.008792892156862745,574.0,
754,754.0,68757.0,256.0,0.008946078431372548,584.0,
755,755.0,65716.0,256.0,0.008731617647058824,570.0,
756,756.0,64733.0,256.0,0.008624387254901961,563.0,
757,757.0,61335.0,256.0,0.008639705882352942,564.0,
758,758.0,61473.0,256.0,0.008639705882352942,564.0,
759,759.0,69957.0,256.0,0.008762254901960784,572.0,
760,760.0,75638.0,256.0,0.008792892156862745,574.0,
761,761.0,69974.0,256.0,0.008731617647058824,570.0,
762,762.0,63091.0,256.0,0.008792892156862745,574.0,
763,763.0,69221.0,256.0,0.008746936274509804,571.0,
764,764.0,68680.0,256.0,0.008854166666666666,578.0,
765,765.0,67356.0,256.0,0.008854166666666666,578.0,
766,766.0,66417.0,256.0,0.008946078431372548,584.0,
767,767.0,62445.0,256.0,0.008946078431372548,584.0,
768,768.0,53460.0,256.0,0.008808210784313725,575.0,
769,769.0,58327.0,256.0,0.008655024509803922,565.0,
770,770.0,60466.0,256.0,0.008624387254901961,563.0,
771,771.0,70992.0,256.0,0.008639705882352942,564.0,
772,772.0,66766.0,256.0,0.008363970588235294,546.0,
773,773.0,66293.0,256.0,0.008440563725490196,551.0,
774,774.0,70460.0,256.0,0.008624387254901961,563.0,
775,775.0,66058.0,256.0,0.008915441176470588,582.0,
776,776.0,66294.0,256.0,0.008838848039215686,577.0,
777,777.0,66051.0,256.0,0.008731617647058824,570.0,
778,778.0,66905.0,256.0,0.008792892156862745,574.0,
779,779.0,66482.0,256.0,0.008731617647058824,570.0,
780,780.0,65758.0,256.0,0.008838848039215686,577.0,
781,781.0,69586.0,256.0,0.00897671568627451,586.0,
782,782.0,61594.0,256.0,0.009053308823529413,591.0,
783,783.0,57234.0,256.0,0.009068627450980393,592.0,
784,784.0,63204.0,256.0,0.008731617647058824,570.0,
785,785.0,61858.0,256.0,0.008685661764705883,567.0,
786,786.0,56323.0,256.0,0.008731617647058824,570.0,
787,787.0,61951.0,256.0,0.008762254901960784,572.0,
788,788.0,66587.0,256.0,0.008838848039215686,577.0,
789,789.0,47723.0,256.0,0.008425245098039215,550.0,
790,790.0,62247.0,256.0,0.008318014705882353,543.0,
791,791.0,48772.0,256.0,0.008318014705882353,543.0,
792,792.0,66463.0,256.0,0.008256740196078432,539.0,
793,793.0,64124.0,256.0,0.008287377450980392,541.0,
794,794.0,60096.0,256.0,0.008318014705882353,543.0,
795,795.0,71620.0,256.0,0.008302696078431373,542.0,
796,796.0,67772.0,256.0,0.008302696078431373,542.0,
797,797.0,77052.0,256.0,0.008455882352941176,552.0,
798,798.0,70958.0,256.0,0.008700980392156863,568.0,
799,799.0,73226.0,256.0,0.008746936274509804,571.0,
800,800.0,66571.0,256.0,0.00899203431372549,587.0,
801,801.0,70757.0,256.0,0.009160539215686275,598.0,
802,802.0,69681.0,256.0,0.009329044117647059,609.0,
803,803.0,78461.0,256.0,0.009528186274509805,622.0,
804,804.0,80610.0,256.0,0.009666053921568628,631.0,
805,805.0,73092.0,256.0,0.009696691176470588,633.0,
806,806.0,69884.0,256.0,0.009589460784313726,626.0,
807,807.0,74986.0,256.0,0.009497549019607842,620.0,
808,808.0,69390.0,256.0,0.009497549019607842,620.0,
809,809.0,59929.0,256.0,0.009436274509803921,616.0,
810,810.0,68866.0,256.0,0.009497549019607842,620.0,
811,811.0,72657.0,256.0,0.009528186274509805,622.0,
812,812.0,65225.0,256.0,0.009635416666666667,629.0,
813,813.0,76613.0,256.0,0.009589460784313726,626.0,
814,814.0,65551.0,256.0,0.009466911764705882,618.0,
815,815.0,63267.0,256.0,0.009451593137254901,617.0,
816,816.0,68429.0,256.0,0.009206495098039216,601.0,
817,817.0,63113.0,256.0,0.00899203431372549,587.0,
818,818.0,69158.0,256.0,0.009114583333333334,595.0,
819,819.0,62128.0,256.0,0.009298406862745098,607.0,
820,820.0,71117.0,256.0,0.009206495098039216,601.0,
821,821.0,74639.0,256.0,0.00972732843137255,635.0,
822,822.0,70758.0,256.0,0.009681372549019608,632.0,
823,823.0,73508.0,256.0,0.009558823529411765,624.0,
824,824.0,63742.0,256.0,0.00939031862745098,613.0,
825,825.0,63243.0,256.0,0.00940563725490196,614.0,
826,826.0,62582.0,256.0,0.009436274509803921,616.0,
827,827.0,66034.0,256.0,0.009267769607843137,605.0,
828,828.0,64915.0,256.0,0.009267769607843137,605.0,
829,829.0,66354.0,256.0,0.009436274509803921,616.0,
830,830.0,55897.0,256.0,0.009329044117647059,609.0,
831,831.0,64239.0,256.0,0.00902267156862745,589.0,
832,832.0,61897.0,256.0,0.008746936274509804,571.0,
833,833.0,64674.0,256.0,0.008670343137254902,566.0,
834,834.0,67480.0,256.0,0.00856311274509804,559.0,
835,835.0,65006.0,256.0,0.008777573529411765,573.0,
836,836.0,65214.0,256.0,0.008624387254901961,563.0,
837,837.0,67539.0,256.0,0.008762254901960784,572.0,
838,838.0,72471.0,256.0,0.008808210784313725,575.0,
839,839.0,67405.0,256.0,0.009037990196078432,590.0,
840,840.0,65582.0,256.0,0.008900122549019607,581.0,
841,841.0,60530.0,256.0,0.009206495098039216,601.0,
842,842.0,65741.0,256.0,0.00939031862745098,613.0,
843,843.0,69123.0,256.0,0.009466911764705882,618.0,
844,844.0,71631.0,256.0,0.009589460784313726,626.0,
845,845.0,77722.0,256.0,0.009574142156862746,625.0,
846,846.0,74505.0,256.0,0.009512867647058823,621.0,
847,847.0,68957.0,256.0,0.009497549019607842,620.0,
848,848.0,61648.0,256.0,0.009543504901960785,623.0,
849,849.0,64505.0,256.0,0.009543504901960785,623.0,
850,850.0,70462.0,256.0,0.009313725490196078,608.0,
851,851.0,61857.0,256.0,0.009313725490196078,608.0,
852,852.0,76039.0,256.0,0.009267769607843137,605.0,
853,853.0,68442.0,256.0,0.009313725490196078,608.0,
854,854.0,65737.0,256.0,0.009329044117647059,609.0,
855,855.0,72670.0,256.0,0.009451593137254901,617.0,
856,856.0,69929.0,256.0,0.00942095588235294,615.0,
857,857.0,66470.0,256.0,0.009451593137254901,617.0,
858,858.0,64128.0,256.0,0.009604779411764706,627.0,
859,859.0,60268.0,256.0,0.00977328431372549,638.0,
860,860.0,75567.0,256.0,0.009819240196078431,641.0,
861,861.0,78321.0,256.0,0.010018382352941177,654.0,
862,862.0,73111.0,256.0,0.010217524509803922,667.0,
863,863.0,64909.0,256.0,0.010018382352941177,654.0,
864,864.0,64386.0,256.0,0.010202205882352941,666.0,
865,865.0,75308.0,256.0,0.01012561274509804,661.0,
866,866.0,68221.0,256.0,0.010079656862745099,658.0,
867,867.0,69083.0,256.0,0.010018382352941177,654.0,
868,868.0,76256.0,256.0,0.010094975490196079,659.0,
869,869.0,72263.0,256.0,0.010202205882352941,666.0,
870,870.0,78135.0,256.0,0.010309436274509804,673.0,
871,871.0,70330.0,256.0,0.010217524509803922,667.0,
872,872.0,68813.0,256.0,0.01015625,663.0,
873,873.0,64277.0,256.0,0.009941789215686274,649.0,
874,874.0,67288.0,256.0,0.00975796568627451,637.0,
875,875.0,73554.0,256.0,0.009941789215686274,649.0,
876,876.0,72737.0,256.0,0.009957107843137254,650.0,
877,877.0,72436.0,256.0,0.009865196078431372,644.0,
878,878.0,79566.0,256.0,0.009880514705882353,645.0,
879,879.0,79854.0,256.0,0.009926470588235294,648.0,
880,880.0,78236.0,256.0,0.010033700980392158,655.0,
881,881.0,80356.0,256.0,0.010569852941176471,690.0,
882,882.0,67967.0,256.0,0.010707720588235294,699.0,
883,883.0,75469.0,256.0,0.010723039215686275,700.0,
884,884.0,74602.0,256.0,0.010493259803921568,685.0,
885,885.0,74274.0,256.0,0.010462622549019607,683.0,
886,886.0,79957.0,256.0,0.010615808823529412,693.0,
887,887.0,77931.0,256.0,0.010692401960784314,698.0,
888,888.0,83001.0,256.0,0.010447303921568627,682.0,
889,889.0,68589.0,256.0,0.010248161764705882,669.0,
890,890.0,73749.0,256.0,0.01014093137254902,662.0,
891,891.0,77536.0,256.0,0.009987745098039215,652.0,
892,892.0,85083.0,256.0,0.009957107843137254,650.0,
893,893.0,89545.0,256.0,0.010248161764705882,669.0,
894,894.0,67499.0,256.0,0.01053921568627451,688.0,
895,895.0,87409.0,256.0,0.010799632352941176,705.0,
896,896.0,89273.0,256.0,0.010585171568627452,691.0,
897,897.0,76677.0,256.0,0.01053921568627451,688.0,
898,898.0,74812.0,256.0,0.01050857843137255,686.0,
899,899.0,82755.0,256.0,0.010784313725490196,704.0,
900,900.0,75259.0,256.0,0.010799632352941176,705.0,
901,901.0,96312.0,256.0,0.0109375,714.0,
902,902.0,80217.0,256.0,0.011167279411764706,729.0,
903,903.0,75999.0,256.0,0.011151960784313726,728.0,
904,904.0,74950.0,256.0,0.011121323529411765,726.0,
905,905.0,72966.0,256.0,0.011106004901960785,725.0,
906,906.0,65937.0,256.0,0.011044730392156863,721.0,
907,907.0,72234.0,256.0,0.01095281862745098,715.0,
908,908.0,78219.0,256.0,0.01096813725490196,716.0,
909,909.0,73542.0,256.0,0.011136642156862745,727.0,
910,910.0,86675.0,256.0,0.010922181372549019,713.0,
911,911.0,71448.0,256.0,0.010876225490196078,710.0,
912,912.0,68131.0,256.0,0.010753676470588235,702.0,
913,913.0,74820.0,256.0,0.01095281862745098,715.0,
914,914.0,84194.0,256.0,0.010738357843137255,701.0,
915,915.0,76558.0,256.0,0.010677083333333334,697.0,
916,916.0,63342.0,256.0,0.010723039215686275,700.0,
917,917.0,56793.0,256.0,0.010447303921568627,682.0,
918,918.0,61745.0,256.0,0.010263480392156863,670.0,
919,919.0,74347.0,256.0,0.01011029411764706,660.0,
920,920.0,72091.0,256.0,0.010003063725490195,653.0,
921,921.0,74576.0,256.0,0.009834558823529412,642.0,
922,922.0,64074.0,256.0,0.009558823529411765,624.0,
923,923.0,66454.0,256.0,0.009650735294117647,630.0,
924,924.0,68497.0,256.0,0.009666053921568628,631.0,
925,925.0,72135.0,256.0,0.009558823529411765,624.0,
926,926.0,60154.0,256.0,0.009528186274509805,622.0,
927,927.0,74146.0,256.0,0.009451593137254901,617.0,
928,928.0,71929.0,256.0,0.009620098039215687,628.0,
929,929.0,69688.0,256.0,0.009712009803921569,634.0,
930,930.0,75437.0,256.0,0.009926470588235294,648.0,
931,931.0,63353.0,256.0,0.009957107843137254,650.0,
932,932.0,85490.0,256.0,0.010049019607843138,656.0,
933,933.0,79869.0,256.0,0.01012561274509804,661.0,
934,934.0,78038.0,256.0,0.010217524509803922,667.0,
935,935.0,73962.0,256.0,0.010064338235294118,657.0,
936,936.0,68694.0,256.0,0.010094975490196079,659.0,
937,937.0,77161.0,256.0,0.01014093137254902,662.0,
938,938.0,78752.0,256.0,0.010294117647058823,672.0,
939,939.0,80154.0,256.0,0.010278799019607843,671.0,
940,940.0,80744.0,256.0,0.010493259803921568,685.0,
941,941.0,93602.0,256.0,0.010370710784313725,677.0,
942,942.0,76550.0,256.0,0.010401348039215686,679.0,
943,943.0,84977.0,256.0,0.01050857843137255,686.0,
944,944.0,78706.0,256.0,0.010585171568627452,691.0,
945,945.0,87149.0,256.0,0.010814950980392157,706.0,
946,946.0,84835.0,256.0,0.010646446078431373,695.0,
947,947.0,75033.0,256.0,0.010799632352941176,705.0,
948,948.0,70582.0,256.0,0.011151960784313726,728.0,
949,949.0,93819.0,256.0,0.01132046568627451,739.0,
950,950.0,83056.0,256.0,0.011504289215686275,751.0,
951,951.0,90982.0,256.0,0.011473651960784313,749.0,
952,952.0,94552.0,256.0,0.011534926470588236,753.0,
953,953.0,89574.0,256.0,0.011596200980392157,757.0,
954,954.0,84980.0,256.0,0.011473651960784313,749.0,
955,955.0,84705.0,256.0,0.011412377450980392,745.0,
956,956.0,81647.0,256.0,0.011611519607843138,758.0,
957,957.0,88321.0,256.0,0.011473651960784313,749.0,
958,958.0,76893.0,256.0,0.011443014705882352,747.0,
959,959.0,77768.0,256.0,0.011488970588235295,750.0,
960,960.0,90847.0,256.0,0.011427696078431372,746.0,
961,961.0,77855.0,256.0,0.011121323529411765,726.0,
962,962.0,78718.0,256.0,0.0109375,714.0,
963,963.0,76628.0,256.0,0.011182598039215686,730.0,
964,964.0,85553.0,256.0,0.011534926470588236,753.0,
965,965.0,89620.0,256.0,0.011856617647058823,774.0,
966,966.0,78586.0,256.0,0.011642156862745098,760.0,
967,967.0,70873.0,256.0,0.011580882352941177,756.0,
968,968.0,80722.0,256.0,0.011642156862745098,760.0,
969,969.0,67901.0,256.0,0.011443014705882352,747.0,
970,970.0,85795.0,256.0,0.011274509803921568,736.0,
971,971.0,82720.0,256.0,0.011534926470588236,753.0,
972,972.0,90086.0,256.0,0.011504289215686275,751.0,
973,973.0,82179.0,256.0,0.01171875,765.0,
974,974.0,93559.0,256.0,0.011642156862745098,760.0,
975,975.0,89767.0,256.0,0.01173406862745098,766.0,
976,976.0,79178.0,256.0,0.011611519607843138,758.0,
977,977.0,79989.0,256.0,0.011443014705882352,747.0,
978,978.0,66087.0,256.0,0.01135110294117647,741.0,
979,979.0,84418.0,256.0,0.011519607843137256,752.0,
980,980.0,82579.0,256.0,0.011550245098039216,754.0,
981,981.0,92543.0,256.0,0.011657475490196079,761.0,
982,982.0,81824.0,256.0,0.011534926470588236,753.0,
983,983.0,74161.0,256.0,0.011550245098039216,754.0,
984,984.0,72997.0,256.0,0.011182598039215686,730.0,
985,985.0,75628.0,256.0,0.01130514705882353,738.0,
986,986.0,76405.0,256.0,0.011213235294117647,732.0,
987,987.0,64495.0,256.0,0.01130514705882353,738.0,
988,988.0,57913.0,256.0,0.011397058823529411,744.0,
989,989.0,72449.0,256.0,0.011060049019607844,722.0,
990,990.0,70864.0,256.0,0.010784313725490196,704.0,
991,991.0,85370.0,256.0,0.010753676470588235,702.0,
992,992.0,82203.0,256.0,0.010677083333333334,697.0,
993,993.0,82950.0,256.0,0.010661764705882353,696.0,
994,994.0,80059.0,256.0,0.010692401960784314,698.0,
995,995.0,75890.0,256.0,0.010600490196078432,692.0,
996,996.0,81027.0,256.0,0.010631127450980393,694.0,
997,997.0,77820.0,256.0,0.01050857843137255,686.0,
998,998.0,72116.0,256.0,0.010370710784313725,677.0,
999,999.0,68439.0,256.0,0.010416666666666666,680.0,
