0,0.0,0.0,2.0,0_1,711_0,95
1,1.0,6551.0,2.0,0_1,811_0,124
2,2.0,3658.0,2.0,0_1,791_0,125
3,3.0,3582.0,2.0,0_1,671_0,123
4,4.0,3081.0,2.0,0_1,721_0,114
5,5.0,3722.0,2.0,0_1,781_0,107
6,6.0,3541.0,2.0,0_1,851_0,101
7,7.0,3686.0,2.0,0_1,931_0,99
8,8.0,3206.0,2.0,0_1,971_0,101
9,9.0,3962.0,2.0,0_1,1001_0,108
10,10.0,3968.0,2.0,0_1,1031_0,110
11,11.0,4230.0,2.0,0_1,1061_0,117
12,12.0,5419.0,2.0,0_1,1121_0,125
13,13.0,5144.0,2.0,0_1,1211_0,136
14,14.0,6172.0,2.0,0_1,1361_0,149
15,15.0,6499.0,2.0,0_1,1411_0,161
16,16.0,7434.0,2.0,0_1,1481_0,173
17,17.0,4361.0,2.0,0_1,1541_0,174
18,18.0,7350.0,2.0,0_1,1521_0,177
19,19.0,5405.0,2.0,0_1,1581_0,182
20,20.0,6822.0,2.0,0_1,1691_0,189
21,21.0,6767.0,2.0,0_1,1751_0,199
22,22.0,6996.0,2.0,0_1,1881_0,195
23,23.0,6295.0,2.0,0_1,2001_0,190
24,24.0,7305.0,2.0,0_1,1991_0,196
25,25.0,6160.0,2.0,0_1,2001_0,202
26,26.0,8536.0,2.0,0_1,2071_0,205
27,27.0,7917.0,2.0,0_1,2081_0,214
28,28.0,9200.0,2.0,0_1,2121_0,223
29,29.0,7687.0,2.0,0_1,2201_0,230
30,30.0,7729.0,2.0,0_1,2281_0,242
31,31.0,9074.0,2.0,0_1,2311_0,237
32,32.0,7478.0,2.0,0_1,2351_0,244
33,33.0,8729.0,2.0,0_1,2471_0,254
34,34.0,9287.0,2.0,0_1,2551_0,259
35,35.0,6681.0,2.0,0_1,2611_0,266
36,36.0,8732.0,2.0,0_1,2591_0,271
37,37.0,10978.0,2.0,0_1,2681_0,283
38,38.0,9824.0,2.0,0_1,2691_0,284
39,39.0,10098.0,2.0,0_1,2801_0,290
40,40.0,8690.0,2.0,0_1,2821_0,294
41,41.0,10065.0,2.0,0_1,2951_0,304
42,42.0,12469.0,2.0,0_1,2941_0,301
43,43.0,10292.0,2.0,0_1,3021_0,312
44,44.0,10823.0,2.0,0_1,3191_0,326
45,45.0,12144.0,2.0,0_1,3251_0,332
46,46.0,10948.0,2.0,0_1,3281_0,335
47,47.0,10746.0,2.0,0_1,3401_0,343
48,48.0,12510.0,2.0,0_1,3491_0,352
49,49.0,10645.0,2.0,0_1,3601_0,360
50,50.0,12977.0,2.0,0_1,3621_0,354
51,51.0,9257.0,2.0,0_1,3731_0,357
52,52.0,14093.0,2.0,0_1,3781_0,359
53,53.0,8975.0,2.0,0_1,3881_0,364
54,54.0,13554.0,2.0,0_1,3961_0,373
55,55.0,13758.0,2.0,0_1,4001_0,384
56,56.0,10818.0,2.0,0_1,4001_0,395
57,57.0,12188.0,2.0,0_1,4001_0,385
58,58.0,13006.0,2.0,0_1,4131_0,383
59,59.0,11658.0,2.0,0_1,4111_0,391
60,60.0,14301.0,2.0,0_1,4131_0,395
61,61.0,12228.0,2.0,0_1,4211_0,394
62,62.0,12317.0,2.0,0_1,4211_0,408
63,63.0,14636.0,2.0,0_1,4291_0,412
64,64.0,14520.0,2.0,0_1,4381_0,416
65,65.0,11567.0,2.0,0_1,4421_0,425
66,66.0,13397.0,2.0,0_1,4361_0,427
67,67.0,12642.0,2.0,0_1,4401_0,438
68,68.0,14208.0,2.0,0_1,4461_0,445
69,69.0,14779.0,2.0,0_1,4561_0,446
70,70.0,16114.0,2.0,0_1,4521_0,454
71,71.0,14789.0,2.0,0_1,4601_0,454
72,72.0,13113.0,2.0,0_1,4801_0,454
73,73.0,17064.0,2.0,0_1,4791_0,473
74,74.0,12308.0,2.0,0_1,4771_0,466
75,75.0,16418.0,2.0,0_1,4891_0,476
76,76.0,16918.0,2.0,0_1,5001_0,484
77,77.0,15508.0,2.0,0_1,5051_0,485
78,78.0,14740.0,2.0,0_1,5211_0,503
79,79.0,15767.0,2.0,0_1,5301_0,503
80,80.0,15970.0,2.0,0_1,5421_0,516
81,81.0,17691.0,2.0,0_1,5541_0,522
82,82.0,15458.0,2.0,0_1,5601_0,518
83,83.0,18303.0,2.0,0_1,5531_0,518
84,84.0,15688.0,2.0,0_1,5661_0,530
85,85.0,15246.0,2.0,0_1,5411_0,539
86,86.0,17847.0,2.0,0_1,5491_0,546
87,87.0,18166.0,2.0,0_1,5431_0,553
88,88.0,17914.0,2.0,0_1,5461_0,560
89,89.0,19434.0,2.0,0_1,5521_0,570
90,90.0,15353.0,2.0,0_1,5531_0,565
91,91.0,18090.0,2.0,0_1,5631_0,572
92,92.0,21170.0,2.0,0_1,5731_0,586
93,93.0,17069.0,2.0,0_1,5871_0,599
94,94.0,22251.0,2.0,0_1,5891_0,605
95,95.0,17233.0,2.0,0_1,6141_0,608
96,96.0,18572.0,2.0,0_1,6001_0,618
97,97.0,18815.0,2.0,0_1,5921_0,632
98,98.0,16165.0,2.0,0_1,6071_0,633
99,99.0,19303.0,2.0,0_1,6021_0,626
100,100.0,16630.0,2.0,0_1,6031_0,628
101,101.0,19439.0,2.0,0_1,6121_0,602
102,102.0,18465.0,2.0,0_1,6291_0,589
103,103.0,20694.0,2.0,0_1,6361_0,594
104,104.0,20639.0,2.0,0_1,6541_0,590
105,105.0,22487.0,2.0,0_1,6751_0,609
106,106.0,18665.0,2.0,0_1,6881_0,611
107,107.0,19708.0,2.0,0_1,6991_0,620
108,108.0,20925.0,2.0,0_1,6851_0,648
109,109.0,22516.0,2.0,0_1,6881_0,673
110,110.0,17631.0,2.0,0_1,6851_0,665
111,111.0,17982.0,2.0,0_1,6871_0,661
112,112.0,18231.0,2.0,0_1,6861_0,656
113,113.0,18735.0,2.0,0_1,7101_0,674
114,114.0,24836.0,2.0,0_1,7001_0,670
115,115.0,21072.0,2.0,0_1,7001_0,683
116,116.0,23909.0,2.0,0_1,6861_0,696
117,117.0,22701.0,2.0,0_1,7141_0,713
118,118.0,25074.0,2.0,0_1,7231_0,714
119,119.0,23949.0,2.0,0_1,7331_0,721
120,120.0,22822.0,2.0,0_1,7271_0,733
121,121.0,21729.0,2.0,0_1,7371_0,737
122,122.0,23089.0,2.0,0_1,7361_0,729
123,123.0,23324.0,2.0,0_1,7541_0,745
124,124.0,23789.0,2.0,0_1,7601_0,777
125,125.0,27945.0,2.0,0_1,7651_0,818
126,126.0,21808.0,2.0,0_1,7871_0,820
127,127.0,28954.0,2.0,0_1,7971_0,837
128,128.0,25840.0,2.0,0_1,8071_0,856
129,129.0,21426.0,2.0,0_1,8111_0,849
130,130.0,20675.0,2.0,0_1,8141_0,830
131,131.0,26224.0,2.0,0_1,8401_0,854
132,132.0,26442.0,2.0,0_1,8451_0,879
133,133.0,31929.0,2.0,0_1,8651_0,887
134,134.0,24732.0,2.0,0_1,8721_0,869
135,135.0,27126.0,2.0,0_1,8911_0,857
136,136.0,27911.0,2.0,0_1,9291_0,845
137,137.0,28776.0,2.0,0_1,9651_0,858
138,138.0,31921.0,2.0,0_1,9731_0,882
139,139.0,28639.0,2.0,0_1,9861_0,888
140,140.0,27847.0,2.0,0_1,9931_0,896
141,141.0,29075.0,2.0,0_1,9601_0,896
142,142.0,26137.0,2.0,0_1,9711_0,894
143,143.0,31799.0,2.0,0_1,9831_0,896
144,144.0,32208.0,2.0,0_1,9751_0,915
145,145.0,27981.0,2.0,0_1,9731_0,916
146,146.0,31382.0,2.0,0_1,9611_0,911
147,147.0,28368.0,2.0,0_1,9841_0,928
148,148.0,25750.0,2.0,0_1,9741_0,927
149,149.0,29522.0,2.0,0_1,9881_0,915
150,150.0,33166.0,2.0,0_1,10211_0,963
151,151.0,35414.0,2.0,0_1,10491_0,989
152,152.0,33410.0,2.0,0_1,10471_0,1016
153,153.0,26589.0,2.0,0_1,10501_0,991
154,154.0,25008.0,2.0,0_1,10481_0,997
155,155.0,31310.0,2.0,0_1,10801_0,1035
156,156.0,35753.0,2.0,0_1,10921_0,1040
157,157.0,33600.0,2.0,0_1,10771_0,1078
158,158.0,31821.0,2.0,0_1,10441_0,1096
159,159.0,29792.0,2.0,0_1,10581_0,1089
160,160.0,28996.0,2.0,0_1,10781_0,1088
161,161.0,31811.0,2.0,0_1,10751_0,1049
162,162.0,26067.0,2.0,0_1,10781_0,1030
163,163.0,35563.0,2.0,0_1,10941_0,1016
164,164.0,32120.0,2.0,0_1,10911_0,1004
165,165.0,31242.0,2.0,0_1,10991_0,977
166,166.0,33848.0,2.0,0_1,11021_0,989
167,167.0,27226.0,2.0,0_1,11121_0,1024
168,168.0,33811.0,2.0,0_1,11051_0,1052
169,169.0,34108.0,2.0,0_1,11241_0,1075
170,170.0,38033.0,2.0,0_1,11351_0,1107
171,171.0,38804.0,2.0,0_1,11311_0,1109
172,172.0,36525.0,2.0,0_1,11461_0,1129
173,173.0,38615.0,2.0,0_1,11521_0,1112
174,174.0,28400.0,2.0,0_1,11611_0,1124
175,175.0,35479.0,2.0,0_1,12131_0,1210
176,176.0,40405.0,2.0,0_1,12441_0,1225
177,177.0,36888.0,2.0,0_1,12591_0,1208
178,178.0,34980.0,2.0,0_1,12591_0,1234
179,179.0,36162.0,2.0,0_1,12641_0,1266
180,180.0,44203.0,2.0,0_1,12771_0,1302
181,181.0,41011.0,2.0,0_1,12961_0,1311
182,182.0,41439.0,2.0,0_1,12921_0,1301
183,183.0,35605.0,2.0,0_1,13271_0,1325
184,184.0,48865.0,2.0,0_1,13481_0,1312
185,185.0,41747.0,2.0,0_1,13441_0,1311
186,186.0,42720.0,2.0,0_1,13801_0,1331
187,187.0,44239.0,2.0,0_1,13691_0,1357
188,188.0,37434.0,2.0,0_1,13951_0,1367
189,189.0,40293.0,2.0,0_1,13841_0,1371
190,190.0,41200.0,2.0,0_1,14041_0,1405
191,191.0,37260.0,2.0,0_1,13931_0,1393
192,192.0,37703.0,2.0,0_1,13971_0,1377
193,193.0,42634.0,2.0,0_1,13611_0,1350
194,194.0,32735.0,2.0,0_1,13741_0,1335
195,195.0,39412.0,2.0,0_1,13641_0,1358
196,196.0,40322.0,2.0,0_1,13471_0,1375
197,197.0,41714.0,2.0,0_1,13441_0,1351
198,198.0,40702.0,2.0,0_1,13541_0,1393
199,199.0,43490.0,2.0,0_1,13641_0,1382
200,200.0,39810.0,2.0,0_1,13531_0,1377
201,201.0,34708.0,2.0,0_1,13501_0,1366
202,202.0,44395.0,2.0,0_1,13611_0,1349
203,203.0,36207.0,2.0,0_1,13481_0,1331
204,204.0,34099.0,2.0,0_1,13271_0,1304
205,205.0,35032.0,2.0,0_1,13171_0,1261
206,206.0,37385.0,2.0,0_1,12981_0,1248
207,207.0,36067.0,2.0,0_1,12921_0,1282
208,208.0,45093.0,2.0,0_1,13061_0,1303
209,209.0,38439.0,2.0,0_1,13091_0,1281
210,210.0,30599.0,2.0,0_1,13001_0,1266
211,211.0,42196.0,2.0,0_1,13081_0,1264
212,212.0,42068.0,2.0,0_1,13231_0,1289
213,213.0,44508.0,2.0,0_1,13291_0,1308
214,214.0,41847.0,2.0,0_1,13301_0,1287
215,215.0,40462.0,2.0,0_1,13621_0,1376
216,216.0,38658.0,2.0,0_1,13721_0,1414
217,217.0,43536.0,2.0,0_1,14201_0,1434
218,218.0,42966.0,2.0,0_1,14151_0,1423
219,219.0,39569.0,2.0,0_1,13851_0,1410
220,220.0,39021.0,2.0,0_1,13651_0,1435
221,221.0,43213.0,2.0,0_1,13711_0,1397
222,222.0,35930.0,2.0,0_1,13751_0,1386
223,223.0,37093.0,2.0,0_1,13681_0,1380
224,224.0,45323.0,2.0,0_1,13901_0,1401
225,225.0,49196.0,2.0,0_1,13801_0,1391
226,226.0,45371.0,2.0,0_1,14341_0,1439
227,227.0,45677.0,2.0,0_1,14581_0,1468
228,228.0,42424.0,2.0,0_1,14751_0,1488
229,229.0,44584.0,2.0,0_1,14921_0,1501
230,230.0,45079.0,2.0,0_1,14941_0,1508
231,231.0,46195.0,2.0,0_1,14921_0,1522
232,232.0,46392.0,2.0,0_1,14941_0,1536
233,233.0,47263.0,2.0,0_1,14881_0,1523
234,234.0,38673.0,2.0,0_1,14661_0,1508
235,235.0,41687.0,2.0,0_1,14091_0,1494
236,236.0,38586.0,2.0,0_1,14191_0,1511
237,237.0,46367.0,2.0,0_1,14471_0,1507
238,238.0,49596.0,2.0,0_1,14291_0,1535
239,239.0,42962.0,2.0,0_1,14261_0,1512
240,240.0,44799.0,2.0,0_1,14001_0,1513
241,241.0,39689.0,2.0,0_1,14021_0,1498
242,242.0,46908.0,2.0,0_1,14131_0,1441
243,243.0,38632.0,2.0,0_1,14341_0,1433
244,244.0,42352.0,2.0,0_1,14521_0,1431
245,245.0,48884.0,2.0,0_1,14351_0,1451
246,246.0,43292.0,2.0,0_1,14351_0,1439
247,247.0,44318.0,2.0,0_1,14381_0,1416
248,248.0,41418.0,2.0,0_1,14381_0,1416
249,249.0,43207.0,2.0,0_1,14421_0,1402
250,250.0,40285.0,2.0,0_1,14521_0,1413
251,251.0,46593.0,2.0,0_1,14601_0,1428
252,252.0,40783.0,2.0,0_1,14651_0,1451
253,253.0,40847.0,2.0,0_1,14811_0,1455
254,254.0,40287.0,2.0,0_1,14681_0,1449
255,255.0,46271.0,2.0,0_1,14771_0,1466
256,256.0,46993.0,2.0,0_1,15021_0,1467
257,257.0,48516.0,2.0,0_1,14701_0,1455
258,258.0,42151.0,2.0,0_1,14671_0,1462
259,259.0,43220.0,2.0,0_1,14551_0,1480
260,260.0,42215.0,2.0,0_1,14731_0,1500
261,261.0,45307.0,2.0,0_1,15361_0,1519
262,262.0,52361.0,2.0,0_1,15491_0,1527
263,263.0,47271.0,2.0,0_1,15631_0,1531
264,264.0,47526.0,2.0,0_1,15561_0,1538
265,265.0,43610.0,2.0,0_1,15981_0,1556
266,266.0,45214.0,2.0,0_1,15881_0,1536
267,267.0,49525.0,2.0,0_1,15841_0,1517
268,268.0,43067.0,2.0,0_1,15861_0,1531
269,269.0,42672.0,2.0,0_1,15931_0,1551
270,270.0,42413.0,2.0,0_1,15791_0,1561
271,271.0,49563.0,2.0,0_1,15801_0,1605
272,272.0,51311.0,2.0,0_1,15811_0,1629
273,273.0,57575.0,2.0,0_1,15991_0,1651
274,274.0,48701.0,2.0,0_1,16211_0,1645
275,275.0,52003.0,2.0,0_1,16391_0,1669
276,276.0,51787.0,2.0,0_1,16511_0,1637
277,277.0,45807.0,2.0,0_1,16001_0,1628
278,278.0,47006.0,2.0,0_1,15981_0,1626
279,279.0,52352.0,2.0,0_1,16011_0,1635
280,280.0,51217.0,2.0,0_1,16491_0,1648
281,281.0,47722.0,2.0,0_1,16741_0,1699
282,282.0,57728.0,2.0,0_1,16961_0,1698
283,283.0,51535.0,2.0,0_1,17111_0,1739
284,284.0,44421.0,2.0,0_1,17191_0,1753
285,285.0,49219.0,2.0,0_1,16811_0,1777
286,286.0,56440.0,2.0,0_1,17031_0,1781
287,287.0,61831.0,2.0,0_1,17221_0,1808
288,288.0,62435.0,2.0,0_1,17101_0,1812
289,289.0,48641.0,2.0,0_1,17101_0,1795
290,290.0,50555.0,2.0,0_1,17251_0,1818
291,291.0,54783.0,2.0,0_1,17301_0,1828
292,292.0,49255.0,2.0,0_1,17361_0,1809
293,293.0,51285.0,2.0,0_1,17121_0,1784
294,294.0,53259.0,2.0,0_1,17341_0,1834
295,295.0,57743.0,2.0,0_1,17611_0,1880
296,296.0,54661.0,2.0,0_1,17611_0,1896
297,297.0,51289.0,2.0,0_1,18141_0,1910
298,298.0,49653.0,2.0,0_1,18171_0,1854
299,299.0,43068.0,2.0,0_1,18151_0,1832
300,300.0,51187.0,2.0,0_1,18251_0,1816
301,301.0,51137.0,2.0,0_1,17701_0,1835
302,302.0,53316.0,2.0,0_1,17531_0,1807
303,303.0,56427.0,2.0,0_1,17721_0,1822
304,304.0,59165.0,2.0,0_1,18131_0,1818
305,305.0,54193.0,2.0,0_1,18321_0,1824
306,306.0,54179.0,2.0,0_1,18481_0,1813
307,307.0,61512.0,2.0,0_1,18261_0,1825
308,308.0,56777.0,2.0,0_1,18341_0,1851
309,309.0,60812.0,2.0,0_1,18691_0,1909
310,310.0,57915.0,2.0,0_1,19001_0,1942
311,311.0,58152.0,2.0,0_1,19211_0,1996
312,312.0,66131.0,2.0,0_1,19241_0,1986
313,313.0,60380.0,2.0,0_1,19351_0,1952
314,314.0,57106.0,2.0,0_1,19451_0,1942
315,315.0,53188.0,2.0,0_1,19511_0,1932
316,316.0,57542.0,2.0,0_1,19811_0,1960
317,317.0,65368.0,2.0,0_1,20201_0,1989
318,318.0,57334.0,2.0,0_1,19851_0,2010
319,319.0,59387.0,2.0,0_1,20341_0,1989
320,320.0,60634.0,2.0,0_1,20051_0,2000
321,321.0,57594.0,2.0,0_1,19851_0,2026
322,322.0,60653.0,2.0,0_1,20051_0,2047
323,323.0,58882.0,2.0,0_1,20161_0,2059
324,324.0,58749.0,2.0,0_1,20161_0,2063
325,325.0,55686.0,2.0,0_1,20101_0,2048
326,326.0,60042.0,2.0,0_1,20111_0,2035
327,327.0,61058.0,2.0,0_1,19741_0,2004
328,328.0,51463.0,2.0,0_1,19411_0,1994
329,329.0,56979.0,2.0,0_1,19601_0,1997
330,330.0,60225.0,2.0,0_1,20201_0,2073
331,331.0,67404.0,2.0,0_1,20451_0,2040
332,332.0,55152.0,2.0,0_1,20441_0,2067
333,333.0,63049.0,2.0,0_1,20391_0,2072
334,334.0,62028.0,2.0,0_1,20281_0,2024
335,335.0,52207.0,2.0,0_1,20611_0,1986
336,336.0,61589.0,2.0,0_1,20401_0,2030
337,337.0,61979.0,2.0,0_1,20621_0,2069
338,338.0,68833.0,2.0,0_1,20391_0,2056
339,339.0,50546.0,2.0,0_1,20341_0,2037
340,340.0,57791.0,2.0,0_1,19881_0,1999
341,341.0,57330.0,2.0,0_1,19771_0,2027
342,342.0,66665.0,2.0,0_1,20181_0,2045
343,343.0,64787.0,2.0,0_1,20851_0,2073
344,344.0,71294.0,2.0,0_1,20751_0,2035
345,345.0,57390.0,2.0,0_1,20581_0,2033
346,346.0,54707.0,2.0,0_1,20911_0,2009
347,347.0,56216.0,2.0,0_1,20751_0,2046
348,348.0,56223.0,2.0,0_1,21341_0,2024
349,349.0,62837.0,2.0,0_1,21311_0,1991
350,350.0,58022.0,2.0,0_1,21021_0,1987
351,351.0,60839.0,2.0,0_1,20811_0,1978
352,352.0,54262.0,2.0,0_1,20761_0,1990
353,353.0,56391.0,2.0,0_1,20791_0,1993
354,354.0,61053.0,2.0,0_1,20511_0,2024
355,355.0,54781.0,2.0,0_1,20501_0,2029
356,356.0,61261.0,2.0,0_1,20171_0,2009
357,357.0,56886.0,2.0,0_1,19601_0,1977
358,358.0,58266.0,2.0,0_1,19361_0,1940
359,359.0,46894.0,2.0,0_1,18881_0,1973
360,360.0,52731.0,2.0,0_1,18231_0,1893
361,361.0,57426.0,2.0,0_1,18021_0,1897
362,362.0,60154.0,2.0,0_1,18431_0,1899
363,363.0,62546.0,2.0,0_1,18791_0,1922
364,364.0,60724.0,2.0,0_1,19271_0,1948
365,365.0,60555.0,2.0,0_1,19621_0,1964
366,366.0,60581.0,2.0,0_1,19781_0,1967
367,367.0,61093.0,2.0,0_1,19691_0,1972
368,368.0,56725.0,2.0,0_1,20111_0,2004
369,369.0,66750.0,2.0,0_1,20111_0,2020
370,370.0,61359.0,2.0,0_1,20211_0,2064
371,371.0,66691.0,2.0,0_1,19891_0,2020
372,372.0,53849.0,2.0,0_1,20291_0,2028
373,373.0,65601.0,2.0,0_1,20511_0,2062
374,374.0,62759.0,2.0,0_1,20671_0,2037
375,375.0,59510.0,2.0,0_1,21101_0,2093
376,376.0,70448.0,2.0,0_1,21831_0,2122
377,377.0,68510.0,2.0,0_1,21821_0,2120
378,378.0,62019.0,2.0,0_1,21921_0,2096
379,379.0,49619.0,2.0,0_1,22021_0,2106
380,380.0,71492.0,2.0,0_1,21591_0,2127
381,381.0,63470.0,2.0,0_1,21521_0,2143
382,382.0,69266.0,2.0,0_1,21161_0,2142
383,383.0,66710.0,2.0,0_1,21331_0,2190
384,384.0,70880.0,2.0,0_1,21531_0,2201
385,385.0,66488.0,2.0,0_1,21701_0,2253
386,386.0,67460.0,2.0,0_1,21821_0,2272
387,387.0,57570.0,2.0,0_1,21381_0,2208
388,388.0,56733.0,2.0,0_1,21901_0,2208
389,389.0,69152.0,2.0,0_1,21971_0,2216
390,390.0,54981.0,2.0,0_1,21901_0,2199
391,391.0,65103.0,2.0,0_1,21581_0,2190
392,392.0,68000.0,2.0,0_1,21251_0,2215
393,393.0,68573.0,2.0,0_1,21541_0,2256
394,394.0,67725.0,2.0,0_1,21421_0,2251
395,395.0,63458.0,2.0,0_1,21671_0,2261
396,396.0,64169.0,2.0,0_1,22161_0,2276
397,397.0,68999.0,2.0,0_1,22041_0,2215
398,398.0,64662.0,2.0,0_1,22281_0,2239
399,399.0,59468.0,2.0,0_1,22361_0,2215
400,400.0,54491.0,2.0,0_1,22461_0,2188
401,401.0,62849.0,2.0,0_1,22111_0,2175
402,402.0,57491.0,2.0,0_1,21651_0,2128
403,403.0,62057.0,2.0,0_1,20971_0,2092
404,404.0,63519.0,2.0,0_1,20831_0,2139
405,405.0,68895.0,2.0,0_1,20531_0,2102
406,406.0,61471.0,2.0,0_1,20751_0,2100
407,407.0,64367.0,2.0,0_1,21191_0,2126
408,408.0,66471.0,2.0,0_1,21041_0,2111
409,409.0,56908.0,2.0,0_1,21201_0,2151
410,410.0,67268.0,2.0,0_1,21371_0,2163
411,411.0,77339.0,2.0,0_1,21241_0,2163
412,412.0,58128.0,2.0,0_1,21101_0,2142
413,413.0,58567.0,2.0,0_1,20881_0,2148
414,414.0,65047.0,2.0,0_1,21291_0,2190
415,415.0,72878.0,2.0,0_1,21721_0,2270
416,416.0,75325.0,2.0,0_1,22111_0,2293
417,417.0,62730.0,2.0,0_1,21761_0,2272
418,418.0,57327.0,2.0,0_1,21981_0,2268
419,419.0,70484.0,2.0,0_1,22231_0,2277
420,420.0,71993.0,2.0,0_1,22471_0,2278
421,421.0,75347.0,2.0,0_1,22521_0,2272
422,422.0,69123.0,2.0,0_1,22601_0,2268
423,423.0,57511.0,2.0,0_1,22821_0,2296
424,424.0,66372.0,2.0,0_1,22821_0,2302
425,425.0,62325.0,2.0,0_1,22621_0,2248
426,426.0,60759.0,2.0,0_1,22041_0,2237
427,427.0,58504.0,2.0,0_1,21791_0,2227
428,428.0,63732.0,2.0,0_1,21951_0,2217
429,429.0,61368.0,2.0,0_1,21481_0,2221
430,430.0,67819.0,2.0,0_1,21571_0,2214
431,431.0,72424.0,2.0,0_1,21251_0,2215
432,432.0,58793.0,2.0,0_1,21161_0,2156
433,433.0,57772.0,2.0,0_1,21081_0,2147
434,434.0,64051.0,2.0,0_1,20711_0,2095
435,435.0,64047.0,2.0,0_1,21041_0,2091
436,436.0,55347.0,2.0,0_1,20931_0,2056
437,437.0,60183.0,2.0,0_1,20531_0,2029
438,438.0,50035.0,2.0,0_1,20521_0,1984
439,439.0,59204.0,2.0,0_1,20321_0,1978
440,440.0,61273.0,2.0,0_1,20221_0,1999
441,441.0,65468.0,2.0,0_1,19941_0,1992
442,442.0,59690.0,2.0,0_1,19791_0,2004
443,443.0,61855.0,2.0,0_1,19971_0,1973
444,444.0,61354.0,2.0,0_1,20061_0,1952
445,445.0,60065.0,2.0,0_1,19871_0,1962
446,446.0,52337.0,2.0,0_1,19581_0,1977
447,447.0,60384.0,2.0,0_1,19421_0,1958
448,448.0,58372.0,2.0,0_1,19631_0,1988
449,449.0,66019.0,2.0,0_1,19461_0,2009
450,450.0,59058.0,2.0,0_1,19521_0,2051
451,451.0,71182.0,2.0,0_1,19841_0,2011
452,452.0,64038.0,2.0,0_1,20501_0,2067
453,453.0,77188.0,2.0,0_1,20781_0,2094
454,454.0,57653.0,2.0,0_1,21141_0,2160
455,455.0,66112.0,2.0,0_1,21331_0,2199
456,456.0,65128.0,2.0,0_1,21421_0,2198
457,457.0,61308.0,2.0,0_1,21951_0,2198
458,458.0,61866.0,2.0,0_1,22021_0,2180
459,459.0,61228.0,2.0,0_1,21631_0,2176
460,460.0,56428.0,2.0,0_1,21861_0,2166
461,461.0,60613.0,2.0,0_1,21781_0,2192
462,462.0,74748.0,2.0,0_1,21561_0,2140
463,463.0,60062.0,2.0,0_1,21341_0,2113
464,464.0,57177.0,2.0,0_1,21171_0,2100
465,465.0,68968.0,2.0,0_1,21091_0,2096
466,466.0,71105.0,2.0,0_1,21641_0,2138
467,467.0,67567.0,2.0,0_1,21981_0,2173
468,468.0,72209.0,2.0,0_1,22141_0,2196
469,469.0,67889.0,2.0,0_1,22691_0,2252
470,470.0,79848.0,2.0,0_1,22961_0,2290
471,471.0,76952.0,2.0,0_1,23851_0,2333
472,472.0,72453.0,2.0,0_1,24051_0,2366
473,473.0,67939.0,2.0,0_1,24301_0,2412
474,474.0,79331.0,2.0,0_1,24431_0,2436
475,475.0,81816.0,2.0,0_1,24681_0,2401
476,476.0,71895.0,2.0,0_1,24801_0,2378
477,477.0,74779.0,2.0,0_1,24821_0,2459
478,478.0,75166.0,2.0,0_1,25261_0,2455
479,479.0,80301.0,2.0,0_1,25091_0,2490
480,480.0,76346.0,2.0,0_1,25501_0,2579
481,481.0,84989.0,2.0,0_1,25511_0,2627
482,482.0,77912.0,2.0,0_1,25211_0,2616
483,483.0,72586.0,2.0,0_1,25581_0,2615
484,484.0,73105.0,2.0,0_1,25801_0,2552
485,485.0,73667.0,2.0,0_1,25521_0,2510
486,486.0,67593.0,2.0,0_1,25521_0,2499
487,487.0,75894.0,2.0,0_1,25091_0,2456
488,488.0,62703.0,2.0,0_1,24931_0,2434
489,489.0,67080.0,2.0,0_1,24811_0,2435
490,490.0,73565.0,2.0,0_1,25451_0,2424
491,491.0,74525.0,2.0,0_1,25111_0,2415
492,492.0,60350.0,2.0,0_1,24241_0,2359
493,493.0,59989.0,2.0,0_1,23631_0,2305
494,494.0,60938.0,2.0,0_1,23371_0,2269
495,495.0,59386.0,2.0,0_1,23311_0,2274
496,496.0,70140.0,2.0,0_1,22651_0,2232
497,497.0,51224.0,2.0,0_1,22731_0,2248
498,498.0,60515.0,2.0,0_1,22881_0,2255
499,499.0,65575.0,2.0,0_1,22151_0,2248
500,500.0,65725.0,2.0,0_1,21671_0,2164
501,501.0,58008.0,2.0,0_1,21111_0,2119
502,502.0,64576.0,2.0,0_1,20731_0,2124
503,503.0,59634.0,2.0,0_1,20731_0,2109
504,504.0,70753.0,2.0,0_1,20741_0,2123
505,505.0,62192.0,2.0,0_1,21061_0,2160
506,506.0,68131.0,2.0,0_1,20721_0,2127
507,507.0,55797.0,2.0,0_1,20111_0,2129
508,508.0,57025.0,2.0,0_1,19841_0,2039
509,509.0,47870.0,2.0,0_1,20041_0,2009
510,510.0,72164.0,2.0,0_1,19641_0,2017
511,511.0,62260.0,2.0,0_1,20141_0,2045
512,512.0,71654.0,2.0,0_1,20691_0,2097
513,513.0,72686.0,2.0,0_1,20461_0,2090
514,514.0,60811.0,2.0,0_1,20241_0,2151
515,515.0,61090.0,2.0,0_1,20951_0,2208
516,516.0,66444.0,2.0,0_1,21261_0,2238
517,517.0,57041.0,2.0,0_1,21211_0,2254
518,518.0,59489.0,2.0,0_1,21011_0,2257
519,519.0,58520.0,2.0,0_1,21301_0,2261
520,520.0,70880.0,2.0,0_1,21811_0,2265
521,521.0,69354.0,2.0,0_1,21911_0,2254
522,522.0,66045.0,2.0,0_1,21721_0,2238
523,523.0,71062.0,2.0,0_1,22121_0,2314
524,524.0,72958.0,2.0,0_1,22201_0,2362
525,525.0,74386.0,2.0,0_1,22171_0,2344
526,526.0,66466.0,2.0,0_1,22101_0,2368
527,527.0,68246.0,2.0,0_1,21831_0,2336
528,528.0,60373.0,2.0,0_1,22021_0,2283
529,529.0,63651.0,2.0,0_1,21871_0,2262
530,530.0,59695.0,2.0,0_1,21821_0,2239
531,531.0,65194.0,2.0,0_1,21791_0,2217
532,532.0,63737.0,2.0,0_1,21561_0,2154
533,533.0,60359.0,2.0,0_1,20811_0,2094
534,534.0,59877.0,2.0,0_1,20571_0,2019
535,535.0,52357.0,2.0,0_1,20701_0,1985
536,536.0,62133.0,2.0,0_1,20881_0,2005
537,537.0,53059.0,2.0,0_1,21031_0,1985
538,538.0,62514.0,2.0,0_1,21081_0,2083
539,539.0,63339.0,2.0,0_1,20921_0,2117
540,540.0,56476.0,2.0,0_1,20591_0,2087
541,541.0,59608.0,2.0,0_1,20401_0,2082
542,542.0,72661.0,2.0,0_1,20271_0,2101
543,543.0,58196.0,2.0,0_1,19561_0,2126
544,544.0,62486.0,2.0,0_1,19351_0,2102
545,545.0,57007.0,2.0,0_1,19041_0,2064
546,546.0,54681.0,2.0,0_1,19511_0,2055
547,547.0,63761.0,2.0,0_1,19641_0,2107
548,548.0,55774.0,2.0,0_1,19761_0,2122
549,549.0,64943.0,2.0,0_1,20051_0,2085
550,550.0,67735.0,2.0,0_1,20311_0,2083
551,551.0,63966.0,2.0,0_1,20101_0,2045
552,552.0,60516.0,2.0,0_1,20371_0,2052
553,553.0,61116.0,2.0,0_1,20591_0,2096
554,554.0,60255.0,2.0,0_1,20501_0,2097
555,555.0,67723.0,2.0,0_1,20471_0,2073
556,556.0,61480.0,2.0,0_1,20621_0,2058
557,557.0,58767.0,2.0,0_1,21211_0,2091
558,558.0,69868.0,2.0,0_1,21691_0,2148
559,559.0,63618.0,2.0,0_1,21811_0,2166
560,560.0,64998.0,2.0,0_1,21711_0,2160
561,561.0,60696.0,2.0,0_1,21151_0,2136
562,562.0,51405.0,2.0,0_1,20931_0,2107
563,563.0,56145.0,2.0,0_1,20421_0,1971
564,564.0,53195.0,2.0,0_1,19831_0,1936
565,565.0,63536.0,2.0,0_1,19581_0,1884
566,566.0,58825.0,2.0,0_1,19911_0,1925
567,567.0,66742.0,2.0,0_1,19481_0,1890
568,568.0,51291.0,2.0,0_1,19701_0,1890
569,569.0,67929.0,2.0,0_1,20451_0,1925
570,570.0,69236.0,2.0,0_1,21241_0,2007
571,571.0,70549.0,2.0,0_1,21921_0,2042
572,572.0,70188.0,2.0,0_1,22351_0,2111
573,573.0,69240.0,2.0,0_1,22581_0,2150
574,574.0,74255.0,2.0,0_1,23671_0,2200
575,575.0,62956.0,2.0,0_1,24291_0,2280
576,576.0,69342.0,2.0,0_1,23951_0,2359
577,577.0,70913.0,2.0,0_1,23971_0,2357
578,578.0,70435.0,2.0,0_1,23281_0,2341
579,579.0,65396.0,2.0,0_1,22621_0,2288
580,580.0,55741.0,2.0,0_1,21941_0,2243
581,581.0,60930.0,2.0,0_1,21541_0,2206
582,582.0,59417.0,2.0,0_1,21841_0,2212
583,583.0,67748.0,2.0,0_1,21711_0,2220
584,584.0,54254.0,2.0,0_1,21581_0,2186
585,585.0,59683.0,2.0,0_1,21021_0,2102
586,586.0,61748.0,2.0,0_1,20811_0,2063
587,587.0,55019.0,2.0,0_1,20161_0,2043
588,588.0,61046.0,2.0,0_1,20111_0,2055
589,589.0,66862.0,2.0,0_1,20161_0,2063
590,590.0,66685.0,2.0,0_1,20121_0,2033
591,591.0,62934.0,2.0,0_1,20471_0,2063
592,592.0,63080.0,2.0,0_1,20851_0,2094
593,593.0,69463.0,2.0,0_1,21261_0,2176
594,594.0,76689.0,2.0,0_1,21651_0,2206
595,595.0,71862.0,2.0,0_1,21891_0,2264
596,596.0,68406.0,2.0,0_1,22151_0,2307
597,597.0,61415.0,2.0,0_1,22311_0,2311
598,598.0,62749.0,2.0,0_1,22171_0,2250
599,599.0,70833.0,2.0,0_1,21901_0,2283
600,600.0,67698.0,2.0,0_1,22011_0,2274
601,601.0,70634.0,2.0,0_1,21831_0,2283
602,602.0,62410.0,2.0,0_1,21751_0,2266
603,603.0,71515.0,2.0,0_1,21991_0,2288
604,604.0,65341.0,2.0,0_1,22221_0,2276
605,605.0,61729.0,2.0,0_1,22081_0,2252
606,606.0,71818.0,2.0,0_1,21901_0,2242
607,607.0,59188.0,2.0,0_1,21451_0,2199
608,608.0,54692.0,2.0,0_1,21171_0,2208
609,609.0,63405.0,2.0,0_1,20721_0,2180
610,610.0,55425.0,2.0,0_1,20291_0,2148
611,611.0,54778.0,2.0,0_1,20431_0,2095
612,612.0,62464.0,2.0,0_1,19901_0,2061
613,613.0,56194.0,2.0,0_1,19311_0,2016
614,614.0,58184.0,2.0,0_1,19041_0,2019
615,615.0,61732.0,2.0,0_1,19471_0,1983
616,616.0,60424.0,2.0,0_1,19321_0,1920
617,617.0,52544.0,2.0,0_1,19421_0,1937
618,618.0,64528.0,2.0,0_1,19711_0,1933
619,619.0,64184.0,2.0,0_1,20101_0,1987
620,620.0,73157.0,2.0,0_1,20441_0,2033
621,621.0,68691.0,2.0,0_1,20931_0,2103
622,622.0,65654.0,2.0,0_1,20841_0,2126
623,623.0,61568.0,2.0,0_1,21371_0,2185
624,624.0,72606.0,2.0,0_1,21891_0,2192
625,625.0,66911.0,2.0,0_1,22531_0,2290
626,626.0,73152.0,2.0,0_1,22991_0,2304
627,627.0,71725.0,2.0,0_1,23361_0,2319
628,628.0,65819.0,2.0,0_1,23411_0,2284
629,629.0,75355.0,2.0,0_1,22431_0,2256
630,630.0,55723.0,2.0,0_1,21871_0,2236
631,631.0,56790.0,2.0,0_1,21691_0,2234
632,632.0,59260.0,2.0,0_1,21861_0,2225
633,633.0,69846.0,2.0,0_1,21551_0,2182
634,634.0,62275.0,2.0,0_1,21241_0,2193
635,635.0,73328.0,2.0,0_1,21151_0,2201
636,636.0,66801.0,2.0,0_1,21241_0,2181
637,637.0,60766.0,2.0,0_1,21621_0,2213
638,638.0,78158.0,2.0,0_1,22191_0,2267
639,639.0,70195.0,2.0,0_1,22351_0,2304
640,640.0,80089.0,2.0,0_1,23401_0,2349
641,641.0,72933.0,2.0,0_1,24281_0,2405
642,642.0,69756.0,2.0,0_1,24541_0,2448
643,643.0,68258.0,2.0,0_1,24651_0,2467
644,644.0,79703.0,2.0,0_1,24231_0,2476
645,645.0,63855.0,2.0,0_1,24111_0,2443
646,646.0,66478.0,2.0,0_1,23551_0,2359
647,647.0,56561.0,2.0,0_1,23511_0,2384
648,648.0,71156.0,2.0,0_1,23651_0,2414
649,649.0,74317.0,2.0,0_1,23611_0,2383
650,650.0,77843.0,2.0,0_1,23891_0,2388
651,651.0,77357.0,2.0,0_1,23591_0,2415
652,652.0,63065.0,2.0,0_1,23421_0,2421
653,653.0,67194.0,2.0,0_1,23281_0,2358
654,654.0,62256.0,2.0,0_1,22951_0,2328
655,655.0,65015.0,2.0,0_1,23101_0,2350
656,656.0,74176.0,2.0,0_1,23071_0,2359
657,657.0,68740.0,2.0,0_1,23171_0,2354
658,658.0,71871.0,2.0,0_1,22811_0,2337
659,659.0,71750.0,2.0,0_1,22781_0,2337
660,660.0,78121.0,2.0,0_1,23251_0,2391
661,661.0,76006.0,2.0,0_1,23331_0,2424
662,662.0,68764.0,2.0,0_1,23501_0,2419
663,663.0,71720.0,2.0,0_1,23871_0,2455
664,664.0,87120.0,2.0,0_1,24101_0,2520
665,665.0,76302.0,2.0,0_1,24621_0,2511
666,666.0,71845.0,2.0,0_1,24901_0,2526
667,667.0,74395.0,2.0,0_1,24541_0,2511
668,668.0,75065.0,2.0,0_1,25021_0,2564
669,669.0,79542.0,2.0,0_1,24961_0,2600
670,670.0,69114.0,2.0,0_1,24891_0,2584
671,671.0,72024.0,2.0,0_1,24831_0,2554
672,672.0,68847.0,2.0,0_1,24601_0,2523
673,673.0,77768.0,2.0,0_1,24741_0,2487
674,674.0,79151.0,2.0,0_1,24861_0,2483
675,675.0,81389.0,2.0,0_1,25111_0,2524
676,676.0,81571.0,2.0,0_1,25571_0,2575
677,677.0,71150.0,2.0,0_1,25461_0,2559
678,678.0,81106.0,2.0,0_1,25651_0,2564
679,679.0,80115.0,2.0,0_1,25841_0,2565
680,680.0,69708.0,2.0,0_1,26051_0,2580
681,681.0,85350.0,2.0,0_1,25611_0,2560
682,682.0,65080.0,2.0,0_1,25441_0,2512
683,683.0,70384.0,2.0,0_1,25551_0,2534
684,684.0,67267.0,2.0,0_1,25261_0,2512
685,685.0,75202.0,2.0,0_1,25301_0,2515
686,686.0,73331.0,2.0,0_1,25341_0,2510
687,687.0,72795.0,2.0,0_1,25271_0,2501
688,688.0,73944.0,2.0,0_1,25091_0,2502
689,689.0,79260.0,2.0,0_1,25671_0,2516
690,690.0,75746.0,2.0,0_1,25791_0,2509
691,691.0,76195.0,2.0,0_1,25741_0,2535
692,692.0,81900.0,2.0,0_1,26291_0,2557
693,693.0,86256.0,2.0,0_1,26151_0,2545
694,694.0,73784.0,2.0,0_1,26151_0,2569
695,695.0,73260.0,2.0,0_1,26331_0,2607
696,696.0,86764.0,2.0,0_1,26511_0,2690
697,697.0,81631.0,2.0,0_1,26501_0,2724
698,698.0,83981.0,2.0,0_1,26231_0,2716
699,699.0,79116.0,2.0,0_1,26371_0,2707
700,700.0,78374.0,2.0,0_1,26281_0,2665
701,701.0,75744.0,2.0,0_1,26401_0,2655
702,702.0,79432.0,2.0,0_1,26761_0,2673
703,703.0,84454.0,2.0,0_1,27181_0,2730
704,704.0,95036.0,2.0,0_1,27911_0,2789
705,705.0,86553.0,2.0,0_1,27621_0,2813
706,706.0,76219.0,2.0,0_1,27391_0,2750
707,707.0,77362.0,2.0,0_1,27831_0,2746
708,708.0,80070.0,2.0,0_1,27911_0,2813
709,709.0,88611.0,2.0,0_1,27901_0,2849
710,710.0,92200.0,2.0,0_1,27901_0,2868
711,711.0,77089.0,2.0,0_1,27221_0,2806
712,712.0,66821.0,2.0,0_1,27191_0,2807
713,713.0,77308.0,2.0,0_1,27091_0,2780
714,714.0,83022.0,2.0,0_1,26811_0,2799
715,715.0,82577.0,2.0,0_1,27021_0,2783
716,716.0,82983.0,2.0,0_1,27171_0,2803
717,717.0,82889.0,2.0,0_1,27141_0,2760
718,718.0,79954.0,2.0,0_1,27241_0,2742
719,719.0,71504.0,2.0,0_1,27161_0,2717
720,720.0,80036.0,2.0,0_1,27281_0,2753
721,721.0,81555.0,2.0,0_1,26321_0,2747
722,722.0,62745.0,2.0,0_1,25701_0,2645
723,723.0,58325.0,2.0,0_1,25221_0,2593
724,724.0,64893.0,2.0,0_1,24751_0,2531
725,725.0,74977.0,2.0,0_1,24471_0,2463
726,726.0,75853.0,2.0,0_1,24651_0,2439
727,727.0,77218.0,2.0,0_1,24851_0,2467
728,728.0,76028.0,2.0,0_1,25301_0,2504
729,729.0,83115.0,2.0,0_1,25321_0,2522
730,730.0,80210.0,2.0,0_1,25241_0,2532
731,731.0,84467.0,2.0,0_1,25381_0,2529
732,732.0,70207.0,2.0,0_1,25361_0,2529
733,733.0,81094.0,2.0,0_1,25371_0,2552
734,734.0,76362.0,2.0,0_1,24991_0,2595
735,735.0,81760.0,2.0,0_1,25801_0,2616
736,736.0,85760.0,2.0,0_1,26661_0,2720
737,737.0,84048.0,2.0,0_1,27091_0,2794
738,738.0,79169.0,2.0,0_1,27461_0,2781
739,739.0,83326.0,2.0,0_1,27171_0,2817
740,740.0,82877.0,2.0,0_1,26691_0,2787
741,741.0,78244.0,2.0,0_1,26141_0,2721
742,742.0,83565.0,2.0,0_1,25841_0,2710
743,743.0,77926.0,2.0,0_1,26341_0,2731
744,744.0,79580.0,2.0,0_1,26861_0,2744
745,745.0,82313.0,2.0,0_1,27001_0,2801
746,746.0,84913.0,2.0,0_1,27151_0,2802
747,747.0,73732.0,2.0,0_1,27541_0,2819
748,748.0,87897.0,2.0,0_1,27581_0,2836
749,749.0,85436.0,2.0,0_1,27261_0,2751
750,750.0,78896.0,2.0,0_1,27101_0,2723
751,751.0,85313.0,2.0,0_1,27361_0,2725
752,752.0,91709.0,2.0,0_1,26921_0,2723
753,753.0,79863.0,2.0,0_1,27041_0,2704
754,754.0,77849.0,2.0,0_1,27361_0,2725
755,755.0,75446.0,2.0,0_1,27061_0,2720
756,756.0,68854.0,2.0,0_1,26881_0,2691
757,757.0,76674.0,2.0,0_1,27231_0,2674
758,758.0,77139.0,2.0,0_1,26931_0,2665
759,759.0,73562.0,2.0,0_1,26651_0,2617
760,760.0,83843.0,2.0,0_1,26541_0,2646
761,761.0,74635.0,2.0,0_1,26641_0,2634
762,762.0,73160.0,2.0,0_1,26211_0,2633
763,763.0,86473.0,2.0,0_1,26191_0,2581
764,764.0,77438.0,2.0,0_1,26441_0,2583
765,765.0,79237.0,2.0,0_1,26451_0,2591
766,766.0,69335.0,2.0,0_1,26151_0,2566
767,767.0,79438.0,2.0,0_1,25831_0,2553
768,768.0,81514.0,2.0,0_1,27021_0,2616
769,769.0,83021.0,2.0,0_1,26971_0,2627
770,770.0,76498.0,2.0,0_1,26761_0,2649
771,771.0,80948.0,2.0,0_1,26641_0,2681
772,772.0,81644.0,2.0,0_1,27131_0,2700
773,773.0,89579.0,2.0,0_1,27741_0,2710
774,774.0,83694.0,2.0,0_1,28081_0,2738
775,775.0,89160.0,2.0,0_1,28441_0,2816
776,776.0,79217.0,2.0,0_1,28421_0,2848
777,777.0,85123.0,2.0,0_1,28721_0,2868
778,778.0,95228.0,2.0,0_1,28101_0,2861
779,779.0,82499.0,2.0,0_1,28041_0,2851
780,780.0,79593.0,2.0,0_1,28551_0,2832
781,781.0,83679.0,2.0,0_1,28721_0,2837
782,782.0,85927.0,2.0,0_1,28831_0,2868
783,783.0,95197.0,2.0,0_1,29191_0,2845
784,784.0,80957.0,2.0,0_1,28661_0,2842
785,785.0,82129.0,2.0,0_1,28801_0,2888
786,786.0,81573.0,2.0,0_1,29031_0,2858
787,787.0,72711.0,2.0,0_1,28931_0,2802
788,788.0,80257.0,2.0,0_1,28091_0,2827
789,789.0,81771.0,2.0,0_1,27761_0,2748
790,790.0,83954.0,2.0,0_1,27581_0,2763
791,791.0,79131.0,2.0,0_1,27301_0,2723
792,792.0,86825.0,2.0,0_1,27781_0,2786
793,793.0,77732.0,2.0,0_1,27851_0,2759
794,794.0,82468.0,2.0,0_1,27561_0,2773
795,795.0,81999.0,2.0,0_1,28021_0,2825
796,796.0,87852.0,2.0,0_1,27671_0,2768
797,797.0,82886.0,2.0,0_1,27681_0,2736
798,798.0,74166.0,2.0,0_1,27871_0,2735
799,799.0,79482.0,2.0,0_1,27031_0,2686
800,800.0,70709.0,2.0,0_1,27031_0,2653
801,801.0,82233.0,2.0,0_1,27601_0,2728
802,802.0,89168.0,2.0,0_1,27491_0,2788
803,803.0,78396.0,2.0,0_1,27201_0,2752
804,804.0,72301.0,2.0,0_1,27001_0,2736
805,805.0,87687.0,2.0,0_1,27201_0,2754
806,806.0,84110.0,2.0,0_1,26991_0,2769
807,807.0,81671.0,2.0,0_1,27301_0,2803
808,808.0,91703.0,2.0,0_1,27141_0,2796
809,809.0,80783.0,2.0,0_1,26841_0,2747
810,810.0,72691.0,2.0,0_1,26741_0,2741
811,811.0,79606.0,2.0,0_1,26951_0,2727
812,812.0,81015.0,2.0,0_1,27211_0,2748
813,813.0,83144.0,2.0,0_1,27481_0,2778
814,814.0,88729.0,2.0,0_1,27451_0,2782
815,815.0,82954.0,2.0,0_1,27491_0,2775
816,816.0,71587.0,2.0,0_1,27481_0,2695
817,817.0,74929.0,2.0,0_1,27101_0,2657
818,818.0,77066.0,2.0,0_1,26611_0,2669
819,819.0,84155.0,2.0,0_1,27191_0,2667
820,820.0,87748.0,2.0,0_1,28331_0,2658
821,821.0,90808.0,2.0,0_1,28761_0,2687
822,822.0,80756.0,2.0,0_1,29231_0,2693
823,823.0,83686.0,2.0,0_1,28861_0,2679
824,824.0,75578.0,2.0,0_1,28601_0,2678
825,825.0,83037.0,2.0,0_1,28201_0,2665
826,826.0,88704.0,2.0,0_1,27921_0,2601
827,827.0,84861.0,2.0,0_1,27541_0,2678
828,828.0,80545.0,2.0,0_1,27501_0,2667
829,829.0,74796.0,2.0,0_1,27791_0,2684
830,830.0,75451.0,2.0,0_1,27501_0,2696
831,831.0,77339.0,2.0,0_1,26751_0,2670
832,832.0,71492.0,2.0,0_1,26661_0,2679
833,833.0,76309.0,2.0,0_1,27111_0,2686
834,834.0,88574.0,2.0,0_1,27141_0,2705
835,835.0,88720.0,2.0,0_1,27031_0,2735
836,836.0,71960.0,2.0,0_1,26621_0,2729
837,837.0,76566.0,2.0,0_1,26721_0,2710
838,838.0,81588.0,2.0,0_1,26931_0,2706
839,839.0,85027.0,2.0,0_1,27071_0,2712
840,840.0,80164.0,2.0,0_1,27231_0,2728
841,841.0,78173.0,2.0,0_1,27631_0,2736
842,842.0,89824.0,2.0,0_1,27781_0,2786
843,843.0,87123.0,2.0,0_1,27861_0,2780
844,844.0,71774.0,2.0,0_1,26871_0,2711
845,845.0,69933.0,2.0,0_1,26701_0,2696
846,846.0,78206.0,2.0,0_1,26771_0,2680
847,847.0,79329.0,2.0,0_1,27231_0,2720
848,848.0,84313.0,2.0,0_1,26701_0,2743
849,849.0,79619.0,2.0,0_1,26531_0,2706
850,850.0,79745.0,2.0,0_1,26761_0,2763
851,851.0,86405.0,2.0,0_1,26651_0,2732
852,852.0,74506.0,2.0,0_1,26451_0,2718
853,853.0,85619.0,2.0,0_1,26511_0,2711
854,854.0,83507.0,2.0,0_1,26631_0,2699
855,855.0,86848.0,2.0,0_1,26951_0,2726
856,856.0,78940.0,2.0,0_1,26861_0,2721
857,857.0,70958.0,2.0,0_1,26461_0,2688
858,858.0,70829.0,2.0,0_1,25901_0,2632
859,859.0,74988.0,2.0,0_1,25941_0,2662
860,860.0,67621.0,2.0,0_1,25521_0,2618
861,861.0,75217.0,2.0,0_1,25351_0,2568
862,862.0,76920.0,2.0,0_1,25291_0,2554
863,863.0,85117.0,2.0,0_1,25901_0,2571
864,864.0,87287.0,2.0,0_1,26821_0,2632
865,865.0,98537.0,2.0,0_1,27221_0,2674
866,866.0,95414.0,2.0,0_1,27451_0,2764
867,867.0,86119.0,2.0,0_1,28571_0,2837
868,868.0,94092.0,2.0,0_1,29251_0,2906
869,869.0,84570.0,2.0,0_1,29831_0,2933
870,870.0,89184.0,2.0,0_1,29831_0,2892
871,871.0,78409.0,2.0,0_1,29911_0,2856
872,872.0,84062.0,2.0,0_1,29931_0,2871
873,873.0,87084.0,2.0,0_1,29671_0,2838
874,874.0,79566.0,2.0,0_1,29961_0,2863
875,875.0,88769.0,2.0,0_1,29741_0,2840
876,876.0,84494.0,2.0,0_1,29111_0,2811
877,877.0,83926.0,2.0,0_1,28901_0,2808
878,878.0,85198.0,2.0,0_1,28191_0,2794
879,879.0,77165.0,2.0,0_1,28561_0,2836
880,880.0,87760.0,2.0,0_1,28761_0,2886
881,881.0,96058.0,2.0,0_1,28821_0,2922
882,882.0,97032.0,2.0,0_1,29021_0,2953
883,883.0,92160.0,2.0,0_1,29601_0,3038
884,884.0,89059.0,2.0,0_1,29791_0,3052
885,885.0,88776.0,2.0,0_1,29441_0,3066
886,886.0,86915.0,2.0,0_1,29501_0,3081
887,887.0,89983.0,2.0,0_1,29341_0,3095
888,888.0,72323.0,2.0,0_1,28941_0,3018
889,889.0,78584.0,2.0,0_1,28411_0,2952
890,890.0,80878.0,2.0,0_1,27821_0,2894
891,891.0,79222.0,2.0,0_1,28281_0,2863
892,892.0,84563.0,2.0,0_1,28401_0,2869
893,893.0,85109.0,2.0,0_1,28381_0,2808
894,894.0,71886.0,2.0,0_1,27681_0,2790
895,895.0,76942.0,2.0,0_1,27201_0,2702
896,896.0,69456.0,2.0,0_1,26831_0,2653
897,897.0,86207.0,2.0,0_1,26031_0,2576
898,898.0,70541.0,2.0,0_1,25271_0,2517
899,899.0,72644.0,2.0,0_1,24551_0,2485
900,900.0,71980.0,2.0,0_1,24581_0,2532
901,901.0,73127.0,2.0,0_1,24681_0,2547
902,902.0,81057.0,2.0,0_1,24771_0,2566
903,903.0,77891.0,2.0,0_1,24911_0,2607
904,904.0,72475.0,2.0,0_1,24931_0,2641
905,905.0,76748.0,2.0,0_1,25151_0,2604
906,906.0,79538.0,2.0,0_1,25511_0,2631
907,907.0,85469.0,2.0,0_1,26041_0,2677
908,908.0,81906.0,2.0,0_1,26321_0,2652
909,909.0,72908.0,2.0,0_1,26051_0,2605
910,910.0,68770.0,2.0,0_1,26891_0,2630
911,911.0,79991.0,2.0,0_1,27031_0,2618
912,912.0,82743.0,2.0,0_1,26671_0,2621
913,913.0,79215.0,2.0,0_1,26701_0,2636
914,914.0,76795.0,2.0,0_1,27141_0,2624
915,915.0,86633.0,2.0,0_1,27441_0,2634
916,916.0,88448.0,2.0,0_1,27491_0,2615
917,917.0,80265.0,2.0,0_1,27611_0,2632
918,918.0,76049.0,2.0,0_1,27741_0,2696
919,919.0,82263.0,2.0,0_1,27771_0,2712
920,920.0,77853.0,2.0,0_1,27081_0,2658
921,921.0,68166.0,2.0,0_1,26701_0,2649
922,922.0,80122.0,2.0,0_1,26571_0,2611
923,923.0,74515.0,2.0,0_1,26421_0,2660
924,924.0,87768.0,2.0,0_1,26541_0,2691
925,925.0,90286.0,2.0,0_1,26361_0,2704
926,926.0,77145.0,2.0,0_1,25791_0,2711
927,927.0,76788.0,2.0,0_1,26101_0,2685
928,928.0,76580.0,2.0,0_1,26141_0,2668
929,929.0,67334.0,2.0,0_1,25611_0,2645
930,930.0,67175.0,2.0,0_1,24961_0,2620
931,931.0,69652.0,2.0,0_1,25081_0,2593
932,932.0,77097.0,2.0,0_1,25221_0,2597
933,933.0,80509.0,2.0,0_1,24691_0,2530
934,934.0,71641.0,2.0,0_1,24891_0,2501
935,935.0,82792.0,2.0,0_1,25631_0,2523
936,936.0,83571.0,2.0,0_1,25651_0,2509
937,937.0,86155.0,2.0,0_1,26061_0,2540
938,938.0,77382.0,2.0,0_1,26281_0,2572
939,939.0,80633.0,2.0,0_1,26531_0,2601
940,940.0,79084.0,2.0,0_1,27331_0,2648
941,941.0,84358.0,2.0,0_1,27591_0,2664
942,942.0,81672.0,2.0,0_1,28481_0,2625
943,943.0,75472.0,2.0,0_1,28521_0,2605
944,944.0,71988.0,2.0,0_1,27691_0,2553
945,945.0,70671.0,2.0,0_1,27291_0,2532
946,946.0,85119.0,2.0,0_1,27821_0,2560
947,947.0,83110.0,2.0,0_1,27411_0,2511
948,948.0,69354.0,2.0,0_1,26591_0,2500
949,949.0,63188.0,2.0,0_1,26021_0,2457
950,950.0,70056.0,2.0,0_1,24951_0,2386
951,951.0,73717.0,2.0,0_1,24991_0,2365
952,952.0,77853.0,2.0,0_1,24751_0,2339
953,953.0,68780.0,2.0,0_1,25051_0,2351
954,954.0,78760.0,2.0,0_1,24831_0,2389
955,955.0,77235.0,2.0,0_1,24861_0,2426
956,956.0,75743.0,2.0,0_1,24901_0,2413
957,957.0,63180.0,2.0,0_1,24981_0,2422
958,958.0,79767.0,2.0,0_1,25031_0,2431
959,959.0,63930.0,2.0,0_1,25001_0,2405
960,960.0,70568.0,2.0,0_1,25571_0,2434
961,961.0,81819.0,2.0,0_1,25551_0,2465
962,962.0,82171.0,2.0,0_1,25861_0,2463
963,963.0,82976.0,2.0,0_1,25931_0,2477
964,964.0,77241.0,2.0,0_1,25841_0,2555
965,965.0,84417.0,2.0,0_1,26441_0,2593
966,966.0,81339.0,2.0,0_1,26571_0,2659
967,967.0,85950.0,2.0,0_1,27261_0,2701
968,968.0,91143.0,2.0,0_1,26901_0,2687
969,969.0,70751.0,2.0,0_1,26741_0,2652
970,970.0,76589.0,2.0,0_1,26461_0,2635
971,971.0,80941.0,2.0,0_1,26711_0,2659
972,972.0,80516.0,2.0,0_1,27111_0,2690
973,973.0,79064.0,2.0,0_1,26711_0,2663
974,974.0,78094.0,2.0,0_1,26171_0,2630
975,975.0,78123.0,2.0,0_1,26501_0,2634
976,976.0,82402.0,2.0,0_1,26631_0,2665
977,977.0,82911.0,2.0,0_1,26951_0,2684
978,978.0,81948.0,2.0,0_1,27061_0,2664
979,979.0,88558.0,2.0,0_1,27661_0,2739
980,980.0,88293.0,2.0,0_1,28401_0,2815
981,981.0,93149.0,2.0,0_1,28831_0,2795
982,982.0,83575.0,2.0,0_1,28711_0,2777
983,983.0,83243.0,2.0,0_1,29091_0,2787
984,984.0,85267.0,2.0,0_1,29331_0,2784
985,985.0,76260.0,2.0,0_1,29301_0,2790
986,986.0,80139.0,2.0,0_1,28831_0,2767
987,987.0,76625.0,2.0,0_1,28131_0,2705
988,988.0,81325.0,2.0,0_1,27811_0,2757
989,989.0,79393.0,2.0,0_1,27771_0,2747
990,990.0,82883.0,2.0,0_1,28061_0,2735
991,991.0,92860.0,2.0,0_1,28111_0,2709
992,992.0,84338.0,2.0,0_1,27361_0,2678
993,993.0,82982.0,2.0,0_1,27281_0,2675
994,994.0,73849.0,2.0,0_1,27441_0,2699
995,995.0,75237.0,2.0,0_1,27241_0,2672
996,996.0,69723.0,2.0,0_1,26911_0,2662
997,997.0,75050.0,2.0,0_1,26311_0,2650
998,998.0,68695.0,2.0,0_1,26701_0,2644
999,999.0,72942.0,2.0,0_1,26251_0,2592
