0.0,0.0
6853.0,1.0
5030.0,2.0
4224.0,3.0
4704.0,4.0
4680.0,5.0
3451.0,6.0
5149.0,7.0
7090.0,8.0
6797.0,9.0
8480.0,10.0
7104.0,11.0
7901.0,12.0
9982.0,13.0
8130.0,14.0
8412.0,15.0
10895.0,16.0
10521.0,17.0
11624.0,18.0
10031.0,19.0
9486.0,20.0
8009.0,21.0
7245.0,22.0
7697.0,23.0
9352.0,24.0
15995.0,25.0
12365.0,26.0
10419.0,27.0
13896.0,28.0
11379.0,29.0
10573.0,30.0
11773.0,31.0
12213.0,32.0
17481.0,33.0
10950.0,34.0
13066.0,35.0
12642.0,36.0
14146.0,37.0
11651.0,38.0
13443.0,39.0
14473.0,40.0
13299.0,41.0
12495.0,42.0
12324.0,43.0
10743.0,44.0
12055.0,45.0
11857.0,46.0
12087.0,47.0
10768.0,48.0
10248.0,49.0
10672.0,50.0
10382.0,51.0
14491.0,52.0
18110.0,53.0
17367.0,54.0
14427.0,55.0
14579.0,56.0
15634.0,57.0
16914.0,58.0
17199.0,59.0
12864.0,60.0
16386.0,61.0
16633.0,62.0
18387.0,63.0
17850.0,64.0
18250.0,65.0
16107.0,66.0
13997.0,67.0
14311.0,68.0
14388.0,69.0
16866.0,70.0
15599.0,71.0
14155.0,72.0
16845.0,73.0
16201.0,74.0
13339.0,75.0
12805.0,76.0
13884.0,77.0
18836.0,78.0
20518.0,79.0
17305.0,80.0
15255.0,81.0
14374.0,82.0
12969.0,83.0
12789.0,84.0
16850.0,85.0
13350.0,86.0
16352.0,87.0
19714.0,88.0
19627.0,89.0
18930.0,90.0
18615.0,91.0
19639.0,92.0
17671.0,93.0
17862.0,94.0
19598.0,95.0
13715.0,96.0
15817.0,97.0
19420.0,98.0
22043.0,99.0
21973.0,100.0
18945.0,101.0
22087.0,102.0
18253.0,103.0
19890.0,104.0
21392.0,105.0
20401.0,106.0
18954.0,107.0
18834.0,108.0
20264.0,109.0
19949.0,110.0
14591.0,111.0
19524.0,112.0
19347.0,113.0
15291.0,114.0
20944.0,115.0
21230.0,116.0
12913.0,117.0
17984.0,118.0
18255.0,119.0
17212.0,120.0
16630.0,121.0
16105.0,122.0
20053.0,123.0
16093.0,124.0
18650.0,125.0
17744.0,126.0
18915.0,127.0
24075.0,128.0
19669.0,129.0
20060.0,130.0
22079.0,131.0
18471.0,132.0
18939.0,133.0
13946.0,134.0
19373.0,135.0
20661.0,136.0
19619.0,137.0
18676.0,138.0
18265.0,139.0
16794.0,140.0
17298.0,141.0
15984.0,142.0
17090.0,143.0
17679.0,144.0
16508.0,145.0
18041.0,146.0
20506.0,147.0
15304.0,148.0
17405.0,149.0
15934.0,150.0
18571.0,151.0
18587.0,152.0
17662.0,153.0
19202.0,154.0
21324.0,155.0
22113.0,156.0
16221.0,157.0
18253.0,158.0
21234.0,159.0
18719.0,160.0
16978.0,161.0
22844.0,162.0
23948.0,163.0
19905.0,164.0
23424.0,165.0
21823.0,166.0
20164.0,167.0
17400.0,168.0
14449.0,169.0
19902.0,170.0
20726.0,171.0
21154.0,172.0
26460.0,173.0
21582.0,174.0
25010.0,175.0
20971.0,176.0
20581.0,177.0
21808.0,178.0
22986.0,179.0
19867.0,180.0
21811.0,181.0
23323.0,182.0
24962.0,183.0
20852.0,184.0
21671.0,185.0
18997.0,186.0
23233.0,187.0
21626.0,188.0
22960.0,189.0
17742.0,190.0
22783.0,191.0
18623.0,192.0
22599.0,193.0
23509.0,194.0
20834.0,195.0
22787.0,196.0
22407.0,197.0
18012.0,198.0
22503.0,199.0
17970.0,200.0
24820.0,201.0
23903.0,202.0
21390.0,203.0
21560.0,204.0
21178.0,205.0
23096.0,206.0
19986.0,207.0
22160.0,208.0
21840.0,209.0
23928.0,210.0
25325.0,211.0
23044.0,212.0
25629.0,213.0
23340.0,214.0
29351.0,215.0
25447.0,216.0
25810.0,217.0
26222.0,218.0
27781.0,219.0
26934.0,220.0
23015.0,221.0
22418.0,222.0
21832.0,223.0
23204.0,224.0
25933.0,225.0
25307.0,226.0
26394.0,227.0
26880.0,228.0
26334.0,229.0
22420.0,230.0
26745.0,231.0
26504.0,232.0
25326.0,233.0
26291.0,234.0
28144.0,235.0
27195.0,236.0
24473.0,237.0
27829.0,238.0
31829.0,239.0
22467.0,240.0
24743.0,241.0
26474.0,242.0
28087.0,243.0
28448.0,244.0
24997.0,245.0
27595.0,246.0
28610.0,247.0
23643.0,248.0
28875.0,249.0
29577.0,250.0
31115.0,251.0
24625.0,252.0
29257.0,253.0
23695.0,254.0
29668.0,255.0
25765.0,256.0
29686.0,257.0
26113.0,258.0
31601.0,259.0
33613.0,260.0
30871.0,261.0
35947.0,262.0
37774.0,263.0
33347.0,264.0
31650.0,265.0
32434.0,266.0
28298.0,267.0
32830.0,268.0
30426.0,269.0
30329.0,270.0
35268.0,271.0
31026.0,272.0
39079.0,273.0
31563.0,274.0
27315.0,275.0
35045.0,276.0
30395.0,277.0
29230.0,278.0
32795.0,279.0
26796.0,280.0
38047.0,281.0
34962.0,282.0
26416.0,283.0
31527.0,284.0
37730.0,285.0
38850.0,286.0
37637.0,287.0
29542.0,288.0
42348.0,289.0
32143.0,290.0
30887.0,291.0
37957.0,292.0
35477.0,293.0
35385.0,294.0
34510.0,295.0
37398.0,296.0
36744.0,297.0
40956.0,298.0
41968.0,299.0
33692.0,300.0
35170.0,301.0
36126.0,302.0
33161.0,303.0
36798.0,304.0
32433.0,305.0
39349.0,306.0
36824.0,307.0
38020.0,308.0
37564.0,309.0
45980.0,310.0
34218.0,311.0
36694.0,312.0
34981.0,313.0
42700.0,314.0
36065.0,315.0
36472.0,316.0
36164.0,317.0
45615.0,318.0
34666.0,319.0
39079.0,320.0
40979.0,321.0
40893.0,322.0
42416.0,323.0
40154.0,324.0
44000.0,325.0
42345.0,326.0
43654.0,327.0
39858.0,328.0
39928.0,329.0
38861.0,330.0
38342.0,331.0
41878.0,332.0
40429.0,333.0
37401.0,334.0
34586.0,335.0
48234.0,336.0
48106.0,337.0
47005.0,338.0
42871.0,339.0
39278.0,340.0
40535.0,341.0
45592.0,342.0
43454.0,343.0
43710.0,344.0
40879.0,345.0
36655.0,346.0
40773.0,347.0
42919.0,348.0
43910.0,349.0
35501.0,350.0
50114.0,351.0
47388.0,352.0
49616.0,353.0
40874.0,354.0
42127.0,355.0
44637.0,356.0
41471.0,357.0
43319.0,358.0
40430.0,359.0
44317.0,360.0
44903.0,361.0
55787.0,362.0
45367.0,363.0
41053.0,364.0
42513.0,365.0
47165.0,366.0
46826.0,367.0
41502.0,368.0
46608.0,369.0
39717.0,370.0
46765.0,371.0
50655.0,372.0
46601.0,373.0
42363.0,374.0
44307.0,375.0
53803.0,376.0
48051.0,377.0
43609.0,378.0
43067.0,379.0
48669.0,380.0
51377.0,381.0
40704.0,382.0
56433.0,383.0
46646.0,384.0
53911.0,385.0
41824.0,386.0
50110.0,387.0
46454.0,388.0
45840.0,389.0
49176.0,390.0
49734.0,391.0
49279.0,392.0
58053.0,393.0
50529.0,394.0
54960.0,395.0
56000.0,396.0
51651.0,397.0
48703.0,398.0
43496.0,399.0
53283.0,400.0
57390.0,401.0
57307.0,402.0
55108.0,403.0
50802.0,404.0
52244.0,405.0
54025.0,406.0
58415.0,407.0
57330.0,408.0
51671.0,409.0
57523.0,410.0
49271.0,411.0
57133.0,412.0
47062.0,413.0
46856.0,414.0
50393.0,415.0
47169.0,416.0
45424.0,417.0
55765.0,418.0
48458.0,419.0
50779.0,420.0
53125.0,421.0
54493.0,422.0
49239.0,423.0
59202.0,424.0
45683.0,425.0
67468.0,426.0
66897.0,427.0
57601.0,428.0
48549.0,429.0
58090.0,430.0
52553.0,431.0
58759.0,432.0
54978.0,433.0
60591.0,434.0
50371.0,435.0
41408.0,436.0
49255.0,437.0
51182.0,438.0
56006.0,439.0
59149.0,440.0
56173.0,441.0
60776.0,442.0
48564.0,443.0
38396.0,444.0
50858.0,445.0
56464.0,446.0
53688.0,447.0
56316.0,448.0
50114.0,449.0
53365.0,450.0
52072.0,451.0
53403.0,452.0
46804.0,453.0
49333.0,454.0
58243.0,455.0
59642.0,456.0
58351.0,457.0
57582.0,458.0
51808.0,459.0
64418.0,460.0
50798.0,461.0
61765.0,462.0
58390.0,463.0
53848.0,464.0
55560.0,465.0
58749.0,466.0
55437.0,467.0
60517.0,468.0
66488.0,469.0
66927.0,470.0
60561.0,471.0
57654.0,472.0
61800.0,473.0
60766.0,474.0
72944.0,475.0
56084.0,476.0
64505.0,477.0
58748.0,478.0
62486.0,479.0
50433.0,480.0
49941.0,481.0
54105.0,482.0
56514.0,483.0
47228.0,484.0
57794.0,485.0
65195.0,486.0
59144.0,487.0
59633.0,488.0
53214.0,489.0
61856.0,490.0
60020.0,491.0
58702.0,492.0
63321.0,493.0
58450.0,494.0
69712.0,495.0
57026.0,496.0
51680.0,497.0
61856.0,498.0
64768.0,499.0
41212.0,500.0
59828.0,501.0
50643.0,502.0
64705.0,503.0
66124.0,504.0
60765.0,505.0
62014.0,506.0
54646.0,507.0
53181.0,508.0
53128.0,509.0
62704.0,510.0
53469.0,511.0
63747.0,512.0
62248.0,513.0
61815.0,514.0
52675.0,515.0
58036.0,516.0
62345.0,517.0
61595.0,518.0
62414.0,519.0
56372.0,520.0
48622.0,521.0
68954.0,522.0
68558.0,523.0
62734.0,524.0
68149.0,525.0
61814.0,526.0
64750.0,527.0
57485.0,528.0
71193.0,529.0
70213.0,530.0
60108.0,531.0
58507.0,532.0
56625.0,533.0
77693.0,534.0
69493.0,535.0
67238.0,536.0
77878.0,537.0
68317.0,538.0
72332.0,539.0
67209.0,540.0
64790.0,541.0
65934.0,542.0
71936.0,543.0
73954.0,544.0
65693.0,545.0
66805.0,546.0
66807.0,547.0
60300.0,548.0
63119.0,549.0
63920.0,550.0
62298.0,551.0
70571.0,552.0
68887.0,553.0
69228.0,554.0
68897.0,555.0
74771.0,556.0
68291.0,557.0
70003.0,558.0
58435.0,559.0
75924.0,560.0
71916.0,561.0
72784.0,562.0
72753.0,563.0
80451.0,564.0
68845.0,565.0
64252.0,566.0
60327.0,567.0
60973.0,568.0
71184.0,569.0
73129.0,570.0
64214.0,571.0
72109.0,572.0
81283.0,573.0
75841.0,574.0
72298.0,575.0
55632.0,576.0
73890.0,577.0
65606.0,578.0
68971.0,579.0
77184.0,580.0
79764.0,581.0
66159.0,582.0
62451.0,583.0
59566.0,584.0
73851.0,585.0
61148.0,586.0
57055.0,587.0
61871.0,588.0
58567.0,589.0
56229.0,590.0
52968.0,591.0
49275.0,592.0
68741.0,593.0
62231.0,594.0
64994.0,595.0
63879.0,596.0
59483.0,597.0
71582.0,598.0
62520.0,599.0
66466.0,600.0
62485.0,601.0
60783.0,602.0
70611.0,603.0
63014.0,604.0
62614.0,605.0
69057.0,606.0
70785.0,607.0
65656.0,608.0
73677.0,609.0
68316.0,610.0
65032.0,611.0
59813.0,612.0
53634.0,613.0
66977.0,614.0
69918.0,615.0
68114.0,616.0
59935.0,617.0
58934.0,618.0
56169.0,619.0
65745.0,620.0
65320.0,621.0
60279.0,622.0
63892.0,623.0
69342.0,624.0
72837.0,625.0
73173.0,626.0
59628.0,627.0
75328.0,628.0
70510.0,629.0
66386.0,630.0
75330.0,631.0
68759.0,632.0
58311.0,633.0
71282.0,634.0
66378.0,635.0
65065.0,636.0
67764.0,637.0
70453.0,638.0
75354.0,639.0
67152.0,640.0
58359.0,641.0
75690.0,642.0
82784.0,643.0
71277.0,644.0
77083.0,645.0
75535.0,646.0
64046.0,647.0
82199.0,648.0
71586.0,649.0
75934.0,650.0
58458.0,651.0
77005.0,652.0
58705.0,653.0
59520.0,654.0
81086.0,655.0
70792.0,656.0
72659.0,657.0
73873.0,658.0
67478.0,659.0
78966.0,660.0
72291.0,661.0
75243.0,662.0
74408.0,663.0
74952.0,664.0
64410.0,665.0
71445.0,666.0
76321.0,667.0
85995.0,668.0
82746.0,669.0
75194.0,670.0
74295.0,671.0
77664.0,672.0
78856.0,673.0
75563.0,674.0
75843.0,675.0
74997.0,676.0
70993.0,677.0
76323.0,678.0
72619.0,679.0
73621.0,680.0
78671.0,681.0
85640.0,682.0
67514.0,683.0
65357.0,684.0
74582.0,685.0
71174.0,686.0
63456.0,687.0
65016.0,688.0
68847.0,689.0
78202.0,690.0
65314.0,691.0
69327.0,692.0
72834.0,693.0
66417.0,694.0
62987.0,695.0
70023.0,696.0
72881.0,697.0
72624.0,698.0
76145.0,699.0
71212.0,700.0
70581.0,701.0
74522.0,702.0
85610.0,703.0
79020.0,704.0
79980.0,705.0
77787.0,706.0
76712.0,707.0
75950.0,708.0
81974.0,709.0
78529.0,710.0
84102.0,711.0
81758.0,712.0
65084.0,713.0
86547.0,714.0
76873.0,715.0
78505.0,716.0
73709.0,717.0
85562.0,718.0
76398.0,719.0
72841.0,720.0
71528.0,721.0
73041.0,722.0
70625.0,723.0
80413.0,724.0
77319.0,725.0
77908.0,726.0
68126.0,727.0
87748.0,728.0
81210.0,729.0
78633.0,730.0
66405.0,731.0
80440.0,732.0
73548.0,733.0
84690.0,734.0
79714.0,735.0
62942.0,736.0
72460.0,737.0
66372.0,738.0
74480.0,739.0
71079.0,740.0
88774.0,741.0
73766.0,742.0
75560.0,743.0
67274.0,744.0
66705.0,745.0
76472.0,746.0
78473.0,747.0
81179.0,748.0
78192.0,749.0
68499.0,750.0
58249.0,751.0
62335.0,752.0
55575.0,753.0
78630.0,754.0
77505.0,755.0
64103.0,756.0
79267.0,757.0
79694.0,758.0
78657.0,759.0
67314.0,760.0
73624.0,761.0
79024.0,762.0
78499.0,763.0
86656.0,764.0
83315.0,765.0
80030.0,766.0
88358.0,767.0
83644.0,768.0
70048.0,769.0
80380.0,770.0
84614.0,771.0
74039.0,772.0
80128.0,773.0
84169.0,774.0
81846.0,775.0
79728.0,776.0
84386.0,777.0
71297.0,778.0
82308.0,779.0
80850.0,780.0
78202.0,781.0
84877.0,782.0
95576.0,783.0
95739.0,784.0
91216.0,785.0
76618.0,786.0
94996.0,787.0
89923.0,788.0
80803.0,789.0
84680.0,790.0
95368.0,791.0
87998.0,792.0
80486.0,793.0
97725.0,794.0
100025.0,795.0
89113.0,796.0
80583.0,797.0
81291.0,798.0
80870.0,799.0
92132.0,800.0
85676.0,801.0
99748.0,802.0
80455.0,803.0
86210.0,804.0
81323.0,805.0
88582.0,806.0
90699.0,807.0
82077.0,808.0
86654.0,809.0
83114.0,810.0
79169.0,811.0
83973.0,812.0
90154.0,813.0
83163.0,814.0
88628.0,815.0
89370.0,816.0
85213.0,817.0
88063.0,818.0
82303.0,819.0
94803.0,820.0
65869.0,821.0
82136.0,822.0
77954.0,823.0
74803.0,824.0
91560.0,825.0
92292.0,826.0
89152.0,827.0
81617.0,828.0
91184.0,829.0
80355.0,830.0
87190.0,831.0
91672.0,832.0
100671.0,833.0
77540.0,834.0
83523.0,835.0
103544.0,836.0
93228.0,837.0
71938.0,838.0
80542.0,839.0
87510.0,840.0
89704.0,841.0
85444.0,842.0
102638.0,843.0
93388.0,844.0
96023.0,845.0
92688.0,846.0
71076.0,847.0
89928.0,848.0
86278.0,849.0
77877.0,850.0
90227.0,851.0
99490.0,852.0
92491.0,853.0
80704.0,854.0
89744.0,855.0
104275.0,856.0
99010.0,857.0
100827.0,858.0
96324.0,859.0
98309.0,860.0
96530.0,861.0
96614.0,862.0
92399.0,863.0
65610.0,864.0
91437.0,865.0
82710.0,866.0
84657.0,867.0
85800.0,868.0
114302.0,869.0
107327.0,870.0
99000.0,871.0
91212.0,872.0
85530.0,873.0
89332.0,874.0
68641.0,875.0
70517.0,876.0
97669.0,877.0
98024.0,878.0
87607.0,879.0
92936.0,880.0
88649.0,881.0
82866.0,882.0
81430.0,883.0
76758.0,884.0
76644.0,885.0
73457.0,886.0
85433.0,887.0
90013.0,888.0
96534.0,889.0
78483.0,890.0
66668.0,891.0
65132.0,892.0
81554.0,893.0
83239.0,894.0
89481.0,895.0
89482.0,896.0
90477.0,897.0
83349.0,898.0
91799.0,899.0
90180.0,900.0
89948.0,901.0
76916.0,902.0
93610.0,903.0
89965.0,904.0
93520.0,905.0
89654.0,906.0
69680.0,907.0
77409.0,908.0
81577.0,909.0
90927.0,910.0
83257.0,911.0
92802.0,912.0
85151.0,913.0
78309.0,914.0
84966.0,915.0
90386.0,916.0
97473.0,917.0
100639.0,918.0
79846.0,919.0
90412.0,920.0
102609.0,921.0
84728.0,922.0
84809.0,923.0
87199.0,924.0
91551.0,925.0
88906.0,926.0
86591.0,927.0
82160.0,928.0
97916.0,929.0
84410.0,930.0
82027.0,931.0
88794.0,932.0
83487.0,933.0
83050.0,934.0
82727.0,935.0
103304.0,936.0
90428.0,937.0
89149.0,938.0
94758.0,939.0
105680.0,940.0
85296.0,941.0
87180.0,942.0
104587.0,943.0
61235.0,944.0
94302.0,945.0
92588.0,946.0
89978.0,947.0
108231.0,948.0
86310.0,949.0
81753.0,950.0
93659.0,951.0
82936.0,952.0
82336.0,953.0
84077.0,954.0
85034.0,955.0
92615.0,956.0
89412.0,957.0
111078.0,958.0
99736.0,959.0
80012.0,960.0
78379.0,961.0
96675.0,962.0
91983.0,963.0
72644.0,964.0
102044.0,965.0
79315.0,966.0
85748.0,967.0
89734.0,968.0
96654.0,969.0
99739.0,970.0
107428.0,971.0
90390.0,972.0
89912.0,973.0
88655.0,974.0
82345.0,975.0
100875.0,976.0
79050.0,977.0
92909.0,978.0
93600.0,979.0
86464.0,980.0
87990.0,981.0
106749.0,982.0
94149.0,983.0
96609.0,984.0
94435.0,985.0
89451.0,986.0
94700.0,987.0
87471.0,988.0
105114.0,989.0
108057.0,990.0
95030.0,991.0
100187.0,992.0
104111.0,993.0
103726.0,994.0
97127.0,995.0
93822.0,996.0
105086.0,997.0
107056.0,998.0
89837.0,999.0
