gofmt test

Status Job ID Name Coverage
  Prebuild
passed #319266514
check feature flags docs

00:01:37

passed #319266511
clone test repo

00:01:29

passed #319266513
dep check

00:01:39

passed #319266510
docker
helper images

00:05:51

passed #319266512
gitlab-org
tests definitions

00:03:12

 
  Test
passed #319266516
code_quality

00:02:02

passed #319266527
docs lint

00:01:08

passed #319266528
git 1.7.1

00:02:12

passed #319266515
license_management

00:03:16

passed #319266517
docker
unit test 1/5

00:03:47

passed #319266518
docker
unit test 2/5

00:13:35

passed #319266519
docker
unit test 3/5

00:04:46

passed #319266520
docker
unit test 4/5

00:02:56

passed #319266521
docker
unit test 5/5

00:02:57

failed #319266522
docker allowed to fail
unit test with race 1/5

00:04:39

failed #319266523
docker allowed to fail
unit test with race 2/5

00:15:05

failed #319266524
docker allowed to fail
unit test with race 3/5

00:05:46

passed #319266525
docker
unit test with race 4/5

00:03:34

passed #319266526
docker
unit test with race 5/5

00:04:18

 
  Coverage
passed #319266532
check windows 1803 test failures

00:01:30

passed #319266533
check windows 1809 test failures

00:01:19

passed #319266530
race conditions detector

00:01:07

passed #319266529
test coverage report

00:01:08

64.8%
passed #319266531
test junit report

00:01:25

 
  Build
passed #319266534
gitlab-org
binaries darwin/386 darwin/amd64

00:03:47

passed #319266535
gitlab-org
binaries freebsd/386 freebsd/amd64 freebsd/arm

00:05:18

passed #319266536
gitlab-org
binaries linux/386 linux/amd64 linux/arm

00:05:28

passed #319266537
gitlab-org
binaries windows/386 windows/amd64

00:03:41

 
  Package
passed #319266538
gitlab-org
package-deb

00:01:28

passed #319266539
gitlab-org
package-rpm

00:01:14

 
  Release
passed #319266540
docker
development docker images

00:04:05

passed #319266541
static QA

00:00:41

 
  Docs
manual #319266543
allowed to fail manual
review-docs-cleanup
manual #319266542
allowed to fail manual
review-docs-deploy
 
Name Stage Failure
failed
unit test with race 1/5 Test
coverage: 5.8% of statements
ok gitlab.com/gitlab-org/gitlab-runner/common 1.076s coverage: 5.8% of statements
Makefile:121: recipe for target 'parallel_test_execute' failed
make: *** [parallel_test_execute] Error 1
Uploading artifacts...
.cover/*: found 15 matching files
.testoutput/*: found 15 matching files

Uploading artifacts to coordinator... ok
id=319266522 responseStatus=201 Created token=4LcTwzss
ERROR: Job failed: exit code 1
failed
unit test with race 3/5 Test
coverage: 52.6% of statements
ok gitlab.com/gitlab-org/gitlab-runner/helpers 1.030s coverage: 52.6% of statements
Makefile:121: recipe for target 'parallel_test_execute' failed
make: *** [parallel_test_execute] Error 1
Uploading artifacts...
.cover/*: found 15 matching files
.testoutput/*: found 15 matching files

Uploading artifacts to coordinator... ok
id=319266524 responseStatus=201 Created token=J155Gxmr
ERROR: Job failed: exit code 1
failed
unit test with race 2/5 Test
coverage: 24.2% of statements
ok gitlab.com/gitlab-org/gitlab-runner/executors/docker/internal/volumes 1.059s coverage: 24.2% of statements
Makefile:121: recipe for target 'parallel_test_execute' failed
make: *** [parallel_test_execute] Error 1
Uploading artifacts...
.cover/*: found 15 matching files
.testoutput/*: found 15 matching files

Uploading artifacts to coordinator... ok
id=319266523 responseStatus=201 Created token=eZX6WW1t
ERROR: Job failed: exit code 1