{
  "useSmtp": false,
  "host": "23.229.237.201",
  "port": 22,
  "username": "cascoalvarez.sebastian@gmail.com",
  "password": "Quikazz1010",
  "recipientEmail":  "cascoalvarez.sebastian@gmail.com"
}
