<?xml version="1.0" encoding="utf-8"?>
<!-- Generator: Adobe Illustrator 26.2.1, SVG Export Plug-In . SVG Version: 6.00 Build 0)  -->
<svg version="1.1" id="Layer_1" xmlns="http://www.w3.org/2000/svg" xmlns:xlink="http://www.w3.org/1999/xlink" x="0px" y="0px"
	 viewBox="0 0 512 512" style="enable-background:new 0 0 512 512;" xml:space="preserve">
<path d="M256,440.3c-64,0-120.6-32.8-153.6-82.4C103.2,306.9,204.8,279,256,279c50.9,0,152.8,27.9,153.6,78.8
	C376.6,407.6,320,440.3,256,440.3z M256,76.8c42.5,0,76.8,34.3,76.8,76.8s-34.3,76.8-76.8,76.8s-76.8-34.3-76.8-76.8
	S213.5,76.8,256,76.8z M256,0C114.7,0,0,114.7,0,256s114.7,256,256,256s256-114.7,256-256S397.3,0,256,0z"/>
</svg>
