<?xml version="1.0" encoding="UTF-8"?>
<svg width="17px" height="18px" viewBox="0 0 17 18" version="1.1" xmlns="http://www.w3.org/2000/svg" xmlns:xlink="http://www.w3.org/1999/xlink">
    <title>Group</title>
    <g id="-" stroke="none" stroke-width="1" fill="none" fill-rule="evenodd">
        <g id="Reports---Overview" transform="translate(-1221.000000, -384.000000)" fill="#8892B0">
            <g id="Group" transform="translate(1221.000000, 384.000000)">
                <polygon id="Path" points="16.9411765 18 16.9411765 3 10.7807487 3 10.7807487 4.5 15.4010695 4.5 15.4010695 16.5 1.54010695 16.5 1.54010695 4.5 6.16042781 4.5 6.16042781 3 0 3 0 18"></polygon>
                <polygon id="Path" points="7.70053476 8.25 4.62032086 8.25 8.47058824 12.75 12.3208556 8.25 9.24064171 8.25 9.24064171 0 7.70053476 0"></polygon>
            </g>
        </g>
    </g>
</svg>