<?xml version="1.0" encoding="utf-8"?>
<!-- Generator: Adobe Illustrator 26.2.1, SVG Export Plug-In . SVG Version: 6.00 Build 0)  -->
<svg version="1.1" id="Layer_1" xmlns="http://www.w3.org/2000/svg" xmlns:xlink="http://www.w3.org/1999/xlink" x="0px" y="0px"
	 viewBox="0 0 512 512" style="enable-background:new 0 0 512 512;" xml:space="preserve">
<g>
	<path d="M256,360c-10.6,0-20.7-4.6-27.7-12.7L92.1,189.6c-4.2-4.8-3.6-12.1,1.2-16.3l37.8-32.7c4.8-4.2,12.1-3.6,16.3,1.2
		L256,267.4l108.6-125.7c4.2-4.8,11.5-5.4,16.3-1.2l37.8,32.7c4.8,4.2,5.4,11.5,1.2,16.3L283.7,347.3C276.7,355.3,266.6,360,256,360
		z"/>
</g>
</svg>
