%YAML 1.1
%TAG !u! tag:unity3d.com,2011:
--- !u!1045 &1
EditorBuildSettings:
  m_ObjectHideFlags: 0
  serializedVersion: 2
  m_Scenes:
  - enabled: 1
    path: Assets/Scenes/MainMenu.unity
    guid: e3ed83fa32c053f4c99402627c80d12e
  - enabled: 1
    path: Assets/Scenes/Level1.unity
    guid: b8db0ca31ed4ec049a346f7fd65f3ebd
  - enabled: 1
    path: Assets/Scenes/Level2.unity
    guid: 18e09189d6438fb4e8258249ae44b12a
  - enabled: 1
    path: Assets/Scenes/Level3.unity
    guid: 74674273fdbc5e7488b30d3a4afe0232
  - enabled: 1
    path: Assets/Scenes/EndScene.unity
    guid: 03ada191d5da64a4f8b37a27f924abaf
  - enabled: 1
    path: Assets/Scenes/RandomLevelScene.unity
    guid: 9fc0d4010bbf28b4594072e72b8655ab
  m_configObjects: {}
