{
  "mainMenuPlayButtonText": "Spielen",
  "mainMenuHighscoresButtonText": "Highscores",
  "mainMenuOptionsButtonText": "Optionen",
  "mainMenuQuitButtonText": "Beenden",
  "mainMenuBackText": "Zurück",
  "gameWinText": "Ziel erreicht",
  "gameLoseText": "Leider verloren",
  "gameAgainButtonText": "Nochmal versuchen",
  "gameNextButtonText": "Nächstes Level",
  "gameMenuButtonText": "Zurück zum Hauptmenu"
}