is blinded by the dirt
appears to be blinded\.$
is blinded by some flying debris!$
is already blinded\.$
been blinded\.$
(\w+) can no longer find the strength
looks very ill\.$
looks tired and weak\.$
is already held in slumber\.$
falls into a deep sleep\.$
is moving more slowly\.$
head and passes out\.$
^You feel your mace come alive in your hand, a beautiful song rising with each swing\.$
as a hollow shrieking fills the room\.$
neck and puts
screams in agony as plague sores erupt from
looks very uncomfortable\.$
^You anticipate .* and easily avoid it\.$
^With (?&gt;masterful precision, you parry|a flap of your wings)
with a fake to your (left|right)\.$
^You (?&gt;evade|nimbly avoid|use your (?&gt;speed and the open space to keep|agility to evade)|hop to one side|position your body|deftly maneuver behind some nearby rocks|take cover from|push .+ into a nearby wall)
looks dazed from all of your blows\.$
's artery begins pumping out bright red bursts of blood!$
slowly floats to the ground\.$
and devise a plan to avoid it\.$
stiffens at a ghoul's unclean touch!$
on the head with a blackjack\.  Ouch\.$
face freezes in shock!$
in (?&gt;his|her|it) eyes as terror grips (?&gt;him|her|it)\.$
clouding with a viscid film\.$
pores of (?&gt;his|her|its) skin start to bleed profusely\.$
and the fire fades from (?&gt;his|her|its) eyes\.$
.* looking uncomfortable\.$
