.* is caught in the center of your spray of grease, .*
.* nimbly evades most of your created ooze, but still is splashed!$
.* is already coated in grease.$
.* is splashed by your created ooze!$
.* is surrounded by the flare\'s radiance.$
.* its stored charge is unleashed!$
.* convulses as electricity courses through .*$
The electrical charge wears off .*
^Your hands begin to emanate an aura of cold\.$
^Your hands must be bare to employ an acidic secretion\.$
^Your hands begin to ooze a viscous, acrid-smelling green liquid\.$
^You prepare to channel heat\.$
.* crackles softly as tiny bolts of lightning begin to play up and down it\.$
.* feet by the force of the wind\!$
.* is already charged with electricity\.$
There isn't any wind here.  Draft, yes\.$
There is no solid ground beneath your feet\.$
.* is unaffected by your stoneshatter\.$
^You can only charge the weapon you are wielding whilst fighting\.$
A durable patina of stone forms a tight layer against your flesh\.$
You are ready to cast weave of elements again\.$
You gracefully thread magic from different paths together into a weave of the elements\.$
The grease here thins and fades away\.$
The cloud of silt dissipates.
You must be underwater to create a siltscreen.
There are no mountains nearby from which you could call an avalanche.
You would not be able to throw the pebble far enough underwater.
Distracted, you let your stream of vitriol fade to nothingness.
.* rendered ineffective.*
.* stoneshatter is halted.*
