^Your hand transforms into a devilish claw as you grasp your unholy weapon in an (?&gt;unbreakable|undispellable) grip\.$
^You have (?&gt;bound|deafened)
^You feel the souls of the damned protect you\.$
willing the howling spirits to enter it\.$
^You raise your fists above your head and release a demonic howl!$
^You feel yourself moving more quickly as bloodlust surges within you!$
^You delve deep into your mind and find a place away from the pain\.$
is already deaf\.$
slumber is now magical\.$
suddenly slumps to the ground and sleeps\.$
IN HALF!$
^Your pulse races as you are filled with unholy might!$
^You (?&gt;feel a dark hunger coming over you|can control your unholy blessing again)\.$
^You feel the power of the damned fade\.$
^Your aura of despair fades\.$
^Your (?&gt;bloodlust fades|worldbinding attempt failed)\.$
^You somehow fail to grip
^Your deafen spell failed\.$
^You (?&gt;fail to drain energy|snort with anger as you)
^Your curse failed to take effect\.$
^You fall flat on your face!$
glows with unholy light .+ (?&gt;mind|soul)\.$
^As you lash .+ hand, he yelps and releases
^The magic of your iron grip of Azazel unravels\.$
