alembic==1.4.2
aniso8601==8.0.0
certifi==2020.4.5.1
chardet==3.0.4
click==7.1.1
ecdsa==0.15
Flask==1.1.2
Flask-Cors==3.0.8
Flask-Migrate==2.5.3
Flask-RESTful==0.3.8
Flask-Script==2.0.6
Flask-SQLAlchemy==2.4.1
idna==2.9
itsdangerous==1.1.0
Jinja2==2.11.1
jose==1.0.0
Mako==1.1.2
MarkupSafe==1.1.1
pyasn1==0.4.8
PyMySQL==0.9.3
python-dateutil==2.8.1
python-editor==1.0.4
python-jose==3.1.0
pytz==2019.3
requests==2.23.0
rsa==4.0
six==1.14.0
SQLAlchemy==1.3.16
urllib3==1.25.9
Werkzeug==1.0.1
boto3==1.5.12
botocore==1.8.26
s3transfer==0.1.12