{
    "Moms": [
        "A-1",
        "A-2",
        "A-3",
        "A-4",
        "A-5",
        "A-6",
        "A-7",
        "A-8",
        "B-1",
        "B-2",
        "B-3",
        "B-4",
        "B-5",
        "B-6",
        "B-7",
        "B-8",
        "C-1",
        "C-2",
        "C-3",
        "C-4",
        "C-5",
        "C-6",
        "C-7",
        "C-8",
        "1.A.1",
        "1.A.2",
        "1.A.3",
        "1.B.1",
        "1.B.2",
        "1.B.3",
        "1.C.1",
        "1.C.2",
        "1.C.3",
        "1.D.1",
        "1.D.2",
        "1.D.3",
        "2.A.1",
        "2.A.2",
        "2.A.3",
        "2.B.1",
        "2.B.2",
        "2.B.3",
        "2.C.1",
        "2.C.2",
        "2.C.3",
        "2.D.1",
        "2.D.2",
        "2.D.3"
    ]
}