1A400021266EDF4000637376,298,Grams,DRYING ROOM #9,12/17/2019 020 HOHI,,12/17/2019
1A400021266EDF4000637383,310,Grams,DRYING ROOM #9,12/17/2019 020 HOHI,,12/17/2019
1A400021266EDF4000638148,378,Grams,DRYING ROOM #9,12/17/2019 020 BLBU,,12/17/2019
1A400021266EDF4000638151,352,Grams,DRYING ROOM #9,12/17/2019 020 BLBU,,12/17/2019
1A400021266EDF4000638076,288,Grams,DRYING ROOM #9,12/17/2019 020 BLSTBO,,12/17/2019
1A400021266EDF4000638122,346,Grams,DRYING ROOM #9,12/17/2019 020 BLSTBO,,12/17/2019
1A400021266EDF4000637916,360,Grams,DRYING ROOM #9,12/17/2019 020 GORU,,12/17/2019
1A400021266EDF4000637926,312,Grams,DRYING ROOM #9,12/17/2019 020 GORU,,12/17/2019
1A400021266EDF4000637996,406,Grams,DRYING ROOM #9,12/17/2019 020 PH,,12/17/2019
1A400021266EDF4000638029,378,Grams,DRYING ROOM #9,12/17/2019 020 PH,,12/17/2019
1A400021266EDF4000638495,320,Grams,DRYING ROOM #9,12/17/2019 020 ROSE,,12/17/2019
1A400021266EDF4000638534,296,Grams,DRYING ROOM #9,12/17/2019 020 ROSE,,12/17/2019
1A400021266EDF4000636857,248,Grams,DRYING ROOM #9,12/17/2019 020 SOJO,,12/17/2019
1A400021266EDF4000636903,272,Grams,DRYING ROOM #9,12/17/2019 020 SOJO,,12/17/2019
1A400021266EDF4000640244,328,Grams,DRYING ROOM #9,12/17/2019 020 CRSOCO,,12/17/2019
1A400021266EDF4000640294,290,Grams,DRYING ROOM #9,12/17/2019 020 CRSOCO,,12/17/2019
1A400021266EDF4000632034,240,Grams,DRYING ROOM #9,12/17/2019 020 CR,,12/17/2019
1A400021266EDF4000632035,266,Grams,DRYING ROOM #9,12/17/2019 020 CR,,12/17/2019
1A400021266EDF4000640119,314,Grams,DRYING ROOM #9,12/17/2019 020 GLSL,,12/17/2019
1A400021266EDF4000640489,338,Grams,DRYING ROOM #9,12/17/2019 020 GLSL,,12/17/2019
1A400021266EDF4000635771,228,Grams,DRYING ROOM #9,12/17/2019 020 TEBO,,12/17/2019
1A400021266EDF4000635780,236,Grams,DRYING ROOM #9,12/17/2019 020 TEBO,,12/17/2019
