1A400021266EDF4000640414,268,Grams,DRYING ROOM #9,12/18/2019 020 CRSOCO,,12/18/2019
1A400021266EDF4000640426,316,Grams,DRYING ROOM #9,12/18/2019 020 CRSOCO,,12/18/2019
1A400021266EDF4000640427,366,Grams,DRYING ROOM #9,12/18/2019 020 CRSOCO,,12/18/2019
1A400021266EDF4000640428,244,Grams,DRYING ROOM #9,12/18/2019 020 CRSOCO,,12/18/2019
1A400021266EDF4000640429,272,Grams,DRYING ROOM #9,12/18/2019 020 CRSOCO,,12/18/2019
1A400021266EDF4000640430,246,Grams,DRYING ROOM #9,12/18/2019 020 CRSOCO,,12/18/2019
1A400021266EDF4000640435,214,Grams,DRYING ROOM #9,12/18/2019 020 CRSOCO,,12/18/2019
1A400021266EDF4000640437,258,Grams,DRYING ROOM #9,12/18/2019 020 CRSOCO,,12/18/2019
1A400021266EDF4000640445,338,Grams,DRYING ROOM #9,12/18/2019 020 CRSOCO,,12/18/2019
1A400021266EDF4000640448,338,Grams,DRYING ROOM #9,12/18/2019 020 CRSOCO,,12/18/2019
1A400021266EDF4000645851,224,Grams,DRYING ROOM #9,12/18/2019 020 CRSOCO,,12/18/2019
1A400021266EDF4000645879,96,Grams,DRYING ROOM #9,12/18/2019 020 CRSOCO,,12/18/2019
1A400021266EDF4000629631,396,Grams,DRYING ROOM #9,12/18/2019 020 CRSOCO,,12/18/2019
1A400021266EDF4000629729,214,Grams,DRYING ROOM #9,12/18/2019 020 CRSOCO,,12/18/2019
1A400021266EDF4000639633,198,Grams,DRYING ROOM #9,12/18/2019 020 BLSTBO,,12/18/2019
1A400021266EDF4000639634,306,Grams,DRYING ROOM #9,12/18/2019 020 BLSTBO,,12/18/2019
1A400021266EDF4000639638,354,Grams,DRYING ROOM #9,12/18/2019 020 BLSTBO,,12/18/2019
1A400021266EDF4000639642,258,Grams,DRYING ROOM #9,12/18/2019 020 BLSTBO,,12/18/2019
1A400021266EDF4000639649,244,Grams,DRYING ROOM #9,12/18/2019 020 BLSTBO,,12/18/2019
1A400021266EDF4000639655,316,Grams,DRYING ROOM #9,12/18/2019 020 BLSTBO,,12/18/2019
1A400021266EDF4000639658,356,Grams,DRYING ROOM #9,12/18/2019 020 BLSTBO,,12/18/2019
1A400021266EDF4000639663,280,Grams,DRYING ROOM #9,12/18/2019 020 BLSTBO,,12/18/2019
1A400021266EDF4000639670,286,Grams,DRYING ROOM #9,12/18/2019 020 BLSTBO,,12/18/2019
1A400021266EDF4000639672,262,Grams,DRYING ROOM #9,12/18/2019 020 BLSTBO,,12/18/2019
1A400021266EDF4000639673,274,Grams,DRYING ROOM #9,12/18/2019 020 BLSTBO,,12/18/2019
1A400021266EDF4000639679,194,Grams,DRYING ROOM #9,12/18/2019 020 BLSTBO,,12/18/2019
1A400021266EDF4000639683,318,Grams,DRYING ROOM #9,12/18/2019 020 BLSTBO,,12/18/2019
1A400021266EDF4000639684,342,Grams,DRYING ROOM #9,12/18/2019 020 BLSTBO,,12/18/2019
1A400021266EDF4000639686,304,Grams,DRYING ROOM #9,12/18/2019 020 BLSTBO,,12/18/2019
1A400021266EDF4000639690,164,Grams,DRYING ROOM #9,12/18/2019 020 BLSTBO,,12/18/2019
1A400021266EDF4000639694,132,Grams,DRYING ROOM #9,12/18/2019 020 BLSTBO,,12/18/2019
1A400021266EDF4000639716,164,Grams,DRYING ROOM #9,12/18/2019 020 BLSTBO,,12/18/2019
1A400021266EDF4000639718,30,Grams,DRYING ROOM #9,12/18/2019 020 BLSTBO,,12/18/2019
1A400021266EDF4000639722,228,Grams,DRYING ROOM #9,12/18/2019 020 BLSTBO,,12/18/2019
1A400021266EDF4000639726,206,Grams,DRYING ROOM #9,12/18/2019 020 BLSTBO,,12/18/2019
1A400021266EDF4000639727,160,Grams,DRYING ROOM #9,12/18/2019 020 BLSTBO,,12/18/2019
1A400021266EDF4000639728,300,Grams,DRYING ROOM #9,12/18/2019 020 BLSTBO,,12/18/2019
1A400021266EDF4000639772,432,Grams,DRYING ROOM #9,12/18/2019 020 CRSOCO,,12/18/2019
1A400021266EDF4000639786,60,Grams,DRYING ROOM #9,12/18/2019 020 CRSOCO,,12/18/2019
1A400021266EDF4000639799,46,Grams,DRYING ROOM #9,12/18/2019 020 CRSOCO,,12/18/2019
1A400021266EDF4000639800,312,Grams,DRYING ROOM #9,12/18/2019 020 CRSOCO,,12/18/2019
1A400021266EDF4000639806,20,Grams,DRYING ROOM #9,12/18/2019 020 CRSOCO,,12/18/2019
1A400021266EDF4000639833,262,Grams,DRYING ROOM #9,12/18/2019 020 BLSTBO,,12/18/2019
1A400021266EDF4000639834,174,Grams,DRYING ROOM #9,12/18/2019 020 BLSTBO,,12/18/2019
1A400021266EDF4000639835,300,Grams,DRYING ROOM #9,12/18/2019 020 BLSTBO,,12/18/2019
1A400021266EDF4000639842,320,Grams,DRYING ROOM #9,12/18/2019 020 BLSTBO,,12/18/2019
1A400021266EDF4000639844,30,Grams,DRYING ROOM #9,12/18/2019 020 BLSTBO,,12/18/2019
1A400021266EDF4000639845,380,Grams,DRYING ROOM #9,12/18/2019 020 BLSTBO,,12/18/2019
1A400021266EDF4000639846,304,Grams,DRYING ROOM #9,12/18/2019 020 BLSTBO,,12/18/2019
1A400021266EDF4000639850,224,Grams,DRYING ROOM #9,12/18/2019 020 BLSTBO,,12/18/2019
1A400021266EDF4000639858,150,Grams,DRYING ROOM #9,12/18/2019 020 BLSTBO,,12/18/2019
1A400021266EDF4000639859,150,Grams,DRYING ROOM #9,12/18/2019 020 BLSTBO,,12/18/2019
1A400021266EDF4000639870,200,Grams,DRYING ROOM #9,12/18/2019 020 BLSTBO,,12/18/2019
1A400021266EDF4000639888,312,Grams,DRYING ROOM #9,12/18/2019 020 BLSTBO,,12/18/2019
1A400021266EDF4000639889,260,Grams,DRYING ROOM #9,12/18/2019 020 BLSTBO,,12/18/2019
1A400021266EDF4000639891,252,Grams,DRYING ROOM #9,12/18/2019 020 BLSTBO,,12/18/2019
1A400021266EDF4000639898,278,Grams,DRYING ROOM #9,12/18/2019 020 BLSTBO,,12/18/2019
1A400021266EDF4000639901,254,Grams,DRYING ROOM #9,12/18/2019 020 BLSTBO,,12/18/2019
1A400021266EDF4000639902,202,Grams,DRYING ROOM #9,12/18/2019 020 BLSTBO,,12/18/2019
1A400021266EDF4000639904,308,Grams,DRYING ROOM #9,12/18/2019 020 BLSTBO,,12/18/2019
1A400021266EDF4000639905,242,Grams,DRYING ROOM #9,12/18/2019 020 BLSTBO,,12/18/2019
1A400021266EDF4000639907,354,Grams,DRYING ROOM #9,12/18/2019 020 BLSTBO,,12/18/2019
1A400021266EDF4000639909,290,Grams,DRYING ROOM #9,12/18/2019 020 BLSTBO,,12/18/2019
1A400021266EDF4000639913,276,Grams,DRYING ROOM #9,12/18/2019 020 BLSTBO,,12/18/2019
1A400021266EDF4000639919,186,Grams,DRYING ROOM #9,12/18/2019 020 BLSTBO,,12/18/2019
1A400021266EDF4000639927,244,Grams,DRYING ROOM #9,12/18/2019 020 BLSTBO,,12/18/2019
1A400021266EDF4000639944,246,Grams,DRYING ROOM #9,12/18/2019 020 BLSTBO,,12/18/2019
1A400021266EDF4000639947,96,Grams,DRYING ROOM #9,12/18/2019 020 BLSTBO,,12/18/2019
1A400021266EDF4000639950,282,Grams,DRYING ROOM #9,12/18/2019 020 BLSTBO,,12/18/2019
1A400021266EDF4000639966,212,Grams,DRYING ROOM #9,12/18/2019 020 BLSTBO,,12/18/2019
1A400021266EDF4000639971,356,Grams,DRYING ROOM #9,12/18/2019 020 BLSTBO,,12/18/2019
1A400021266EDF4000639972,374,Grams,DRYING ROOM #9,12/18/2019 020 BLSTBO,,12/18/2019
1A400021266EDF4000639973,174,Grams,DRYING ROOM #9,12/18/2019 020 BLSTBO,,12/18/2019
1A400021266EDF4000639984,340,Grams,DRYING ROOM #9,12/18/2019 020 BLSTBO,,12/18/2019
1A400021266EDF4000639985,252,Grams,DRYING ROOM #9,12/18/2019 020 BLSTBO,,12/18/2019
1A400021266EDF4000639988,208,Grams,DRYING ROOM #9,12/18/2019 020 BLSTBO,,12/18/2019
1A400021266EDF4000639994,228,Grams,DRYING ROOM #9,12/18/2019 020 BLSTBO,,12/18/2019
1A400021266EDF4000639996,386,Grams,DRYING ROOM #9,12/18/2019 020 BLSTBO,,12/18/2019
1A400021266EDF4000639999,284,Grams,DRYING ROOM #9,12/18/2019 020 BLSTBO,,12/18/2019
1A400021266EDF4000640010,390,Grams,DRYING ROOM #9,12/18/2019 020 BLSTBO,,12/18/2019
1A400021266EDF4000640026,400,Grams,DRYING ROOM #9,12/18/2019 020 BLSTBO,,12/18/2019
1A400021266EDF4000640029,260,Grams,DRYING ROOM #9,12/18/2019 020 BLSTBO,,12/18/2019
1A400021266EDF4000640030,224,Grams,DRYING ROOM #9,12/18/2019 020 BLSTBO,,12/18/2019
1A400021266EDF4000640160,110,Grams,DRYING ROOM #9,12/18/2019 020 CRSOCO,,12/18/2019
1A400021266EDF4000640167,242,Grams,DRYING ROOM #9,12/18/2019 020 CRSOCO,,12/18/2019
1A400021266EDF4000640169,330,Grams,DRYING ROOM #9,12/18/2019 020 CRSOCO,,12/18/2019
1A400021266EDF4000640174,72,Grams,DRYING ROOM #9,12/18/2019 020 CRSOCO,,12/18/2019
1A400021266EDF4000640176,312,Grams,DRYING ROOM #9,12/18/2019 020 CRSOCO,,12/18/2019
1A400021266EDF4000640177,430,Grams,DRYING ROOM #9,12/18/2019 020 CRSOCO,,12/18/2019
1A400021266EDF4000640179,176,Grams,DRYING ROOM #9,12/18/2019 020 CRSOCO,,12/18/2019
1A400021266EDF4000640180,394,Grams,DRYING ROOM #9,12/18/2019 020 CRSOCO,,12/18/2019
1A400021266EDF4000640185,344,Grams,DRYING ROOM #9,12/18/2019 020 CRSOCO,,12/18/2019
1A400021266EDF4000640193,208,Grams,DRYING ROOM #9,12/18/2019 020 CRSOCO,,12/18/2019
1A400021266EDF4000640198,292,Grams,DRYING ROOM #9,12/18/2019 020 CRSOCO,,12/18/2019
1A400021266EDF4000640201,132,Grams,DRYING ROOM #9,12/18/2019 020 CRSOCO,,12/18/2019
1A400021266EDF4000640204,346,Grams,DRYING ROOM #9,12/18/2019 020 CRSOCO,,12/18/2019
1A400021266EDF4000640206,316,Grams,DRYING ROOM #9,12/18/2019 020 CRSOCO,,12/18/2019
1A400021266EDF4000640220,232,Grams,DRYING ROOM #9,12/18/2019 020 CRSOCO,,12/18/2019
1A400021266EDF4000640225,106,Grams,DRYING ROOM #9,12/18/2019 020 CRSOCO,,12/18/2019
1A400021266EDF4000640233,194,Grams,DRYING ROOM #9,12/18/2019 020 CRSOCO,,12/18/2019
1A400021266EDF4000640251,268,Grams,DRYING ROOM #9,12/18/2019 020 CRSOCO,,12/18/2019
1A400021266EDF4000640260,354,Grams,DRYING ROOM #9,12/18/2019 020 CRSOCO,,12/18/2019
1A400021266EDF4000640266,264,Grams,DRYING ROOM #9,12/18/2019 020 CRSOCO,,12/18/2019
1A400021266EDF4000640297,204,Grams,DRYING ROOM #9,12/18/2019 020 CRSOCO,,12/18/2019
1A400021266EDF4000640323,126,Grams,DRYING ROOM #9,12/18/2019 020 CRSOCO,,12/18/2019
1A400021266EDF4000645878,266,Grams,DRYING ROOM #9,12/18/2019 020 CRSOCO,,12/18/2019
1A400021266EDF4000645914,248,Grams,DRYING ROOM #9,12/18/2019 020 CRSOCO,,12/18/2019
1A400021266EDF4000646901,212,Grams,DRYING ROOM #9,12/18/2019 020 BLSTBO,,12/18/2019
1A400021266EDF4000646910,10,Grams,DRYING ROOM #9,12/18/2019 020 BLSTBO,,12/18/2019
1A400021266EDF4000646913,180,Grams,DRYING ROOM #9,12/18/2019 020 BLSTBO,,12/18/2019
1A400021266EDF4000630257,248,Grams,DRYING ROOM #9,12/18/2019 020 CR,,12/18/2019
1A400021266EDF4000630261,252,Grams,DRYING ROOM #9,12/18/2019 020 CR,,12/18/2019
1A400021266EDF4000632032,244,Grams,DRYING ROOM #9,12/18/2019 020 CR,,12/18/2019
1A400021266EDF4000632033,252,Grams,DRYING ROOM #9,12/18/2019 020 CR,,12/18/2019
1A400021266EDF4000632036,124,Grams,DRYING ROOM #9,12/18/2019 020 CR,,12/18/2019
1A400021266EDF4000632037,238,Grams,DRYING ROOM #9,12/18/2019 020 CR,,12/18/2019
1A400021266EDF4000632039,230,Grams,DRYING ROOM #9,12/18/2019 020 CR,,12/18/2019
1A400021266EDF4000632040,80,Grams,DRYING ROOM #9,12/18/2019 020 CR,,12/18/2019
1A400021266EDF4000632044,154,Grams,DRYING ROOM #9,12/18/2019 020 CR,,12/18/2019
1A400021266EDF4000632049,164,Grams,DRYING ROOM #9,12/18/2019 020 CR,,12/18/2019
1A400021266EDF4000632050,212,Grams,DRYING ROOM #9,12/18/2019 020 CR,,12/18/2019
1A400021266EDF4000632052,196,Grams,DRYING ROOM #9,12/18/2019 020 CR,,12/18/2019
1A400021266EDF4000632054,134,Grams,DRYING ROOM #9,12/18/2019 020 CR,,12/18/2019
1A400021266EDF4000632057,48,Grams,DRYING ROOM #9,12/18/2019 020 CR,,12/18/2019
1A400021266EDF4000632060,150,Grams,DRYING ROOM #9,12/18/2019 020 CR,,12/18/2019
1A400021266EDF4000632062,152,Grams,DRYING ROOM #9,12/18/2019 020 CR,,12/18/2019
1A400021266EDF4000632063,88,Grams,DRYING ROOM #9,12/18/2019 020 CR,,12/18/2019
1A400021266EDF4000632064,278,Grams,DRYING ROOM #9,12/18/2019 020 CR,,12/18/2019
1A400021266EDF4000632066,222,Grams,DRYING ROOM #9,12/18/2019 020 CR,,12/18/2019
1A400021266EDF4000632069,244,Grams,DRYING ROOM #9,12/18/2019 020 CR,,12/18/2019
1A400021266EDF4000632073,192,Grams,DRYING ROOM #9,12/18/2019 020 CR,,12/18/2019
1A400021266EDF4000632074,310,Grams,DRYING ROOM #9,12/18/2019 020 CR,,12/18/2019
1A400021266EDF4000632078,112,Grams,DRYING ROOM #9,12/18/2019 020 CR,,12/18/2019
1A400021266EDF4000632079,156,Grams,DRYING ROOM #9,12/18/2019 020 CR,,12/18/2019
1A400021266EDF4000632080,62,Grams,DRYING ROOM #9,12/18/2019 020 CR,,12/18/2019
1A400021266EDF4000638435,254,Grams,DRYING ROOM #9,12/18/2019 020 ROSE,,12/18/2019
1A400021266EDF4000638444,272,Grams,DRYING ROOM #9,12/18/2019 020 ROSE,,12/18/2019
1A400021266EDF4000638494,294,Grams,DRYING ROOM #9,12/18/2019 020 ROSE,,12/18/2019
1A400021266EDF4000638545,240,Grams,DRYING ROOM #9,12/18/2019 020 ROSE,,12/18/2019
1A400021266EDF4000638607,282,Grams,DRYING ROOM #9,12/18/2019 020 ROSE,,12/18/2019
1A400021266EDF4000638613,214,Grams,DRYING ROOM #9,12/18/2019 020 ROSE,,12/18/2019
1A400021266EDF4000638620,274,Grams,DRYING ROOM #9,12/18/2019 020 ROSE,,12/18/2019
1A400021266EDF4000638622,314,Grams,DRYING ROOM #9,12/18/2019 020 ROSE,,12/18/2019
1A400021266EDF4000638626,264,Grams,DRYING ROOM #9,12/18/2019 020 ROSE,,12/18/2019
1A400021266EDF4000638657,252,Grams,DRYING ROOM #9,12/18/2019 020 ROSE,,12/18/2019
1A400021266EDF4000638658,262,Grams,DRYING ROOM #9,12/18/2019 020 ROSE,,12/18/2019
1A400021266EDF4000639321,196,Grams,DRYING ROOM #9,12/18/2019 020 ROSE,,12/18/2019
1A400021266EDF4000639322,256,Grams,DRYING ROOM #9,12/18/2019 020 ROSE,,12/18/2019
1A400021266EDF4000639324,276,Grams,DRYING ROOM #9,12/18/2019 020 ROSE,,12/18/2019
1A400021266EDF4000639325,266,Grams,DRYING ROOM #9,12/18/2019 020 ROSE,,12/18/2019
1A400021266EDF4000639359,266,Grams,DRYING ROOM #9,12/18/2019 020 ROSE,,12/18/2019
1A400021266EDF4000639370,306,Grams,DRYING ROOM #9,12/18/2019 020 ROSE,,12/18/2019
1A400021266EDF4000639408,336,Grams,DRYING ROOM #9,12/18/2019 020 ROSE,,12/18/2019
1A400021266EDF4000639433,202,Grams,DRYING ROOM #9,12/18/2019 020 ROSE,,12/18/2019
1A400021266EDF4000639436,240,Grams,DRYING ROOM #9,12/18/2019 020 ROSE,,12/18/2019
1A400021266EDF4000639437,228,Grams,DRYING ROOM #9,12/18/2019 020 ROSE,,12/18/2019
1A400021266EDF4000639440,322,Grams,DRYING ROOM #9,12/18/2019 020 ROSE,,12/18/2019
1A400021266EDF4000639441,268,Grams,DRYING ROOM #9,12/18/2019 020 ROSE,,12/18/2019
1A400021266EDF4000639444,262,Grams,DRYING ROOM #9,12/18/2019 020 ROSE,,12/18/2019
1A400021266EDF4000639446,238,Grams,DRYING ROOM #9,12/18/2019 020 ROSE,,12/18/2019
1A400021266EDF4000639448,188,Grams,DRYING ROOM #9,12/18/2019 020 ROSE,,12/18/2019
1A400021266EDF4000639454,244,Grams,DRYING ROOM #9,12/18/2019 020 ROSE,,12/18/2019
1A400021266EDF4000639455,266,Grams,DRYING ROOM #9,12/18/2019 020 ROSE,,12/18/2019
1A400021266EDF4000639458,366,Grams,DRYING ROOM #9,12/18/2019 020 ROSE,,12/18/2019
1A400021266EDF4000639462,252,Grams,DRYING ROOM #9,12/18/2019 020 ROSE,,12/18/2019
1A400021266EDF4000639464,236,Grams,DRYING ROOM #9,12/18/2019 020 ROSE,,12/18/2019
1A400021266EDF4000639467,288,Grams,DRYING ROOM #9,12/18/2019 020 ROSE,,12/18/2019
1A400021266EDF4000639470,252,Grams,DRYING ROOM #9,12/18/2019 020 ROSE,,12/18/2019
1A400021266EDF4000639472,252,Grams,DRYING ROOM #9,12/18/2019 020 ROSE,,12/18/2019
1A400021266EDF4000639474,252,Grams,DRYING ROOM #9,12/18/2019 020 ROSE,,12/18/2019
1A400021266EDF4000639477,262,Grams,DRYING ROOM #9,12/18/2019 020 ROSE,,12/18/2019
1A400021266EDF4000639482,296,Grams,DRYING ROOM #9,12/18/2019 020 ROSE,,12/18/2019
1A400021266EDF4000639486,296,Grams,DRYING ROOM #9,12/18/2019 020 ROSE,,12/18/2019
1A400021266EDF4000639488,270,Grams,DRYING ROOM #9,12/18/2019 020 ROSE,,12/18/2019
1A400021266EDF4000639490,270,Grams,DRYING ROOM #9,12/18/2019 020 ROSE,,12/18/2019
1A400021266EDF4000639494,292,Grams,DRYING ROOM #9,12/18/2019 020 ROSE,,12/18/2019
1A400021266EDF4000639498,270,Grams,DRYING ROOM #9,12/18/2019 020 ROSE,,12/18/2019
1A400021266EDF4000639507,284,Grams,DRYING ROOM #9,12/18/2019 020 ROSE,,12/18/2019
1A400021266EDF4000639509,234,Grams,DRYING ROOM #9,12/18/2019 020 ROSE,,12/18/2019
1A400021266EDF4000639511,268,Grams,DRYING ROOM #9,12/18/2019 020 ROSE,,12/18/2019
1A400021266EDF4000639774,162,Grams,DRYING ROOM #9,12/18/2019 020 CRSOCO,,12/18/2019
1A400021266EDF4000639776,82,Grams,DRYING ROOM #9,12/18/2019 020 CRSOCO,,12/18/2019
1A400021266EDF4000639778,128,Grams,DRYING ROOM #9,12/18/2019 020 CRSOCO,,12/18/2019
1A400021266EDF4000639780,52,Grams,DRYING ROOM #9,12/18/2019 020 CRSOCO,,12/18/2019
1A400021266EDF4000639781,10,Grams,DRYING ROOM #9,12/18/2019 020 CRSOCO,,12/18/2019
1A400021266EDF4000639782,30,Grams,DRYING ROOM #9,12/18/2019 020 CRSOCO,,12/18/2019
1A400021266EDF4000639783,58,Grams,DRYING ROOM #9,12/18/2019 020 CRSOCO,,12/18/2019
1A400021266EDF4000639785,48,Grams,DRYING ROOM #9,12/18/2019 020 CRSOCO,,12/18/2019
1A400021266EDF4000639788,34,Grams,DRYING ROOM #9,12/18/2019 020 CRSOCO,,12/18/2019
1A400021266EDF4000639789,130,Grams,DRYING ROOM #9,12/18/2019 020 CRSOCO,,12/18/2019
1A400021266EDF4000639790,100,Grams,DRYING ROOM #9,12/18/2019 020 CRSOCO,,12/18/2019
1A400021266EDF4000639797,136,Grams,DRYING ROOM #9,12/18/2019 020 CRSOCO,,12/18/2019
1A400021266EDF4000639798,114,Grams,DRYING ROOM #9,12/18/2019 020 CRSOCO,,12/18/2019
1A400021266EDF4000639802,180,Grams,DRYING ROOM #9,12/18/2019 020 CRSOCO,,12/18/2019
1A400021266EDF4000639803,134,Grams,DRYING ROOM #9,12/18/2019 020 CRSOCO,,12/18/2019
1A400021266EDF4000639804,166,Grams,DRYING ROOM #9,12/18/2019 020 CRSOCO,,12/18/2019
1A400021266EDF4000639810,274,Grams,DRYING ROOM #9,12/18/2019 020 CRSOCO,,12/18/2019
