1A400021266EDF4000629212,192,Grams,DRYING ROOM #7,12/04/2019 020 BLSTBO,,12/04/2019
1A400021266EDF4000629213,284,Grams,DRYING ROOM #7,12/04/2019 020 BLSTBO,,12/04/2019
1A400021266EDF4000629215,396,Grams,DRYING ROOM #7,12/04/2019 020 BLSTBO,,12/04/2019
1A400021266EDF4000629217,360,Grams,DRYING ROOM #7,12/04/2019 020 BLSTBO,,12/04/2019
1A400021266EDF4000629219,134,Grams,DRYING ROOM #7,12/04/2019 020 BLSTBO,,12/04/2019
1A400021266EDF4000629220,372,Grams,DRYING ROOM #7,12/04/2019 020 BLSTBO,,12/04/2019
1A400021266EDF4000629221,314,Grams,DRYING ROOM #7,12/04/2019 020 BLSTBO,,12/04/2019
1A400021266EDF4000629223,364,Grams,DRYING ROOM #7,12/04/2019 020 BLSTBO,,12/04/2019
1A400021266EDF4000629227,416,Grams,DRYING ROOM #7,12/04/2019 020 BLSTBO,,12/04/2019
1A400021266EDF4000629228,158,Grams,DRYING ROOM #7,12/04/2019 020 BLSTBO,,12/04/2019
1A400021266EDF4000629229,318,Grams,DRYING ROOM #7,12/04/2019 020 BLSTBO,,12/04/2019
1A400021266EDF4000629231,470,Grams,DRYING ROOM #7,12/04/2019 020 BLBU,,12/04/2019
1A400021266EDF4000629232,426,Grams,DRYING ROOM #7,12/04/2019 020 BLBU,,12/04/2019
1A400021266EDF4000629233,422,Grams,DRYING ROOM #7,12/04/2019 020 BLBU,,12/04/2019
1A400021266EDF4000629234,478,Grams,DRYING ROOM #7,12/04/2019 020 BLBU,,12/04/2019
1A400021266EDF4000629235,412,Grams,DRYING ROOM #7,12/04/2019 020 BLBU,,12/04/2019
1A400021266EDF4000629236,432,Grams,DRYING ROOM #7,12/04/2019 020 BLBU,,12/04/2019
1A400021266EDF4000629237,484,Grams,DRYING ROOM #7,12/04/2019 020 BLBU,,12/04/2019
1A400021266EDF4000629238,524,Grams,DRYING ROOM #7,12/04/2019 020 BLBU,,12/04/2019
1A400021266EDF4000629239,400,Grams,DRYING ROOM #7,12/04/2019 020 BLBU,,12/04/2019
1A400021266EDF4000629240,410,Grams,DRYING ROOM #7,12/04/2019 020 BLBU,,12/04/2019
1A400021266EDF4000629241,184,Grams,DRYING ROOM #7,12/04/2019 020 BLBU,,12/04/2019
1A400021266EDF4000629242,456,Grams,DRYING ROOM #7,12/04/2019 020 BLBU,,12/04/2019
1A400021266EDF4000629244,596,Grams,DRYING ROOM #7,12/04/2019 020 BLBU,,12/04/2019
1A400021266EDF4000629245,374,Grams,DRYING ROOM #7,12/04/2019 020 BLBU,,12/04/2019
1A400021266EDF4000629246,500,Grams,DRYING ROOM #7,12/04/2019 020 BLBU,,12/04/2019
1A400021266EDF4000629248,560,Grams,DRYING ROOM #7,12/04/2019 020 BLBU,,12/04/2019
1A400021266EDF4000629249,322,Grams,DRYING ROOM #7,12/04/2019 020 BLBU,,12/04/2019
1A400021266EDF4000629250,442,Grams,DRYING ROOM #7,12/04/2019 020 BLBU,,12/04/2019
1A400021266EDF4000629251,436,Grams,DRYING ROOM #7,12/04/2019 020 BLBU,,12/04/2019
1A400021266EDF4000629253,66,Grams,DRYING ROOM #7,12/04/2019 020 BLBU,,12/04/2019
1A400021266EDF4000629254,528,Grams,DRYING ROOM #7,12/04/2019 020 BLBU,,12/04/2019
1A400021266EDF4000629255,410,Grams,DRYING ROOM #7,12/04/2019 020 BLBU,,12/04/2019
1A400021266EDF4000629256,484,Grams,DRYING ROOM #7,12/04/2019 020 BLBU,,12/04/2019
1A400021266EDF4000629257,442,Grams,DRYING ROOM #7,12/04/2019 020 BLBU,,12/04/2019
1A400021266EDF4000629258,498,Grams,DRYING ROOM #7,12/04/2019 020 BLBU,,12/04/2019
1A400021266EDF4000629259,554,Grams,DRYING ROOM #7,12/04/2019 020 BLBU,,12/04/2019
1A400021266EDF4000629261,446,Grams,DRYING ROOM #7,12/04/2019 020 BLBU,,12/04/2019
1A400021266EDF4000629262,448,Grams,DRYING ROOM #7,12/04/2019 020 BLBU,,12/04/2019
1A400021266EDF4000629263,558,Grams,DRYING ROOM #7,12/04/2019 020 BLBU,,12/04/2019
1A400021266EDF4000629264,506,Grams,DRYING ROOM #7,12/04/2019 020 BLBU,,12/04/2019
1A400021266EDF4000629265,494,Grams,DRYING ROOM #7,12/04/2019 020 BLBU,,12/04/2019
1A400021266EDF4000629266,478,Grams,DRYING ROOM #7,12/04/2019 020 BLBU,,12/04/2019
1A400021266EDF4000629267,444,Grams,DRYING ROOM #7,12/04/2019 020 BLBU,,12/04/2019
1A400021266EDF4000629270,276,Grams,DRYING ROOM #7,12/04/2019 020 BLBU,,12/04/2019
1A400021266EDF4000629271,314,Grams,DRYING ROOM #7,12/04/2019 020 BLBU,,12/04/2019
1A400021266EDF4000629272,380,Grams,DRYING ROOM #7,12/04/2019 020 BLBU,,12/04/2019
1A400021266EDF4000629273,414,Grams,DRYING ROOM #7,12/04/2019 020 BLBU,,12/04/2019
1A400021266EDF4000629274,480,Grams,DRYING ROOM #7,12/04/2019 020 BLBU,,12/04/2019
1A400021266EDF4000629275,590,Grams,DRYING ROOM #7,12/04/2019 020 BLBU,,12/04/2019
1A400021266EDF4000629277,394,Grams,DRYING ROOM #7,12/04/2019 020 BLBU,,12/04/2019
1A400021266EDF4000629278,370,Grams,DRYING ROOM #7,12/04/2019 020 BLBU,,12/04/2019
1A400021266EDF4000629279,440,Grams,DRYING ROOM #7,12/04/2019 020 BLBU,,12/04/2019
1A400021266EDF4000629281,448,Grams,DRYING ROOM #7,12/04/2019 020 BLBU,,12/04/2019
1A400021266EDF4000629282,508,Grams,DRYING ROOM #7,12/04/2019 020 BLBU,,12/04/2019
1A400021266EDF4000629283,322,Grams,DRYING ROOM #7,12/04/2019 020 BLBU,,12/04/2019
1A400021266EDF4000629284,84,Grams,DRYING ROOM #7,12/04/2019 020 BLBU,,12/04/2019
1A400021266EDF4000629285,512,Grams,DRYING ROOM #7,12/04/2019 020 BLBU,,12/04/2019
1A400021266EDF4000629286,314,Grams,DRYING ROOM #7,12/04/2019 020 BLBU,,12/04/2019
1A400021266EDF4000629287,332,Grams,DRYING ROOM #7,12/04/2019 020 BLBU,,12/04/2019
1A400021266EDF4000629288,442,Grams,DRYING ROOM #7,12/04/2019 020 BLBU,,12/04/2019
1A400021266EDF4000629289,318,Grams,DRYING ROOM #7,12/04/2019 020 BLBU,,12/04/2019
1A400021266EDF4000629290,438,Grams,DRYING ROOM #7,12/04/2019 020 BLBU,,12/04/2019
1A400021266EDF4000629291,444,Grams,DRYING ROOM #7,12/04/2019 020 BLBU,,12/04/2019
1A400021266EDF4000629292,378,Grams,DRYING ROOM #7,12/04/2019 020 BLBU,,12/04/2019
1A400021266EDF4000629293,332,Grams,DRYING ROOM #7,12/04/2019 020 BLBU,,12/04/2019
1A400021266EDF4000629294,466,Grams,DRYING ROOM #7,12/04/2019 020 BLBU,,12/04/2019
1A400021266EDF4000629295,436,Grams,DRYING ROOM #7,12/04/2019 020 BLBU,,12/04/2019
1A400021266EDF4000629297,248,Grams,DRYING ROOM #7,12/04/2019 020 BLBU,,12/04/2019
1A400021266EDF4000629298,276,Grams,DRYING ROOM #7,12/04/2019 020 BLBU,,12/04/2019
1A400021266EDF4000629299,392,Grams,DRYING ROOM #7,12/04/2019 020 BLBU,,12/04/2019
1A400021266EDF4000629300,256,Grams,DRYING ROOM #7,12/04/2019 020 BLBU,,12/04/2019
1A400021266EDF4000629301,66,Grams,DRYING ROOM #7,12/04/2019 020 BLBU,,12/04/2019
1A400021266EDF4000629302,492,Grams,DRYING ROOM #7,12/04/2019 020 BLBU,,12/04/2019
1A400021266EDF4000629303,442,Grams,DRYING ROOM #7,12/04/2019 020 BLBU,,12/04/2019
1A400021266EDF4000629304,442,Grams,DRYING ROOM #7,12/04/2019 020 BLBU,,12/04/2019
1A400021266EDF4000629305,416,Grams,DRYING ROOM #7,12/04/2019 020 BLBU,,12/04/2019
1A400021266EDF4000629306,302,Grams,DRYING ROOM #7,12/04/2019 020 BLBU,,12/04/2019
1A400021266EDF4000629307,398,Grams,DRYING ROOM #7,12/04/2019 020 BLBU,,12/04/2019
1A400021266EDF4000629308,514,Grams,DRYING ROOM #7,12/04/2019 020 BLBU,,12/04/2019
1A400021266EDF4000629309,88,Grams,DRYING ROOM #7,12/04/2019 020 BLBU,,12/04/2019
1A400021266EDF4000629310,568,Grams,DRYING ROOM #7,12/04/2019 020 BLBU,,12/04/2019
1A400021266EDF4000629311,384,Grams,DRYING ROOM #7,12/04/2019 020 BLBU,,12/04/2019
1A400021266EDF4000629312,486,Grams,DRYING ROOM #7,12/04/2019 020 BLBU,,12/04/2019
1A400021266EDF4000629313,358,Grams,DRYING ROOM #7,12/04/2019 020 BLBU,,12/04/2019
1A400021266EDF4000629314,416,Grams,DRYING ROOM #7,12/04/2019 020 BLBU,,12/04/2019
1A400021266EDF4000629315,434,Grams,DRYING ROOM #7,12/04/2019 020 BLBU,,12/04/2019
1A400021266EDF4000629316,474,Grams,DRYING ROOM #7,12/04/2019 020 BLBU,,12/04/2019
1A400021266EDF4000629317,368,Grams,DRYING ROOM #7,12/04/2019 020 BLBU,,12/04/2019
1A400021266EDF4000629318,554,Grams,DRYING ROOM #7,12/04/2019 020 BLBU,,12/04/2019
1A400021266EDF4000629319,446,Grams,DRYING ROOM #7,12/04/2019 020 BLBU,,12/04/2019
1A400021266EDF4000629320,526,Grams,DRYING ROOM #7,12/04/2019 020 BLBU,,12/04/2019
1A400021266EDF4000629321,458,Grams,DRYING ROOM #7,12/04/2019 020 BLBU,,12/04/2019
1A400021266EDF4000629322,386,Grams,DRYING ROOM #7,12/04/2019 020 BLBU,,12/04/2019
1A400021266EDF4000629323,440,Grams,DRYING ROOM #7,12/04/2019 020 BLBU,,12/04/2019
1A400021266EDF4000629324,420,Grams,DRYING ROOM #7,12/04/2019 020 BLBU,,12/04/2019
1A400021266EDF4000629325,372,Grams,DRYING ROOM #7,12/04/2019 020 BLBU,,12/04/2019
1A400021266EDF4000629326,236,Grams,DRYING ROOM #7,12/04/2019 020 BLBU,,12/04/2019
1A400021266EDF4000629327,284,Grams,DRYING ROOM #7,12/04/2019 020 BLBU,,12/04/2019
1A400021266EDF4000629328,430,Grams,DRYING ROOM #7,12/04/2019 020 BLBU,,12/04/2019
1A400021266EDF4000629329,544,Grams,DRYING ROOM #7,12/04/2019 020 BLBU,,12/04/2019
1A400021266EDF4000629330,452,Grams,DRYING ROOM #7,12/04/2019 020 BLBU,,12/04/2019
1A400021266EDF4000629331,140,Grams,DRYING ROOM #7,12/04/2019 020 BLBU,,12/04/2019
1A400021266EDF4000629332,462,Grams,DRYING ROOM #7,12/04/2019 020 BLBU,,12/04/2019
1A400021266EDF4000629333,500,Grams,DRYING ROOM #7,12/04/2019 020 BLBU,,12/04/2019
1A400021266EDF4000629334,418,Grams,DRYING ROOM #7,12/04/2019 020 BLBU,,12/04/2019
1A400021266EDF4000629335,494,Grams,DRYING ROOM #7,12/04/2019 020 BLBU,,12/04/2019
1A400021266EDF4000629336,356,Grams,DRYING ROOM #7,12/04/2019 020 BLBU,,12/04/2019
1A400021266EDF4000629337,62,Grams,DRYING ROOM #7,12/04/2019 020 BLBU,,12/04/2019
1A400021266EDF4000629338,504,Grams,DRYING ROOM #7,12/04/2019 020 BLBU,,12/04/2019
1A400021266EDF4000629339,482,Grams,DRYING ROOM #7,12/04/2019 020 BLBU,,12/04/2019
1A400021266EDF4000629340,456,Grams,DRYING ROOM #7,12/04/2019 020 BLBU,,12/04/2019
1A400021266EDF4000629341,356,Grams,DRYING ROOM #7,12/04/2019 020 BLBU,,12/04/2019
1A400021266EDF4000629342,522,Grams,DRYING ROOM #7,12/04/2019 020 BLBU,,12/04/2019
1A400021266EDF4000629343,456,Grams,DRYING ROOM #7,12/04/2019 020 BLBU,,12/04/2019
1A400021266EDF4000629344,298,Grams,DRYING ROOM #7,12/04/2019 020 BLBU,,12/04/2019
1A400021266EDF4000629345,450,Grams,DRYING ROOM #7,12/04/2019 020 BLBU,,12/04/2019
1A400021266EDF4000629346,464,Grams,DRYING ROOM #7,12/04/2019 020 BLBU,,12/04/2019
1A400021266EDF4000629347,500,Grams,DRYING ROOM #7,12/04/2019 020 BLBU,,12/04/2019
1A400021266EDF4000629348,444,Grams,DRYING ROOM #7,12/04/2019 020 BLBU,,12/04/2019
1A400021266EDF4000629350,406,Grams,DRYING ROOM #7,12/04/2019 020 BLBU,,12/04/2019
1A400021266EDF4000629351,252,Grams,DRYING ROOM #7,12/04/2019 020 BLBU,,12/04/2019
1A400021266EDF4000629352,344,Grams,DRYING ROOM #7,12/04/2019 020 BLBU,,12/04/2019
1A400021266EDF4000629353,378,Grams,DRYING ROOM #7,12/04/2019 020 BLBU,,12/04/2019
1A400021266EDF4000629354,464,Grams,DRYING ROOM #7,12/04/2019 020 BLBU,,12/04/2019
1A400021266EDF4000629355,338,Grams,DRYING ROOM #7,12/04/2019 020 BLBU,,12/04/2019
1A400021266EDF4000629356,326,Grams,DRYING ROOM #7,12/04/2019 020 BLBU,,12/04/2019
1A400021266EDF4000629357,422,Grams,DRYING ROOM #7,12/04/2019 020 BLBU,,12/04/2019
1A400021266EDF4000629358,416,Grams,DRYING ROOM #7,12/04/2019 020 BLBU,,12/04/2019
1A400021266EDF4000629359,406,Grams,DRYING ROOM #7,12/04/2019 020 BLBU,,12/04/2019
1A400021266EDF4000629360,436,Grams,DRYING ROOM #7,12/04/2019 020 BLBU,,12/04/2019
1A400021266EDF4000629361,472,Grams,DRYING ROOM #7,12/04/2019 020 BLBU,,12/04/2019
1A400021266EDF4000629362,350,Grams,DRYING ROOM #7,12/04/2019 020 BLBU,,12/04/2019
1A400021266EDF4000629364,464,Grams,DRYING ROOM #7,12/04/2019 020 BLBU,,12/04/2019
1A400021266EDF4000629366,494,Grams,DRYING ROOM #7,12/04/2019 020 BLBU,,12/04/2019
1A400021266EDF4000629367,188,Grams,DRYING ROOM #7,12/04/2019 020 BLBU,,12/04/2019
1A400021266EDF4000629368,612,Grams,DRYING ROOM #7,12/04/2019 020 BLBU,,12/04/2019
1A400021266EDF4000629369,474,Grams,DRYING ROOM #7,12/04/2019 020 BLBU,,12/04/2019
1A400021266EDF4000629370,492,Grams,DRYING ROOM #7,12/04/2019 020 BLBU,,12/04/2019
1A400021266EDF4000629371,468,Grams,DRYING ROOM #7,12/04/2019 020 BLBU,,12/04/2019
1A400021266EDF4000629372,328,Grams,DRYING ROOM #7,12/04/2019 020 BLBU,,12/04/2019
1A400021266EDF4000629373,358,Grams,DRYING ROOM #7,12/04/2019 020 BLBU,,12/04/2019
1A400021266EDF4000629374,308,Grams,DRYING ROOM #7,12/04/2019 020 BLBU,,12/04/2019
1A400021266EDF4000629375,562,Grams,DRYING ROOM #7,12/04/2019 020 BLBU,,12/04/2019
1A400021266EDF4000629376,404,Grams,DRYING ROOM #7,12/04/2019 020 BLBU,,12/04/2019
1A400021266EDF4000629377,432,Grams,DRYING ROOM #7,12/04/2019 020 BLBU,,12/04/2019
1A400021266EDF4000629378,176,Grams,DRYING ROOM #7,12/04/2019 020 BLBU,,12/04/2019
1A400021266EDF4000629380,280,Grams,DRYING ROOM #7,12/04/2019 020 BLBU,,12/04/2019
1A400021266EDF4000629381,438,Grams,DRYING ROOM #7,12/04/2019 020 BLBU,,12/04/2019
1A400021266EDF4000629383,188,Grams,DRYING ROOM #7,12/04/2019 020 BLBU,,12/04/2019
1A400021266EDF4000629388,264,Grams,DRYING ROOM #7,12/04/2019 020 BLBU,,12/04/2019
1A400021266EDF4000629389,420,Grams,DRYING ROOM #7,12/04/2019 020 BLBU,,12/04/2019
1A400021266EDF4000629390,426,Grams,DRYING ROOM #7,12/04/2019 020 BLBU,,12/04/2019
1A400021266EDF4000629391,504,Grams,DRYING ROOM #7,12/04/2019 020 BLBU,,12/04/2019
1A400021266EDF4000629392,370,Grams,DRYING ROOM #7,12/04/2019 020 BLBU,,12/04/2019
1A400021266EDF4000629394,506,Grams,DRYING ROOM #7,12/04/2019 020 BLBU,,12/04/2019
1A400021266EDF4000629395,398,Grams,DRYING ROOM #7,12/04/2019 020 BLBU,,12/04/2019
1A400021266EDF4000629396,318,Grams,DRYING ROOM #7,12/04/2019 020 BLBU,,12/04/2019
1A400021266EDF4000629397,364,Grams,DRYING ROOM #7,12/04/2019 020 BLBU,,12/04/2019
1A400021266EDF4000629399,378,Grams,DRYING ROOM #7,12/04/2019 020 BLBU,,12/04/2019
1A400021266EDF4000629400,466,Grams,DRYING ROOM #7,12/04/2019 020 BLBU,,12/04/2019
1A400021266EDF4000629402,522,Grams,DRYING ROOM #7,12/04/2019 020 BLBU,,12/04/2019
1A400021266EDF4000629403,114,Grams,DRYING ROOM #7,12/04/2019 020 BLBU,,12/04/2019
1A400021266EDF4000629405,514,Grams,DRYING ROOM #7,12/04/2019 020 BLBU,,12/04/2019
1A400021266EDF4000629406,394,Grams,DRYING ROOM #7,12/04/2019 020 BLBU,,12/04/2019
1A400021266EDF4000629407,532,Grams,DRYING ROOM #7,12/04/2019 020 BLBU,,12/04/2019
1A400021266EDF4000629408,544,Grams,DRYING ROOM #7,12/04/2019 020 BLBU,,12/04/2019
1A400021266EDF4000629410,432,Grams,DRYING ROOM #7,12/04/2019 020 BLBU,,12/04/2019
1A400021266EDF4000629411,384,Grams,DRYING ROOM #7,12/04/2019 020 BLBU,,12/04/2019
1A400021266EDF4000629412,82,Grams,DRYING ROOM #7,12/04/2019 020 BLBU,,12/04/2019
1A400021266EDF4000629413,126,Grams,DRYING ROOM #7,12/04/2019 020 BLBU,,12/04/2019
1A400021266EDF4000629414,184,Grams,DRYING ROOM #7,12/04/2019 020 BLBU,,12/04/2019
1A400021266EDF4000629415,134,Grams,DRYING ROOM #7,12/04/2019 020 BLBU,,12/04/2019
1A400021266EDF4000629416,164,Grams,DRYING ROOM #7,12/04/2019 020 BLBU,,12/04/2019
1A400021266EDF4000629417,166,Grams,DRYING ROOM #7,12/04/2019 020 BLBU,,12/04/2019
1A400021266EDF4000629418,106,Grams,DRYING ROOM #7,12/04/2019 020 BLBU,,12/04/2019
1A400021266EDF4000629419,566,Grams,DRYING ROOM #7,12/04/2019 020 BLBU,,12/04/2019
1A400021266EDF4000629420,556,Grams,DRYING ROOM #7,12/04/2019 020 BLBU,,12/04/2019
1A400021266EDF4000629421,146,Grams,DRYING ROOM #7,12/04/2019 020 BLBU,,12/04/2019
1A400021266EDF4000629422,238,Grams,DRYING ROOM #7,12/04/2019 020 BLBU,,12/04/2019
1A400021266EDF4000629423,250,Grams,DRYING ROOM #7,12/04/2019 020 BLBU,,12/04/2019
1A400021266EDF4000629424,288,Grams,DRYING ROOM #7,12/04/2019 020 BLBU,,12/04/2019
1A400021266EDF4000629425,294,Grams,DRYING ROOM #7,12/04/2019 020 BLBU,,12/04/2019
1A400021266EDF4000629426,134,Grams,DRYING ROOM #7,12/04/2019 020 BLBU,,12/04/2019
1A400021266EDF4000629427,300,Grams,DRYING ROOM #7,12/04/2019 020 BLBU,,12/04/2019
1A400021266EDF4000629428,152,Grams,DRYING ROOM #7,12/04/2019 020 BLBU,,12/04/2019
1A400021266EDF4000629430,166,Grams,DRYING ROOM #7,12/04/2019 020 BLBU,,12/04/2019
1A400021266EDF4000629433,340,Grams,DRYING ROOM #7,12/04/2019 020 BLBU,,12/04/2019
1A400021266EDF4000629435,136,Grams,DRYING ROOM #7,12/04/2019 020 BLBU,,12/04/2019
1A400021266EDF4000629436,168,Grams,DRYING ROOM #7,12/04/2019 020 BLBU,,12/04/2019
1A400021266EDF4000629438,40,Grams,DRYING ROOM #7,12/04/2019 020 BLBU,,12/04/2019
1A400021266EDF4000629440,344,Grams,DRYING ROOM #7,12/04/2019 020 BLBU,,12/04/2019
1A400021266EDF4000629442,268,Grams,DRYING ROOM #7,12/04/2019 020 BLBU,,12/04/2019
1A400021266EDF4000629443,456,Grams,DRYING ROOM #7,12/04/2019 020 BLBU,,12/04/2019
1A400021266EDF4000629445,110,Grams,DRYING ROOM #7,12/04/2019 020 BLBU,,12/04/2019
1A400021266EDF4000629447,124,Grams,DRYING ROOM #7,12/04/2019 020 BLBU,,12/04/2019
1A400021266EDF4000629448,106,Grams,DRYING ROOM #7,12/04/2019 020 BLBU,,12/04/2019
1A400021266EDF4000629451,426,Grams,DRYING ROOM #7,12/04/2019 020 BLBU,,12/04/2019
1A400021266EDF4000629453,236,Grams,DRYING ROOM #7,12/04/2019 020 BLBU,,12/04/2019
1A400021266EDF4000629463,544,Grams,DRYING ROOM #7,12/04/2019 020 BLBU,,12/04/2019
1A400021266EDF4000629469,474,Grams,DRYING ROOM #7,12/04/2019 020 BLBU,,12/04/2019
1A400021266EDF4000629470,90,Grams,DRYING ROOM #7,12/04/2019 020 BLBU,,12/04/2019
1A400021266EDF4000629471,446,Grams,DRYING ROOM #7,12/04/2019 020 BLBU,,12/04/2019
1A400021266EDF4000629472,310,Grams,DRYING ROOM #7,12/04/2019 020 BLBU,,12/04/2019
1A400021266EDF4000629474,432,Grams,DRYING ROOM #7,12/04/2019 020 BLBU,,12/04/2019
1A400021266EDF4000629475,320,Grams,DRYING ROOM #7,12/04/2019 020 BLBU,,12/04/2019
1A400021266EDF4000629476,398,Grams,DRYING ROOM #7,12/04/2019 020 BLBU,,12/04/2019
1A400021266EDF4000629477,394,Grams,DRYING ROOM #7,12/04/2019 020 BLBU,,12/04/2019
1A400021266EDF4000629479,378,Grams,DRYING ROOM #7,12/04/2019 020 BLBU,,12/04/2019
1A400021266EDF4000629480,430,Grams,DRYING ROOM #7,12/04/2019 020 BLBU,,12/04/2019
1A400021266EDF4000629481,470,Grams,DRYING ROOM #7,12/04/2019 020 BLBU,,12/04/2019
1A400021266EDF4000629482,358,Grams,DRYING ROOM #7,12/04/2019 020 BLBU,,12/04/2019
1A400021266EDF4000629484,210,Grams,DRYING ROOM #7,12/04/2019 020 BLBU,,12/04/2019
1A400021266EDF4000629485,218,Grams,DRYING ROOM #7,12/04/2019 020 BLBU,,12/04/2019
1A400021266EDF4000629487,454,Grams,DRYING ROOM #7,12/04/2019 020 BLBU,,12/04/2019
1A400021266EDF4000629488,336,Grams,DRYING ROOM #7,12/04/2019 020 BLBU,,12/04/2019
1A400021266EDF4000629489,316,Grams,DRYING ROOM #7,12/04/2019 020 BLBU,,12/04/2019
1A400021266EDF4000629490,108,Grams,DRYING ROOM #7,12/04/2019 020 BLBU,,12/04/2019
1A400021266EDF4000629491,446,Grams,DRYING ROOM #7,12/04/2019 020 BLBU,,12/04/2019
1A400021266EDF4000629492,430,Grams,DRYING ROOM #7,12/04/2019 020 BLBU,,12/04/2019
1A400021266EDF4000629493,490,Grams,DRYING ROOM #7,12/04/2019 020 BLBU,,12/04/2019
1A400021266EDF4000629494,234,Grams,DRYING ROOM #7,12/04/2019 020 BLBU,,12/04/2019
1A400021266EDF4000629495,218,Grams,DRYING ROOM #7,12/04/2019 020 BLBU,,12/04/2019
1A400021266EDF4000629496,172,Grams,DRYING ROOM #7,12/04/2019 020 BLBU,,12/04/2019
1A400021266EDF4000629497,456,Grams,DRYING ROOM #7,12/04/2019 020 BLBU,,12/04/2019
1A400021266EDF4000629499,494,Grams,DRYING ROOM #7,12/04/2019 020 BLBU,,12/04/2019
1A400021266EDF4000629500,478,Grams,DRYING ROOM #7,12/04/2019 020 BLBU,,12/04/2019
1A400021266EDF4000629501,484,Grams,DRYING ROOM #7,12/04/2019 020 BLBU,,12/04/2019
1A400021266EDF4000629502,502,Grams,DRYING ROOM #7,12/04/2019 020 BLBU,,12/04/2019
1A400021266EDF4000629503,564,Grams,DRYING ROOM #7,12/04/2019 020 BLBU,,12/04/2019
1A400021266EDF4000629504,468,Grams,DRYING ROOM #7,12/04/2019 020 BLBU,,12/04/2019
1A400021266EDF4000629505,488,Grams,DRYING ROOM #7,12/04/2019 020 BLBU,,12/04/2019
1A400021266EDF4000629506,472,Grams,DRYING ROOM #7,12/04/2019 020 BLBU,,12/04/2019
1A400021266EDF4000629507,464,Grams,DRYING ROOM #7,12/04/2019 020 BLBU,,12/04/2019
1A400021266EDF4000629508,510,Grams,DRYING ROOM #7,12/04/2019 020 BLBU,,12/04/2019
1A400021266EDF4000629509,424,Grams,DRYING ROOM #7,12/04/2019 020 BLBU,,12/04/2019
1A400021266EDF4000629510,316,Grams,DRYING ROOM #7,12/04/2019 020 BLBU,,12/04/2019
1A400021266EDF4000629511,526,Grams,DRYING ROOM #7,12/04/2019 020 BLBU,,12/04/2019
1A400021266EDF4000629512,576,Grams,DRYING ROOM #7,12/04/2019 020 BLBU,,12/04/2019
1A400021266EDF4000629513,528,Grams,DRYING ROOM #7,12/04/2019 020 BLBU,,12/04/2019
1A400021266EDF4000629514,400,Grams,DRYING ROOM #7,12/04/2019 020 BLBU,,12/04/2019
1A400021266EDF4000629515,388,Grams,DRYING ROOM #7,12/04/2019 020 BLBU,,12/04/2019
1A400021266EDF4000629516,502,Grams,DRYING ROOM #7,12/04/2019 020 BLBU,,12/04/2019
1A400021266EDF4000629517,444,Grams,DRYING ROOM #7,12/04/2019 020 BLBU,,12/04/2019
1A400021266EDF4000629519,440,Grams,DRYING ROOM #7,12/04/2019 020 BLBU,,12/04/2019
1A400021266EDF4000629520,614,Grams,DRYING ROOM #7,12/04/2019 020 BLBU,,12/04/2019
1A400021266EDF4000629521,546,Grams,DRYING ROOM #7,12/04/2019 020 BLBU,,12/04/2019
1A400021266EDF4000629522,418,Grams,DRYING ROOM #7,12/04/2019 020 BLBU,,12/04/2019
1A400021266EDF4000629523,446,Grams,DRYING ROOM #7,12/04/2019 020 BLBU,,12/04/2019
1A400021266EDF4000629524,462,Grams,DRYING ROOM #7,12/04/2019 020 BLBU,,12/04/2019
1A400021266EDF4000629526,372,Grams,DRYING ROOM #7,12/04/2019 020 BLBU,,12/04/2019
1A400021266EDF4000629527,460,Grams,DRYING ROOM #7,12/04/2019 020 BLBU,,12/04/2019
1A400021266EDF4000629528,350,Grams,DRYING ROOM #7,12/04/2019 020 BLBU,,12/04/2019
1A400021266EDF4000629529,420,Grams,DRYING ROOM #7,12/04/2019 020 BLBU,,12/04/2019
1A400021266EDF4000629530,118,Grams,DRYING ROOM #7,12/04/2019 020 BLBU,,12/04/2019
1A400021266EDF4000629751,374,Grams,DRYING ROOM #7,12/04/2019 020 LIDI,,12/04/2019
1A400021266EDF4000629752,392,Grams,DRYING ROOM #7,12/04/2019 020 LIDI,,12/04/2019
1A400021266EDF4000629757,342,Grams,DRYING ROOM #7,12/04/2019 020 LIDI,,12/04/2019
1A400021266EDF4000629764,284,Grams,DRYING ROOM #7,12/04/2019 020 LIDI,,12/04/2019
1A400021266EDF4000630151,108,Grams,DRYING ROOM #7,12/04/2019 020 SI,,12/04/2019
1A400021266EDF4000630152,446,Grams,DRYING ROOM #7,12/04/2019 020 SI,,12/04/2019
1A400021266EDF4000630153,336,Grams,DRYING ROOM #7,12/04/2019 020 SI,,12/04/2019
1A400021266EDF4000630154,394,Grams,DRYING ROOM #7,12/04/2019 020 SI,,12/04/2019
1A400021266EDF4000630155,480,Grams,DRYING ROOM #7,12/04/2019 020 SI,,12/04/2019
1A400021266EDF4000630156,462,Grams,DRYING ROOM #7,12/04/2019 020 SI,,12/04/2019
1A400021266EDF4000630157,472,Grams,DRYING ROOM #7,12/04/2019 020 SI,,12/04/2019
1A400021266EDF4000630158,236,Grams,DRYING ROOM #7,12/04/2019 020 SI,,12/04/2019
1A400021266EDF4000630159,468,Grams,DRYING ROOM #7,12/04/2019 020 SI,,12/04/2019
1A400021266EDF4000630160,352,Grams,DRYING ROOM #7,12/04/2019 020 SI,,12/04/2019
1A400021266EDF4000630161,188,Grams,DRYING ROOM #7,12/04/2019 020 SI,,12/04/2019
1A400021266EDF4000630162,414,Grams,DRYING ROOM #7,12/04/2019 020 SI,,12/04/2019
1A400021266EDF4000630163,420,Grams,DRYING ROOM #7,12/04/2019 020 SI,,12/04/2019
1A400021266EDF4000630164,534,Grams,DRYING ROOM #7,12/04/2019 020 SI,,12/04/2019
1A400021266EDF4000630165,454,Grams,DRYING ROOM #7,12/04/2019 020 SI,,12/04/2019
1A400021266EDF4000630166,434,Grams,DRYING ROOM #7,12/04/2019 020 SI,,12/04/2019
1A400021266EDF4000630167,254,Grams,DRYING ROOM #7,12/04/2019 020 SI,,12/04/2019
1A400021266EDF4000630169,140,Grams,DRYING ROOM #7,12/04/2019 020 SI,,12/04/2019
1A400021266EDF4000630170,432,Grams,DRYING ROOM #7,12/04/2019 020 SI,,12/04/2019
1A400021266EDF4000630171,380,Grams,DRYING ROOM #7,12/04/2019 020 SI,,12/04/2019
1A400021266EDF4000630172,508,Grams,DRYING ROOM #7,12/04/2019 020 SI,,12/04/2019
1A400021266EDF4000630173,490,Grams,DRYING ROOM #7,12/04/2019 020 SI,,12/04/2019
1A400021266EDF4000630175,478,Grams,DRYING ROOM #7,12/04/2019 020 SI,,12/04/2019
1A400021266EDF4000630176,386,Grams,DRYING ROOM #7,12/04/2019 020 SI,,12/04/2019
1A400021266EDF4000630177,314,Grams,DRYING ROOM #7,12/04/2019 020 SI,,12/04/2019
1A400021266EDF4000630178,282,Grams,DRYING ROOM #7,12/04/2019 020 SI,,12/04/2019
1A400021266EDF4000630179,224,Grams,DRYING ROOM #7,12/04/2019 020 SI,,12/04/2019
1A400021266EDF4000630181,622,Grams,DRYING ROOM #7,12/04/2019 020 SI,,12/04/2019
1A400021266EDF4000630182,540,Grams,DRYING ROOM #7,12/04/2019 020 SI,,12/04/2019
1A400021266EDF4000630183,516,Grams,DRYING ROOM #7,12/04/2019 020 SI,,12/04/2019
1A400021266EDF4000630184,510,Grams,DRYING ROOM #7,12/04/2019 020 SI,,12/04/2019
1A400021266EDF4000630186,462,Grams,DRYING ROOM #7,12/04/2019 020 SI,,12/04/2019
1A400021266EDF4000630187,562,Grams,DRYING ROOM #7,12/04/2019 020 SI,,12/04/2019
1A400021266EDF4000630188,458,Grams,DRYING ROOM #7,12/04/2019 020 SI,,12/04/2019
1A400021266EDF4000630189,284,Grams,DRYING ROOM #7,12/04/2019 020 SI,,12/04/2019
1A400021266EDF4000630190,476,Grams,DRYING ROOM #7,12/04/2019 020 SI,,12/04/2019
1A400021266EDF4000630191,322,Grams,DRYING ROOM #7,12/04/2019 020 SI,,12/04/2019
1A400021266EDF4000630192,418,Grams,DRYING ROOM #7,12/04/2019 020 SI,,12/04/2019
1A400021266EDF4000630194,422,Grams,DRYING ROOM #7,12/04/2019 020 SI,,12/04/2019
1A400021266EDF4000630195,558,Grams,DRYING ROOM #7,12/04/2019 020 SI,,12/04/2019
1A400021266EDF4000630196,488,Grams,DRYING ROOM #7,12/04/2019 020 SI,,12/04/2019
1A400021266EDF4000630197,478,Grams,DRYING ROOM #7,12/04/2019 020 SI,,12/04/2019
