1A400021266EDF4000628175,318,Grams,DRYING ROOM #7,11/27/2019 020 SE,,11/27/2019
1A400021266EDF4000628361,328,Grams,DRYING ROOM #7,11/27/2019 020 LIDI,,11/27/2019
1A400021266EDF4000628503,346,Grams,DRYING ROOM #7,11/27/2019 020 CHGL,,11/27/2019
1A400021266EDF4000628600,378,Grams,DRYING ROOM #7,11/27/2019 020 CHGL,,11/27/2019
1A400021266EDF4000629070,392,Grams,DRYING ROOM #7,11/27/2019 020 LIDI,,11/27/2019
1A400021266EDF4000629208,320,Grams,DRYING ROOM #7,11/27/2019 020 BLSTBO,,11/27/2019
1A400021266EDF4000629598,436,Grams,DRYING ROOM #7,11/27/2019 020 BLSTBO,,11/27/2019
1A400021266EDF4000629632,306,Grams,DRYING ROOM #7,11/27/2019 020 CRSOCO,,11/27/2019
1A400021266EDF4000629636,396,Grams,DRYING ROOM #7,11/27/2019 020 CRSOCO,,11/27/2019
1A400021266EDF4000629868,254,Grams,DRYING ROOM #7,11/27/2019 020 GETSCO,,11/27/2019
1A400021266EDF4000629890,240,Grams,DRYING ROOM #7,11/27/2019 020 GETSCO,,11/27/2019
1A400021266EDF4000630107,320,Grams,DRYING ROOM #7,11/27/2019 020 SI,,11/27/2019
1A400021266EDF4000630142,366,Grams,DRYING ROOM #7,11/27/2019 020 SI,,11/27/2019
1A400021266EDF4000630292,282,Grams,DRYING ROOM #7,11/27/2019 020 CR,,11/27/2019
1A400021266EDF4000630308,300,Grams,DRYING ROOM #7,11/27/2019 020 CR,,11/27/2019
1A400021266EDF4000630361,382,Grams,DRYING ROOM #7,11/27/2019 020 TEBO,,11/27/2019
1A400021266EDF4000630402,408,Grams,DRYING ROOM #7,11/27/2019 020 TEBO,,11/27/2019
1A400021266EDF4000630562,282,Grams,DRYING ROOM #7,11/27/2019 020 RU,,11/27/2019
1A400021266EDF4000630582,230,Grams,DRYING ROOM #7,11/27/2019 020 RU,,11/27/2019
1A400021266EDF4000630804,410,Grams,DRYING ROOM #7,11/27/2019 020 BLBU,,11/27/2019
1A400021266EDF4000630810,224,Grams,DRYING ROOM #7,11/27/2019 020 BLBU,,11/27/2019
1A400021266EDF4000630882,302,Grams,DRYING ROOM #7,11/27/2019 020 RE,,11/27/2019
1A400021266EDF4000630883,266,Grams,DRYING ROOM #7,11/27/2019 020 RE,,11/27/2019
1A400021266EDF4000631019,372,Grams,DRYING ROOM #7,11/27/2019 020 GLSL,,11/27/2019
1A400021266EDF4000631024,376,Grams,DRYING ROOM #7,11/27/2019 020 GLSL,,11/27/2019
1A400021266EDF4000631759,280,Grams,DRYING ROOM #7,11/27/2019 020 GORU,,11/27/2019
1A400021266EDF4000631760,410,Grams,DRYING ROOM #7,11/27/2019 020 GORU,,11/27/2019
1A400021266EDF4000631885,356,Grams,DRYING ROOM #7,11/27/2019 020 GOGO,,11/27/2019
1A400021266EDF4000632218,220,Grams,DRYING ROOM #7,11/27/2019 020 SE,,11/27/2019
1A400021266EDF4000632246,324,Grams,DRYING ROOM #7,11/27/2019 020 GOGO,,11/27/2019
1A400021266EDF4000632514,396,Grams,DRYING ROOM #7,11/27/2019 020 PH,,11/27/2019
1A400021266EDF4000632521,404,Grams,DRYING ROOM #7,11/27/2019 020 PH,,11/27/2019
1A400021266EDF4000633134,222,Grams,DRYING ROOM #7,11/27/2019 020 VE,,11/27/2019
1A400021266EDF4000633163,258,Grams,DRYING ROOM #7,11/27/2019 020 VE,,11/27/2019
