{
    "1 UP": "1 Up",
    "8 BIT": "8-Bit",
    "BEAR DANCE": "Bear Dance",
    "BLUE BURNOUT": "Blue Burnout",
    "BLUE DREAM": "Blue Dream",
    "BLUEBIRD OG": "Bluebird OG",
    "BOOMBOX": "Boombox",
    "BOSS X STAR DAWG": "Boss x Stardawg",
    "BUBBA KUSH": "Bubba Kush",
    "CHEAT CODE": "Cheat Code",
    "CHEM OG": "Chem OG",
    "CHUNKY GLORY": "Chunky Glory",
    "CINDY WHITE": "Cindy White",
    "CRESCENDO #11": "Crescendo #11",
    "CRESCENDO SOUR COOKIES": "Crescendo Sour Cookies",
    "DISCO KUSH": "Disco Kush",
    "DOPA - MEAN x SOUR GHOST": "Velo",
    "DR. RUBY": "Doctor Ruby",
    "DURBAN POISON": "Durban Poison",
    "ELMERS X JOURNEYMAN": "Elmers x Journey Man",
    "FIERCE": "Fierce",
    "GELATO": "Gelato",
    "GELATO CAKE": "Gelato Cake",
    "GENERAL TSO COOKIES": "General Tso's Cookies",
    "GLASS SLIPPER": "Glass Slipper",
    "GLUEBALL": "Glueball",
    "GOLD RUSH": "Gold Rush",
    "GOLDEN GOAT": "Golden Goat",
    "GRAPE TANG X (LUPE SHINE X G FUNK)": "Grape Tang x (Lupe Shine x G Funk)",
    "HONEY HIKER": "Honey Hiker",
    "HYPNOTIK": "Hypnotik",
    "JAH KUSH X LA VIDA LOCA": "Jah Kush x La Vida Loca",
    "Kandy Kush": "Kandy Kush",
    "LEMON OG HAZE": "Lemon OG Haze",
    "LILAC DIESEL": "Lilac Diesel",
    "LOHIGH": "LoHigh",
    "Member Berry": "Member Berry",
    "Member OG": "Member OG",
    "MOUNT CHOCO": "Mount Choco",
    "NURTURE": "Nurture",
    "OGRE KUSH": "Ogre Kush",
    "PERSEPHONE": "Persephone",
    "PHASER": "Phaser",
    "PLAYER 1": "Player 1",
    "PURPLE PUNCH": "Purple Punch",
    "QUASAR X MAPLE LEAF": "Quasar x Maple Leaf",
    "Recovery": "Recovery",
    "RED ROCKS DIESEL": "Red Rocks Diesel",
    "REJUVE": "Rejuve",
    "ROYAL SENSI": "Royal Sensi",
    "RUBICON": "Rubicon",
    "Serenity": "Serenity",
    "SIESTA": "Siesta",
    "SILVER SUMMIT": "Silver Summit",
    "SLAM DUNK": "Slam Dunk",
    "SNOW SQUALL": "Snow Squall",
    "SNOWBALL": "Snowball",
    "SOUR BREATH X G FUNK": "Sour Breath x G Funk",
    "THE SOLUTION": "The Solution",
    "ULI-BERRY X LA VIDA LOCA": "Uli-Berry x La Vida Loca",
    "Velo": "Velo",
    "WARRIOR": "Warrior",
    "WASH PARK SHARK": "Wash Park Shark",
    "YETI": "Yeti"
}