Strain Code,Strain,Dominancy,Code,25221R
St,1 Up,SATIVA,25221R,
SA-SA-8-BIT-20,8-Bit,SATIVA,25221R,
SA-SA-ALASKAN IC-20,Alaskan Ice,SATIVA,25221R,
HY-HY-ALOHA HAZE-20,Aloha Haze,HYBRID,25222R,
IN-IN-ALTEREGO-20,Alter ego,INDICA,25220R,
SA-SA-AMHRSTMBYD-20,Amherst Moby Dick,SATIVA,25221R,
IN-HY-ANGEL OG-20,Angel OG,INDICA,25220R,
IN-IN-ANOGXSDG9-20,Angel OG x Star Dawg #9,INDICA,25220R,
HY-HY-APEXKUSH-20,Apex Kush,HYBRID,25222R,
HY-HY-APEXKUSH12-20,Apex Kush #12,HYBRID,25222R,
HY-HY-BARRY-O-20,Barry-O,HYBRID,25222R,
HY-HY-BEARDANCE-20,Bear Dance,HYBRID,25222R,
SA-SA-BEAST-20,Beast,SATIVA,25221R,
HY-HY-BEETLEJUIC-20,Beetle Juice,HYBRID,25222R,
HY-HY-BIG BAND-20,Big Band,HYBRID,25222R,
CL-HY-BIGINDSKY-20,Big Indigo Sky,HYBRID,25222R,
HY-HY-BIGINDSKY-20,Big Indigo Sky,HYBRID,25222R,
IN-IN-BLACKBUBBA-20,Black Bubba,INDICA,25220R,
IN-IN-BLKCHRRYOG-20,Black Cherry OG,INDICA,25220R,
IN-IN-BLACKHOLE-20,Black Hole,INDICA,25220R,
IN-HY-BLCKRUSSN-20,Black Russian,INDICA,25220R,
IN-IN-BLACKWATER-20,Black Water,INDICA,25220R,
IN-IN-BLKWRLEM9-20,Black Water x Lemon Stomper #9,INDICA,25220R,
IN-IN-BKWTWB347-20,Black Water x WB3 #47,INDICA,25220R,
IN-HY-BLACKWATER-20,Blackwater,INDICA,25220R,
SA-SA-BLKESTBOMB-20,Blake Street Bomber,SATIVA,25221R,
IN-IN-BLISS-20,Bliss,INDICA,25220R,
IN-IN-BURN-20,Blue Burnout,INDICA,25220R,
IN-HY-BLUCHEESE-20,Blue Cheese,INDICA,25220R,
SA-HY-BLUE DREAM-20,Blue Dream,SATIVA,25221R,
IN-HY-BLUEBERRY-20,Blueberry,INDICA,25220R,
SA-SA-BLUEBIRDOG-20,Bluebird OG,SATIVA,25221R,
SA-SA-BOGBLUE-20,Bogart Blues,SATIVA,25221R,
HY-HY-BOOMBOX-20,Boombox,HYBRID,25222R,
HY-HY-BOSS-20,Boss,HYBRID,25222R,
HY-HY-BOSSXSD-20,Boss x Stardawg,HYBRID,25222R,
SA-SA-BRONCOBRTH-20,Bronco Breath,SATIVA,25221R,
IN-IN-BROS KUSH-20,Brother's Kush,INDICA,25220R,
HY-HY-BRUCE BANN-20,Bruce Banner,HYBRID,25222R,
IN-HY-BUBBAKSH-20,Bubba Kush,INDICA,25220R,
HY-HY-BUBBLEBERY-20,Bubble Berry ,HYBRID,25222R,
HY-HY-BUDDHACHES-20,Buddha Cheese,HYBRID,25222R,
IN-IN-CABERNET-20,Cabernet,INDICA,25220R,
HY-HY-CHEATCODE-20,Cheat Code,HYBRID,25222R,
HY-HY-CHEM 4-20,Chem #4,HYBRID,25222R,
IN-IN-CHEM 4-20,Chem 4,INDICA,25220R,
HY-HY-CHEMDAWG-20,Chem Dawg,HYBRID,25222R,
IN-IN-CHMDXNTHL-20,Chem Dawg x Northern Lights,INDICA,25220R,
HY-HY-CHEMDUB-20,Chem Dub,HYBRID,25222R,
SA-HY-CHEM OG-20,Chem OG,SATIVA,25221R,
HY-HY-CHEMSOURD-20,Chem Sour D,HYBRID,25222R,
HY-HY-CHEMXGRAP-20,Chem Sour Diesel x Graper Ape,HYBRID,25222R,
SA-SA-CHNKYDIESL-20,Chunky Diesel,SATIVA,25221R,
HY-HY-CHKYXST23-20,Chunky Diesel x Star Dawg #23,HYBRID,25222R,
HY-HY-CHKYXSTAR-20,Chunky Diesel x Star Dawg #7,HYBRID,25222R,
HY-HY-CHUNKGLORY-20,Chunky Glory,HYBRID,25222R,
SA-SA-CINDYWHITE-20,Cindy White,SATIVA,25221R,
CL-HY-AFHGANTHAI-20,CLONE Afhgan x Thai,HYBRID,25222R,
CL-IN-ALTEREGO-20,CLONE Alter Ego,INDICA,25220R,
CL-IN-ANOGXSDG9-20,CLONE Angel OG x Star Dawg #9,INDICA,25220R,
CL-HY-APEXKUSH12-20,CLONE Apex Kush #12,HYBRID,25222R,
CL-HY-BEASTWIFI-20,CLONE Beast x WiFi Alien,HYBRID,25222R,
CL-IN-BLACKHOLE-20,CLONE Black Hole,INDICA,25220R,
CL-IN-BLACKWATER-20,CLONE Black Water,INDICA,25220R,
CL-IN-BLKWTRLEM-20,CLONE Black Water x Lemon Stomper,INDICA,25220R,
CL-IN-BLKWRLEM9-20,CLONE Black Water x Lemon Stomper #9,INDICA,25220R,
CL-IN-BKWTWB347-20,CLONE Black Water x WB3 #47,INDICA,25220R,
CL-IN-BURN-20,CLONE Blue Burnout,INDICA,25220R,
CL-SA-BLUE DREAM-20,CLONE Blue Dream,SATIVA,25221R,
CL-HY-BLDRBARBT-20,CLONE Blue Dream x Barberry Brute,HYBRID,25222R,
CL-IN-BLUEBERRY-20,CLONE Blueberry,INDICA,25220R,
CL-IN-BLUBRRYOGGK-20,CLONE Blueberry x OGGK,INDICA,25220R,
CL-HY-BOGBLUE-20,CLONE Bogart Blues,HYBRID,25222R,
CL-HY-BOSS-20,CLONE Boss,HYBRID,25222R,
CL-IN-BROS KUSH-20,CLONE Brother's Kush,INDICA,25220R,
CL-HY-BRUCE BANN-20,CLONE Bruce Banner,HYBRID,25222R,
CL-IN-BUBBAKSH-20,CLONE Bubba Kush,INDICA,25220R,
CL-IN-BBKSHCOGK-20,CLONE Bubba Kush x Captain Krypt OG,INDICA,25220R,
CL-IN-BUBBACOGK-20,CLONE Bubba Kush x Captain OG Krypt,INDICA,25220R,
CL-HY-CHEM 4-20,CLONE Chem #4,HYBRID,25222R,
CL-HY-CHEMDAWG-20,CLONE Chem Dawg,HYBRID,25222R,
CL-IN-CHMDXNTHL-20,CLONE Chem Dawg x Northern Lights,INDICA,25220R,
CL-HY-CHEMSOURD-20,CLONE Chem Sour D,HYBRID,25222R,
CL-SA-CHEMSOURD-20,CLONE Chem Sour Diesel x Chem Sour Diesel ,HYBRID,25222R,
CL-HY-CSDGRAPAPE-20,CLONE Chem Sour Diesel x Graper Ape,HYBRID,25222R,
CL-IN-CHEMDNLGHT-20,CLONE Chemdawg x Northern Lights,INDICA,25220R,
CL-HY-CHKYXST23-20,CLONE Chunky Diesel x Star Dawg #23,HYBRID,25222R,
CL-HY-CHKYXSTAR-20,CLONE Chunky Diesel x Star Dawg #7,HYBRID,25222R,
CL-SA-CINDYWHITE-20,CLONE Cindy White,SATIVA,25221R,
CL-HY-CRZYTRAIN-20,CLONE Crazy Train,HYBRID,25222R,
CL-HY-CSDXBOGXLS-20,CLONE CSD x Lemon Stomper,HYBRID,25222R,
CL-CB-DESERTRUBI2-20,CLONE Desert Rubi 2,CBD,25223R,
CL-CB-DESERTRUBI3-20,CLONE Desert Rubi 3,CBD,25223R,
CL-CB-DESERTRU1-20,CLONE Desert Ruby #1,CBD,25223R,
CL-CB-DESERTRU2-20,CLONE Desert Ruby #2,CBD,25223R,
CL-CB-DESERTRU3-20,CLONE Desert Ruby #3,CBD,25223R,
CL-IN-DOPAMEAN-20,Clone Dopa-Mean,INDICA,25220R,
CL-IN-DRUNKUNI3-20,CLONE Drunken Unicorn #3,INDICA,25220R,
CL-SA-DTCHTHAZE-20,CLONE Dutch Treat Haze,SATIVA,25221R,
CL-SA-ELMERS-20,CLONE Elmers,SATIVA,25221R,
CL-HY-EMPEROR11-20,CLONE Emperor's Kush #11,HYBRID,25222R,
CL-IN-FROSTDPRSM-20,CLONE Frosted Prism,INDICA,25220R,
CL-IN-G FUNK 2-20,CLONE G Funk #2,INDICA,25220R,
CL-SA-GLASSSLPER-20,CLONE Glass Slipper,SATIVA,25221R,
CL-HY-GGOATGAPE-20,CLONE Golden Goat x Graper Ape 4,HYBRID,25222R,
CL-IN-GRPAPEORIG-20,CLONE Grape Ape (Original),INDICA,25220R,
CL-IN-GRAPESOURD-20,CLONE Grape Ape x Chem Sour Diesel,INDICA,25220R,
CL-IN-GAXOGGK-20,CLONE Grape Ape x OG Grape Krypt,INDICA,25220R,
CL-IN-GCRUSHOGGK-20,CLONE Grape Crush x OG Grape Krypt,INDICA,25220R,
CL-SA-GRAPEESCAP-20,CLONE Grape Escape,SATIVA,25221R,
CL-HY-GRPSTMPROG-20,CLONE Grape Stomper OG,HYBRID,25222R,
CL-IN-HAPPY10-20,CLONE Happy 10,INDICA,25220R,
CL-HY-HBANDCHEMSD-20,CLONE Headband x Chem Sour Diesel ,HYBRID,25222R,
CL-HY-HONEYHIVE-20,CLONE Honey Hive,HYBRID,25222R,
CL-SA-JHXBLOGRPR-20,CLONE Jack Herer x (Blue OG x Ripper),SATIVA,25221R,
CL-SA-JHXBOGXR-20,CLONE Jack Herer x BOG9,SATIVA,25221R,
CL-SA-JLMXBOGRPR-20,CLONE Jack La Mota x (Blue OG x Ripper),SATIVA,25221R,
CL-SA-JLMXBOGXR-20,CLONE Jack La Mota x BOG9,SATIVA,25221R,
CL-HY-JACKELBEAN-20,Clone Jackel Bean,HYBRID,25222R,
CL-HY-JILLYBEAN-20,CLONE Jilly Bean,HYBRID,25222R,
CL-HY-JBNWHTBST3-20,CLONE Jilly Bean x White Beast 3,HYBRID,25222R,
CL-SA-LAVIDALOCA-20,CLONE La Vida Loca,SATIVA,25221R,
CL-HY-LLBLB-20,CLONE Lavender Lambs Breath x Lambs Bread,HYBRID,25222R,
CL-HY-LOVETRIANG-20,CLONE Love Triangle,HYBRID,25222R,
CL-SA-LUPESHINE-20,CLONE Lupe Shine,SATIVA,25221R,
CL-IN-MKUCHEMSD-20,CLONE MK Ultra x Chem Sour Diesel,INDICA,25220R,
CL-HY-OGKSFVOGK-20,CLONE OG Kush x SFV OG Kush,HYBRID,25222R,
CL-HY-OLDPURPLE-20,CLONE Old Purple Punch,HYBRID,25222R,
CL-IN-PHASER-20,CLONE Phaser,INDICA,25220R,
CL-HY-PKSHJCKFLSH-20,CLONE Pineapple Kush x Jack Flash,HYBRID,25222R,
CL-HY-ISLANDSS-20,CLONE Pink Grapefruit x Big Skunk 1,HYBRID,25222R,
CL-HY-AFRCAGPREZ-20,CLONE Power Africa x Grape Presidential,HYBRID,25222R,
CL-HY-AFRICAOGGK-20,CLONE Power Africa x OG Grape Krypt,HYBRID,25222R,
CL-HY-PRSKUSHOGGK-20,CLONE Pres Kush x OG Grape Krypt,HYBRID,25222R,
CL-SA-PURPDREAM-20,CLONE Purple Dream,SATIVA,25221R,
CL-IN-PURPLPUNCH-20,CLONE Purple Punch,INDICA,25220R,
CL-IN-ROYALSENSI-20,Clone Royal Sensi,INDICA,25220R,
CL-IN-SERATONIN-20,Clone Sera-Tonin,INDICA,25220R,
CL-SA-SLVRSUMMIT-20,CLONE Silver Summit,SATIVA,25221R,
CL-IN-SILVERBACK-20,CLONE Silverback,INDICA,25220R,
CL-HY-SKUNK 1-20,CLONE Skunk #1,HYBRID,25222R,
CL-HY-SKUNK 2-20,CLONE Skunk #2,HYBRID,25222R,
CL-IN-SKUNK 1-20,Clone Skunk 1,INDICA,25220R,
CL-HY-SNOWSQUALL-20,CLONE Snow Squall,HYBRID,25222R,
CL-SA-SOUR BREAT-20,CLONE Sour Breath,SATIVA,25221R,
CL-SA-SOURDIESEL-20,CLONE Sour Diesel,SATIVA,25221R,
CL-SA-SDSLXGTOG6-20,CLONE Sour Diesel x Ghost OG #6,SATIVA,25221R,
CL-HY-SDIESELOGGK-20,CLONE Sour Diesel x OG Grape Krypt,HYBRID,25222R,
CL-SA-SDSLXOGGK-20,CLONE Sour Diesel x OG Grape Krypt,SATIVA,25221R,
CL-IN-STAR47OGGK-20,CLONE Star 47 x OG Grape Krypt,INDICA,25220R,
CL-HY-SAXBOGXRP-20,CLONE Sticky Ape x BOG9,HYBRID,25222R,
CL-SA-SWTSKNK-20,CLONE Sweet Skunk x Skunk #1,SATIVA,25221R,
CL-HY-TNGCHCLP-20,CLONE Tangie x Chocolope,HYBRID,25222R,
CL-HY-TESTCLONE-20,CLONE Test Clone,HYBRID,25222R,
CL-HY-TKSHSNWLTS-20,CLONE Triangle Kush x Snow Lotus,HYBRID,25222R,
CL-SA-TWISTABB-20,CLONE Twista (Big Bud),SATIVA,25221R,
CL-HY-TWSTARPREZ-20,CLONE Twista x Grape Presidential,HYBRID,25222R,
CL-HY-TWISTAFGHA-20,CLONE Twista x Pure Afghan,HYBRID,25222R,
CL-HY-WHTFIREALI-20,CLONE White Fire Alien,HYBRID,25222R,
CL-SA-YETI B-20,CLONE Yeti B,SATIVA,25221R,
IN-HY-COCO-20,Coco,INDICA,25220R,
HY-HY-COLOKAYAK-20,Colorado Kayak,HYBRID,25222R,
HY-HY-COOKIES-20,Cookies,HYBRID,25222R,
HY-HY-CRZYTRAIN-20,Crazy Train,HYBRID,25222R,
SA-SA-CREMEFRAIC-20,Creme Fraiche,SATIVA,25221R,
HY-HY-CRESCNDO11-20,Crescendo #11,HYBRID,25222R,
HY-HY-CRESSRCOOK-20,Crescendo Sour Cookies,HYBRID,25222R,
IN-IN-CRITICLHOG-20,Critical Hog,INDICA,25220R,
IN-HY-CRITICLMSS-20,Critical Mass,INDICA,25220R,
CB-CB-DESERTRUBI1-20,Desert Rubi #1,CBD,25223R,
CB-CB-DESERTRUBI2-20,Desert Rubi #2,CBD,25223R,
CB-CB-DESERTRUBI3-20,Desert Rubi #3,CBD,25223R,
CB-CB-DESERTRU1-20,Desert Ruby #1,CBD,25223R,
CB-CB-DESERTRU2-20,Desert Ruby #2,CBD,25223R,
CB-CB-DESERTRU3-20,Desert Ruby #3,CBD,25223R,
SA-SA-DIAMONCRSH-20,Diamond Crush,SATIVA,25221R,
SA-SA-DISCOKUSH-20,Disco Kush,SATIVA,25221R,
HY-HY-BOGBLUE-20,Do Not Use,HYBRID,25222R,
HY-HY-HONEYHIVE-20,DO NOT USE,HYBRID,25222R,
HY-HY-YETI-20,Do Not Use,HYBRID,25222R,
CB-CB-DOCTORRUBY-20,Doctor Ruby,CBD,25223R,
IN-IN-DOPAMEAN-20,Dopa-Mean,INDICA,25220R,
IN-IN-DRUNKUNI3-20,Drunken Unicorn #3,INDICA,25220R,
SA-SA-DURBNPOISN-20,Durban Poison,SATIVA,25221R,
SA-SA-DTCHTHAZE-20,Dutch Treat Haze,SATIVA,25221R,
SA-SA-ELMERS-20,Elmers,SATIVA,25221R,
HY-HY-ELMXJOURM-20,Elmers x Journey Man,HYBRID,25222R,
HY-HY-EMPEROR11-20,Emperor's Kush #11,HYBRID,25222R,
HY-HY-FIERCE-20,Fierce,HYBRID,25222R,
HY-HY-FLO-20,Flo,HYBRID,25222R,
IN-IN-FROSTDPRSM-20,Frosted Prism,INDICA,25220R,
IN-IN-G FUNK 2-20,G Funk #2,INDICA,25220R,
HY-HY-GELATO-20,Gelato,HYBRID,25222R,
HY-HY-GELATOCAKE-20,Gelato Cake,HYBRID,25222R,
HY-HY-GENTSOCOOK-20,General Tso's Cookies,HYBRID,25222R,
SA-SA-GLASSSLPER-20,Glass Slipper,SATIVA,25221R,
HY-HY-GLUEBALL-20,Glueball,HYBRID,25222R,
HY-HY-GOLDRUSH-20,Gold Rush,HYBRID,25222R,
SA-HY-GOLDENGOAT-20,Golden Goat,SATIVA,25221R,
HY-HY-GOLDELOTUS-20,Golden Lotus,HYBRID,25222R,
HY-HY-GOLDNSKUNK-20,Golden Skunk,HYBRID,25222R,
IN-IN-GRAPE APE-20,Grape Ape,INDICA,25220R,
IN-IN-GRPAPEORIG-20,Grape Ape (Original),INDICA,25220R,
IN-IN-GRAPEXSTAR-20,Grape Ape x Stardawg,INDICA,25220R,
HY-HY-GRAPECRUSH-20,Grape Crush,HYBRID,25222R,
SA-HY-GRAPEDIESL-20,Grape Diesel,SATIVA,25221R,
SA-HY-GRAPEESCAP-20,Grape Escape,SATIVA,25221R,
HY-HY-GRAPESTMPR-20,Grape Stomper,HYBRID,25222R,
HY-HY-GRPSTMPROG-20,Grape Stomper OG,HYBRID,25222R,
SA-SA-GRAPETANG-20,Grape Tang,SATIVA,25221R,
HY-HY-GTXLUPEXGF-20,Grape Tang x (Lupe Shine x G Funk),HYBRID,25222R,
IN-IN-HAPPY10-20,Happy 10,INDICA,25220R,
IN-HY-HASHPLNT-20,Hash Plant,INDICA,25220R,
SA-SA-HAWAIIAN-20,Hawaiian,SATIVA,25221R,
SA-HY-HEADBAND-20,Headband,SATIVA,25221R,
IN-IN-HONYBOOBOO-20,Honey Boo Boo,INDICA,25220R,
SA-SA-HONEYHIKER-20,Honey Hiker,SATIVA,25221R,
SA-SA-HONEYHIVE-20,Honey Hive,SATIVA,25221R,
IN-IN-HYPNOTIK-20,Hypnotik,INDICA,25220R,
HY-HY-ISS-20,Island Sweet Skunk,HYBRID,25222R,
SA-HY-JACK HERER-20,Jack Herer,SATIVA,25221R,
SA-SA-JHXBLOGRPR-20,Jack Herer x (Blue OG x Ripper),SATIVA,25221R,
SA-HY-JACKLAMOT-20,Jack La Mota,SATIVA,25221R,
SA-SA-JLMXBOGRPR-20,Jack La Mota x (Blue OG x Ripper),SATIVA,25221R,
HY-HY-JCKLBEAN-20,Jackal Bean,HYBRID,25222R,
HY-HY-JAH KUSH-20,Jah Kush,HYBRID,25222R,
SA-SA-JAHKXLVL-20,Jah Kush x La Vida Loca,SATIVA,25221R,
HY-HY-JILLYBEAN-20,Jilly Bean,HYBRID,25222R,
HY-HY-JUMPINGJCK-20,Jumping Jack,HYBRID,25222R,
SA-HY-KALI MIST-20,Kali Mist,SATIVA,25221R,
HY-HY-KANDYKUSH-20,Kandy Kush,HYBRID,25222R,
HY-HY-KONGSTMPER-20,Kong Stomper,HYBRID,25222R,
SA-SA-LAVIDALOCA-20,La Vida Loca,SATIVA,25221R,
HY-HY-LAVENDRLMB-20,Lavender Lamb's Breath,HYBRID,25222R,
HY-HY-LEMONOGHZ-20,Lemon OG Haze,HYBRID,25222R,
HY-HY-LILCDIESEL-20,Lilac Diesel,HYBRID,25222R,
HY-HY-LIONTAMER-20,Lion Tamer,HYBRID,25222R,
SA-SA-LOHIGH-20,LoHigh,SATIVA,25221R,
HY-HY-LOVEBOAT-20,Love Boat,HYBRID,25222R,
HY-HY-LOVETRIANG-20,Love Triangle,HYBRID,25222R,
SA-SA-LUPESHINE-20,Lupe Shine,SATIVA,25221R,
HY-HY-LUPXGFUNK5-20,Lupe Shine x G Funk 5,HYBRID,25222R,
CL-HY-MBEASTWIFI-20,MALE Beast x WiFi Alien,HYBRID,25222R,
CL-HY-BLUEBEAST-20,Male Blueberry x OG Grape Krypt,HYBRID,25222R,
CL-IN-PKUSHGRAPE-20,Male Prez Kush x OG Grape Krypt,HYBRID,25222R,
HY-HY-MEMBERRY-20,Member Berry,HYBRID,25222R,
HY-HY-MEMBEROG-20,Member OG,HYBRID,25222R,
IN-IN-METHODMANK-20,Method Man Kush,INDICA,25220R,
IN-IN-MK ULTRA-20,MK Ultra,INDICA,25220R,
HY-HY-MTCHOCO-20,Mount Choco,HYBRID,25222R,
HY-HY-MUIPO-20,Muipo,HYBRID,25222R,
IN-IN-NURTURE-20,Nurture,INDICA,25220R,
HY-HY-NYCDIESEL-20,NYC Diesel,HYBRID,25222R,
HY-HY-OGCHEESE-20,OG Cheese,HYBRID,25222R,
IN-IN-OG KUSH-20,OG Kush,INDICA,25220R,
IN-HY-OG STAR-20,OG Star,INDICA,25220R,
HY-HY-OGREKUSH-20,Ogre Kush,HYBRID,25222R,
HY-HY-OLDPURPLE-20,Old Purple Punch,HYBRID,25222R,
SA-SA-ONELOVE-20,One Love,SATIVA,25221R,
CL-IN-OGGRAPEAPE-20,Original Grape Ape,INDICA,25220R,
IN-HY-PAPAYA-20,Papaya,INDICA,25220R,
CL-IN-PERSEPHONE-20,Persephone,INDICA,25220R,
IN-IN-PERSEPHONE-20,Persephone,INDICA,25220R,
IN-IN-PHASER-20,Phaser,INDICA,25220R,
SA-SA-PINEAPLEFL-20,Pineapple Flash,SATIVA,25221R,
HY-HY-PINFLXGFU5-20,Pineapple Flash x G Funk 5,HYBRID,25222R,
HY-HY-PFXOGSTOMP-20,Pineapple Flash x OG Stomper,HYBRID,25222R,
HY-HY-PKSHJCKFLSH-20,Pineapple Kush x Jack Flash,HYBRID,25222R,
SA-SA-PLAYER1-20,Player 1,SATIVA,25221R,
HY-HY-PLUMOG-20,Plum OG,HYBRID,25222R,
PL-HY-BSTXWIFI-20,POLLEN Beast x Wifi Alien,HYBRID,25222R,
PL-HY-BBRRYXOGGK-20,POLLEN Blueberry x OG Grape Krypt,HYBRID,25222R,
HY-HY-POWRAFRICA-20,Power Africa,HYBRID,25222R,
HY-HY-PRES KUSH-20,Presidential Kush,HYBRID,25222R,
CL-HY-PRKUSHGK-20,Presidential Kush x Grape Krypt,HYBRID,25222R,
SA-SA-PURAVIDA-20,Pura Vida,SATIVA,25221R,
SA-SA-PURPLECONF-20,Purple Confidential,SATIVA,25221R,
SA-SA-PURPLEDREM-20,Purple Dream,SATIVA,25221R,
IN-IN-PURPLPUNCH-20,Purple Punch,INDICA,25220R,
HY-HY-QRAZYTRAIN-20,Qrazy Train,HYBRID,25222R,
HY-HY-QUASAR-20,Quasar,HYBRID,25222R,
HY-HY-QUASXMAP-20,Quasar x Maple Leaf,HYBRID,25222R,
IN-IN-QMOTHRGOJI-20,Queen Mother Goji,INDICA,25220R,
SA-SA-REDRCKSDSL-20,Red Rocks Diesel,SATIVA,25221R,
IN-IN-REJUVE-20,Rejuve,INDICA,25220R,
HY-HY-RETIREMENT-20,Retirement,HYBRID,25222R,
IN-IN-ROCKLOCK-20,Rocklock,INDICA,25220R,
HY-HY-RCKYMNTNFR-20,Rocky Mountain Fire,HYBRID,25222R,
IN-IN-ROYALSENSI-20,Royal Sensi,INDICA,25220R,
CB-CB-RUBICON-20,Rubicon,CBD,25223R,
SA-SA-SAGENSOUR-20,Sage N Sour,SATIVA,25221R,
IN-IN-SANDMAN-20,Sandman,INDICA,25220R,
HY-HY-SCARLETFRE-20,Scarlet Fire,HYBRID,25222R,
SD-HY-BLUDRMXBB-20,SEEDS Blue Dream x Barberry Brute,HYBRID,25222R,
SD-IN-BBAKUSHXBB-20,SEEDS Bubba Kush x Barberry Brute,INDICA,25220R,
SD-HY-GLDNGTXBB-20,SEEDS Golden Goat x Barberry Brute,HYBRID,25222R,
SD-IN-GRAPEXWIFI-20,SEEDS Grape Ape x Wifi Alien,INDICA,25220R,
SD-IN-HEADBXWIFI-20,SEEDS Headband x Wifi Alien,INDICA,25220R,
SD-SA-MKULTRAXCSD-20,SEEDS MK Ultra x Chem Sour Diesel,SATIVA,25221R,
SD-IN-MKULTXWIFI-20,SEEDS MK Ultra x Wifi Alien,INDICA,25220R,
SD-HY-SOURDXBB-20,SEEDS Sour Diesel x Barberry Brute,HYBRID,25222R,
IN-HY-SENSISTAR-20,Sensi Star,INDICA,25220R,
IN-IN-SERATONIN-20,Sera-Tonin,INDICA,25220R,
IN-HY-SHARKBITE-20,Shark Bite,INDICA,25220R,
IN-IN-SBXPUREA-20,Shark Bite x Pure Afghan,INDICA,25220R,
IN-IN-SHARKSHOCK-20,Shark Shock,INDICA,25220R,
IN-IN-SSXGFUNK-20,Shark Shock x G Funk,INDICA,25220R,
HY-HY-SHIAXSOURG-20,Shiatsu Kush x Sour Ghost,HYBRID,25222R,
HY-HY-SHINE-20,Shine,HYBRID,25222R,
HY-HY-SHIPWRECKD-20,Shipwrecked,HYBRID,25222R,
IN-IN-SIESTA-20,Siesta,INDICA,25220R,
SA-SA-SLVRSUMMIT-20,Silver Summit,SATIVA,25221R,
IN-HY-SILVERBACK-20,Silverback,INDICA,25220R,
HY-HY-SKUNK 1-20,Skunk #1,HYBRID,25222R,
IN-HY-SKUNK 1-20,Skunk #1,INDICA,25220R,
HY-HY-SKUNK 2-20,Skunk #2,HYBRID,25222R,
HY-HY-SKYWALKROG-20,Skywalker OG,HYBRID,25222R,
SA-SA-SLAMDUNK-20,Slam Dunk,SATIVA,25221R,
HY-HY-SNOWSQUALL-20,Snow Squall,HYBRID,25222R,
HY-HY-SNOWBALL-20,Snowball,HYBRID,25222R,
SA-HY-SOUR BREAT-20,Sour Breath,SATIVA,25221R,
HY-HY-SRBXGFUNK-20,Sour Breath x G Funk,HYBRID,25222R,
HY-HY-SOUR CREAM-20,Sour Cream,HYBRID,25222R,
HY-HY-SOURDIESEL-20,Sour Diesel,HYBRID,25222R,
SA-SA-SDSLXGTOG6-20,Sour Diesel x Ghost OG #6,SATIVA,25221R,
SA-SA-SDSLXOGGK-20,Sour Diesel x OG Grape Krypt,SATIVA,25221R,
SA-SA-SGHOST-20,Sour Ghost,SATIVA,25221R,
HY-HY-SOUR KRYPT-20,Sour Krypt,HYBRID,25222R,
IN-IN-STAR 47-20,Star 47,INDICA,25220R,
SA-HY-STICKY APE-20,Sticky Ape,SATIVA,25221R,
IN-IN-SWEETDRMZ-20,Sweet Dreamz,INDICA,25220R,
SA-SA-SWTSKNK-20,Sweet Skunk x Skunk #1,SATIVA,25221R,
HY-HY-TAHOEALI-20,Tahoe Alien,HYBRID,25222R,
HY-HY-TNGCHCLP-20,Tangie x Chocolope,HYBRID,25222R,
HY-HY-TGSPROPIET-20,TGS Proprietary - Hybrid,HYBRID,25222R,
SA-HY-TGSPROPIET-20,TGS Proprietary - Hybrid,SATIVA,25221R,
IN-HY-TGSPROPIET-20,TGS Proprietary - Indica,INDICA,25220R,
IN-IN-FETT-20,The Fett,INDICA,25220R,
IN-IN-THESOLUTIO-20,The Solution,INDICA,25220R,
HY-HY-TRIANGLKSH-20,Triangle Kush,HYBRID,25222R,
HY-HY-TKSHSNWLTS-20,Triangle Kush x Snow Lotus,HYBRID,25222R,
HY-HY-TRICHCYCL-20,Trichcycle,HYBRID,25222R,
HY-HY-TUMMO-20,Tummo,HYBRID,25222R,
SA-SA-TWISTA-20,Twista,SATIVA,25221R,
SA-SA-TWISTABB-20,Twista (Big Bud),SATIVA,25221R,
HY-HY-TWTXAFGHAN7-20,Twista x Pure Afghan 7,HYBRID,25222R,
HY-HY-ULIBERRY-20,Uli-Berry,HYBRID,25222R,
HY-HY-ULIBXLVL-20,Uli-Berry x La Vida Loca,HYBRID,25222R,
SA-SA-URBANDURB-20,Urban Durban,SATIVA,25221R,
HY-HY-VINYRDIESL-20,Vineyard Diesel,HYBRID,25222R,
SA-SA-WARRIOR-20,Warrior,SATIVA,25221R,
SA-SA-WASHPKSHRK-20,Wash Park Shark,SATIVA,25221R,
HY-HY-WHITE APE-20,White Ape,HYBRID,25222R,
SA-SA-WHITEDIES-20,White Diesel,SATIVA,25221R,
HY-HY-WHTFIREALI-20,White Fire Alien,HYBRID,25222R,
HY-HY-WHITELIGHT-20,White Lightning,HYBRID,25222R,
HY-HY-WIFI ALIEN-20,Wifi Alien,HYBRID,25222R,
SA-SA-YETI-20,Yeti,SATIVA,25221R,
SA-SA-YETI B-20,Yeti B,SATIVA,25221R,
SA-SA-YUMBOLTOG-20,Yumboldt OG,SATIVA,25221R,
