1A400021266EDF4000634258,378,Grams,DRYING ROOM #8,12/11/2019 020 HY,,12/11/2019
1A400021266EDF4000634259,334,Grams,DRYING ROOM #8,12/11/2019 020 HY,,12/11/2019
1A400021266EDF4000634260,288,Grams,DRYING ROOM #8,12/11/2019 020 HY,,12/11/2019
1A400021266EDF4000634261,78,Grams,DRYING ROOM #8,12/11/2019 020 HY,,12/11/2019
1A400021266EDF4000634262,214,Grams,DRYING ROOM #8,12/11/2019 020 HY,,12/11/2019
1A400021266EDF4000634263,342,Grams,DRYING ROOM #8,12/11/2019 020 HY,,12/11/2019
1A400021266EDF4000634264,86,Grams,DRYING ROOM #8,12/11/2019 020 HY,,12/11/2019
1A400021266EDF4000634265,200,Grams,DRYING ROOM #8,12/11/2019 020 HY,,12/11/2019
1A400021266EDF4000634266,212,Grams,DRYING ROOM #8,12/11/2019 020 HY,,12/11/2019
1A400021266EDF4000634267,342,Grams,DRYING ROOM #8,12/11/2019 020 HY,,12/11/2019
1A400021266EDF4000634268,140,Grams,DRYING ROOM #8,12/11/2019 020 HY,,12/11/2019
1A400021266EDF4000634269,298,Grams,DRYING ROOM #8,12/11/2019 020 HY,,12/11/2019
1A400021266EDF4000634270,270,Grams,DRYING ROOM #8,12/11/2019 020 HY,,12/11/2019
1A400021266EDF4000634271,298,Grams,DRYING ROOM #8,12/11/2019 020 HY,,12/11/2019
1A400021266EDF4000634274,170,Grams,DRYING ROOM #8,12/11/2019 020 HY,,12/11/2019
1A400021266EDF4000634276,134,Grams,DRYING ROOM #8,12/11/2019 020 HY,,12/11/2019
1A400021266EDF4000634290,132,Grams,DRYING ROOM #8,12/11/2019 020 HY,,12/11/2019
1A400021266EDF4000634292,164,Grams,DRYING ROOM #8,12/11/2019 020 HY,,12/11/2019
1A400021266EDF4000634293,230,Grams,DRYING ROOM #8,12/11/2019 020 HY,,12/11/2019
1A400021266EDF4000634295,254,Grams,DRYING ROOM #8,12/11/2019 020 HY,,12/11/2019
1A400021266EDF4000634296,280,Grams,DRYING ROOM #8,12/11/2019 020 HY,,12/11/2019
1A400021266EDF4000634297,286,Grams,DRYING ROOM #8,12/11/2019 020 HY,,12/11/2019
1A400021266EDF4000634298,490,Grams,DRYING ROOM #8,12/11/2019 020 HY,,12/11/2019
1A400021266EDF4000634299,302,Grams,DRYING ROOM #8,12/11/2019 020 HY,,12/11/2019
1A400021266EDF4000634300,332,Grams,DRYING ROOM #8,12/11/2019 020 HY,,12/11/2019
1A400021266EDF4000634301,454,Grams,DRYING ROOM #8,12/11/2019 020 HY,,12/11/2019
1A400021266EDF4000634302,440,Grams,DRYING ROOM #8,12/11/2019 020 HY,,12/11/2019
1A400021266EDF4000634303,374,Grams,DRYING ROOM #8,12/11/2019 020 HY,,12/11/2019
1A400021266EDF4000634304,422,Grams,DRYING ROOM #8,12/11/2019 020 HY,,12/11/2019
1A400021266EDF4000634305,316,Grams,DRYING ROOM #8,12/11/2019 020 HY,,12/11/2019
1A400021266EDF4000634307,198,Grams,DRYING ROOM #8,12/11/2019 020 HY,,12/11/2019
1A400021266EDF4000634308,140,Grams,DRYING ROOM #8,12/11/2019 020 HY,,12/11/2019
1A400021266EDF4000634310,200,Grams,DRYING ROOM #8,12/11/2019 020 HY,,12/11/2019
1A400021266EDF4000634312,348,Grams,DRYING ROOM #8,12/11/2019 020 HY,,12/11/2019
1A400021266EDF4000634313,336,Grams,DRYING ROOM #8,12/11/2019 020 HY,,12/11/2019
1A400021266EDF4000634314,300,Grams,DRYING ROOM #8,12/11/2019 020 HY,,12/11/2019
1A400021266EDF4000634316,292,Grams,DRYING ROOM #8,12/11/2019 020 HY,,12/11/2019
1A400021266EDF4000634317,266,Grams,DRYING ROOM #8,12/11/2019 020 HY,,12/11/2019
1A400021266EDF4000634318,206,Grams,DRYING ROOM #8,12/11/2019 020 HY,,12/11/2019
1A400021266EDF4000634319,328,Grams,DRYING ROOM #8,12/11/2019 020 HY,,12/11/2019
1A400021266EDF4000634322,342,Grams,DRYING ROOM #8,12/11/2019 020 HY,,12/11/2019
1A400021266EDF4000634323,228,Grams,DRYING ROOM #8,12/11/2019 020 HY,,12/11/2019
1A400021266EDF4000634325,386,Grams,DRYING ROOM #8,12/11/2019 020 HY,,12/11/2019
1A400021266EDF4000634326,202,Grams,DRYING ROOM #8,12/11/2019 020 HY,,12/11/2019
1A400021266EDF4000634327,190,Grams,DRYING ROOM #8,12/11/2019 020 HY,,12/11/2019
1A400021266EDF4000634328,324,Grams,DRYING ROOM #8,12/11/2019 020 HY,,12/11/2019
1A400021266EDF4000634329,138,Grams,DRYING ROOM #8,12/11/2019 020 HY,,12/11/2019
1A400021266EDF4000634330,200,Grams,DRYING ROOM #8,12/11/2019 020 HY,,12/11/2019
1A400021266EDF4000634334,76,Grams,DRYING ROOM #8,12/11/2019 020 SI,,12/11/2019
1A400021266EDF4000634337,64,Grams,DRYING ROOM #8,12/11/2019 020 SI,,12/11/2019
1A400021266EDF4000634338,274,Grams,DRYING ROOM #8,12/11/2019 020 SI,,12/11/2019
1A400021266EDF4000634341,74,Grams,DRYING ROOM #8,12/11/2019 020 SI,,12/11/2019
1A400021266EDF4000634344,382,Grams,DRYING ROOM #8,12/11/2019 020 SI,,12/11/2019
1A400021266EDF4000634345,74,Grams,DRYING ROOM #8,12/11/2019 020 SI,,12/11/2019
1A400021266EDF4000634346,100,Grams,DRYING ROOM #8,12/11/2019 020 SI,,12/11/2019
1A400021266EDF4000634347,102,Grams,DRYING ROOM #8,12/11/2019 020 SI,,12/11/2019
1A400021266EDF4000634348,358,Grams,DRYING ROOM #8,12/11/2019 020 SI,,12/11/2019
1A400021266EDF4000634349,310,Grams,DRYING ROOM #8,12/11/2019 020 SI,,12/11/2019
1A400021266EDF4000634351,386,Grams,DRYING ROOM #8,12/11/2019 020 SI,,12/11/2019
1A400021266EDF4000634352,282,Grams,DRYING ROOM #8,12/11/2019 020 SI,,12/11/2019
1A400021266EDF4000634355,316,Grams,DRYING ROOM #8,12/11/2019 020 SI,,12/11/2019
1A400021266EDF4000634359,228,Grams,DRYING ROOM #8,12/11/2019 020 SI,,12/11/2019
1A400021266EDF4000634360,264,Grams,DRYING ROOM #8,12/11/2019 020 SI,,12/11/2019
1A400021266EDF4000634362,218,Grams,DRYING ROOM #8,12/11/2019 020 SI,,12/11/2019
1A400021266EDF4000634363,52,Grams,DRYING ROOM #8,12/11/2019 020 SI,,12/11/2019
1A400021266EDF4000634364,148,Grams,DRYING ROOM #8,12/11/2019 020 SI,,12/11/2019
1A400021266EDF4000634367,244,Grams,DRYING ROOM #8,12/11/2019 020 SI,,12/11/2019
1A400021266EDF4000634368,398,Grams,DRYING ROOM #8,12/11/2019 020 SI,,12/11/2019
1A400021266EDF4000634370,114,Grams,DRYING ROOM #8,12/11/2019 020 SI,,12/11/2019
1A400021266EDF4000634378,148,Grams,DRYING ROOM #8,12/11/2019 020 SI,,12/11/2019
1A400021266EDF4000634380,94,Grams,DRYING ROOM #8,12/11/2019 020 SI,,12/11/2019
1A400021266EDF4000634381,216,Grams,DRYING ROOM #8,12/11/2019 020 SI,,12/11/2019
1A400021266EDF4000634382,338,Grams,DRYING ROOM #8,12/11/2019 020 SI,,12/11/2019
1A400021266EDF4000634386,250,Grams,DRYING ROOM #8,12/11/2019 020 SI,,12/11/2019
1A400021266EDF4000634388,230,Grams,DRYING ROOM #8,12/11/2019 020 SI,,12/11/2019
1A400021266EDF4000634389,386,Grams,DRYING ROOM #8,12/11/2019 020 SI,,12/11/2019
1A400021266EDF4000634392,196,Grams,DRYING ROOM #8,12/11/2019 020 SI,,12/11/2019
1A400021266EDF4000634393,102,Grams,DRYING ROOM #8,12/11/2019 020 SI,,12/11/2019
1A400021266EDF4000634394,78,Grams,DRYING ROOM #8,12/11/2019 020 SI,,12/11/2019
1A400021266EDF4000634397,356,Grams,DRYING ROOM #8,12/11/2019 020 SI,,12/11/2019
1A400021266EDF4000634399,356,Grams,DRYING ROOM #8,12/11/2019 020 SI,,12/11/2019
1A400021266EDF4000634400,96,Grams,DRYING ROOM #8,12/11/2019 020 SI,,12/11/2019
1A400021266EDF4000634405,418,Grams,DRYING ROOM #8,12/11/2019 020 SI,,12/11/2019
1A400021266EDF4000634409,320,Grams,DRYING ROOM #8,12/11/2019 020 SI,,12/11/2019
1A400021266EDF4000634417,422,Grams,DRYING ROOM #8,12/11/2019 020 SI,,12/11/2019
1A400021266EDF4000634418,116,Grams,DRYING ROOM #8,12/11/2019 020 SI,,12/11/2019
1A400021266EDF4000634427,382,Grams,DRYING ROOM #8,12/11/2019 020 SI,,12/11/2019
1A400021266EDF4000634429,270,Grams,DRYING ROOM #8,12/11/2019 020 SI,,12/11/2019
1A400021266EDF4000634430,348,Grams,DRYING ROOM #8,12/11/2019 020 SI,,12/11/2019
1A400021266EDF4000634431,224,Grams,DRYING ROOM #8,12/11/2019 020 ROSE,,12/11/2019
1A400021266EDF4000634433,304,Grams,DRYING ROOM #8,12/11/2019 020 ROSE,,12/11/2019
1A400021266EDF4000634434,234,Grams,DRYING ROOM #8,12/11/2019 020 ROSE,,12/11/2019
1A400021266EDF4000634435,390,Grams,DRYING ROOM #8,12/11/2019 020 ROSE,,12/11/2019
1A400021266EDF4000634436,316,Grams,DRYING ROOM #8,12/11/2019 020 ROSE,,12/11/2019
1A400021266EDF4000634437,424,Grams,DRYING ROOM #8,12/11/2019 020 ROSE,,12/11/2019
1A400021266EDF4000634438,344,Grams,DRYING ROOM #8,12/11/2019 020 ROSE,,12/11/2019
1A400021266EDF4000634440,202,Grams,DRYING ROOM #8,12/11/2019 020 ROSE,,12/11/2019
1A400021266EDF4000634442,382,Grams,DRYING ROOM #8,12/11/2019 020 ROSE,,12/11/2019
1A400021266EDF4000634443,402,Grams,DRYING ROOM #8,12/11/2019 020 ROSE,,12/11/2019
1A400021266EDF4000634445,360,Grams,DRYING ROOM #8,12/11/2019 020 ROSE,,12/11/2019
1A400021266EDF4000634448,366,Grams,DRYING ROOM #8,12/11/2019 020 ROSE,,12/11/2019
1A400021266EDF4000634451,358,Grams,DRYING ROOM #8,12/11/2019 020 ROSE,,12/11/2019
1A400021266EDF4000634452,202,Grams,DRYING ROOM #8,12/11/2019 020 ROSE,,12/11/2019
1A400021266EDF4000634455,292,Grams,DRYING ROOM #8,12/11/2019 020 ROSE,,12/11/2019
1A400021266EDF4000634461,366,Grams,DRYING ROOM #8,12/11/2019 020 ROSE,,12/11/2019
1A400021266EDF4000634464,418,Grams,DRYING ROOM #8,12/11/2019 020 ROSE,,12/11/2019
1A400021266EDF4000634467,256,Grams,DRYING ROOM #8,12/11/2019 020 ROSE,,12/11/2019
1A400021266EDF4000634469,334,Grams,DRYING ROOM #8,12/11/2019 020 ROSE,,12/11/2019
1A400021266EDF4000634470,324,Grams,DRYING ROOM #8,12/11/2019 020 ROSE,,12/11/2019
1A400021266EDF4000634475,324,Grams,DRYING ROOM #8,12/11/2019 020 ROSE,,12/11/2019
1A400021266EDF4000634477,410,Grams,DRYING ROOM #8,12/11/2019 020 ROSE,,12/11/2019
1A400021266EDF4000634478,316,Grams,DRYING ROOM #8,12/11/2019 020 ROSE,,12/11/2019
1A400021266EDF4000634483,186,Grams,DRYING ROOM #8,12/11/2019 020 ROSE,,12/11/2019
1A400021266EDF4000634484,324,Grams,DRYING ROOM #8,12/11/2019 020 ROSE,,12/11/2019
1A400021266EDF4000634486,270,Grams,DRYING ROOM #8,12/11/2019 020 ROSE,,12/11/2019
1A400021266EDF4000634487,184,Grams,DRYING ROOM #8,12/11/2019 020 ROSE,,12/11/2019
1A400021266EDF4000634492,330,Grams,DRYING ROOM #8,12/11/2019 020 ROSE,,12/11/2019
1A400021266EDF4000634494,268,Grams,DRYING ROOM #8,12/11/2019 020 ROSE,,12/11/2019
1A400021266EDF4000634495,384,Grams,DRYING ROOM #8,12/11/2019 020 ROSE,,12/11/2019
1A400021266EDF4000634496,320,Grams,DRYING ROOM #8,12/11/2019 020 ROSE,,12/11/2019
1A400021266EDF4000634499,306,Grams,DRYING ROOM #8,12/11/2019 020 ROSE,,12/11/2019
1A400021266EDF4000634502,406,Grams,DRYING ROOM #8,12/11/2019 020 ROSE,,12/11/2019
1A400021266EDF4000634503,386,Grams,DRYING ROOM #8,12/11/2019 020 ROSE,,12/11/2019
1A400021266EDF4000634512,398,Grams,DRYING ROOM #8,12/11/2019 020 ROSE,,12/11/2019
1A400021266EDF4000634514,220,Grams,DRYING ROOM #8,12/11/2019 020 ROSE,,12/11/2019
1A400021266EDF4000634515,350,Grams,DRYING ROOM #8,12/11/2019 020 ROSE,,12/11/2019
1A400021266EDF4000634516,320,Grams,DRYING ROOM #8,12/11/2019 020 ROSE,,12/11/2019
1A400021266EDF4000634517,422,Grams,DRYING ROOM #8,12/11/2019 020 ROSE,,12/11/2019
1A400021266EDF4000634519,292,Grams,DRYING ROOM #8,12/11/2019 020 ROSE,,12/11/2019
1A400021266EDF4000634520,342,Grams,DRYING ROOM #8,12/11/2019 020 ROSE,,12/11/2019
1A400021266EDF4000634521,346,Grams,DRYING ROOM #8,12/11/2019 020 ROSE,,12/11/2019
1A400021266EDF4000634533,284,Grams,DRYING ROOM #8,12/11/2019 020 GOGO,,12/11/2019
1A400021266EDF4000634534,296,Grams,DRYING ROOM #8,12/11/2019 020 GOGO,,12/11/2019
1A400021266EDF4000634535,272,Grams,DRYING ROOM #8,12/11/2019 020 GOGO,,12/11/2019
1A400021266EDF4000634537,276,Grams,DRYING ROOM #8,12/11/2019 020 GOGO,,12/11/2019
1A400021266EDF4000634538,48,Grams,DRYING ROOM #8,12/11/2019 020 GOGO,,12/11/2019
1A400021266EDF4000634539,250,Grams,DRYING ROOM #8,12/11/2019 020 GOGO,,12/11/2019
1A400021266EDF4000634543,204,Grams,DRYING ROOM #8,12/11/2019 020 GOGO,,12/11/2019
1A400021266EDF4000634547,116,Grams,DRYING ROOM #8,12/11/2019 020 GOGO,,12/11/2019
1A400021266EDF4000634550,198,Grams,DRYING ROOM #8,12/11/2019 020 GOGO,,12/11/2019
1A400021266EDF4000634551,160,Grams,DRYING ROOM #8,12/11/2019 020 GOGO,,12/11/2019
1A400021266EDF4000634552,294,Grams,DRYING ROOM #8,12/11/2019 020 GOGO,,12/11/2019
1A400021266EDF4000634554,334,Grams,DRYING ROOM #8,12/11/2019 020 GOGO,,12/11/2019
1A400021266EDF4000634555,134,Grams,DRYING ROOM #8,12/11/2019 020 GOGO,,12/11/2019
1A400021266EDF4000634560,302,Grams,DRYING ROOM #8,12/11/2019 020 GOGO,,12/11/2019
1A400021266EDF4000634562,162,Grams,DRYING ROOM #8,12/11/2019 020 GOGO,,12/11/2019
1A400021266EDF4000634564,198,Grams,DRYING ROOM #8,12/11/2019 020 GOGO,,12/11/2019
1A400021266EDF4000634567,300,Grams,DRYING ROOM #8,12/11/2019 020 GOGO,,12/11/2019
1A400021266EDF4000634568,390,Grams,DRYING ROOM #8,12/11/2019 020 GOGO,,12/11/2019
1A400021266EDF4000634570,224,Grams,DRYING ROOM #8,12/11/2019 020 GOGO,,12/11/2019
1A400021266EDF4000634571,362,Grams,DRYING ROOM #8,12/11/2019 020 GOGO,,12/11/2019
1A400021266EDF4000634577,178,Grams,DRYING ROOM #8,12/11/2019 020 GOGO,,12/11/2019
1A400021266EDF4000634578,238,Grams,DRYING ROOM #8,12/11/2019 020 GOGO,,12/11/2019
1A400021266EDF4000634579,168,Grams,DRYING ROOM #8,12/11/2019 020 GOGO,,12/11/2019
1A400021266EDF4000634580,274,Grams,DRYING ROOM #8,12/11/2019 020 GOGO,,12/11/2019
1A400021266EDF4000634581,226,Grams,DRYING ROOM #8,12/11/2019 020 GOGO,,12/11/2019
1A400021266EDF4000634582,230,Grams,DRYING ROOM #8,12/11/2019 020 GOGO,,12/11/2019
1A400021266EDF4000634583,296,Grams,DRYING ROOM #8,12/11/2019 020 GOGO,,12/11/2019
1A400021266EDF4000634585,334,Grams,DRYING ROOM #8,12/11/2019 020 GOGO,,12/11/2019
1A400021266EDF4000634587,222,Grams,DRYING ROOM #8,12/11/2019 020 GOGO,,12/11/2019
1A400021266EDF4000634588,370,Grams,DRYING ROOM #8,12/11/2019 020 GOGO,,12/11/2019
1A400021266EDF4000634589,312,Grams,DRYING ROOM #8,12/11/2019 020 GOGO,,12/11/2019
1A400021266EDF4000634590,236,Grams,DRYING ROOM #8,12/11/2019 020 GOGO,,12/11/2019
1A400021266EDF4000634591,286,Grams,DRYING ROOM #8,12/11/2019 020 GOGO,,12/11/2019
1A400021266EDF4000634592,346,Grams,DRYING ROOM #8,12/11/2019 020 GOGO,,12/11/2019
1A400021266EDF4000634593,258,Grams,DRYING ROOM #8,12/11/2019 020 GOGO,,12/11/2019
1A400021266EDF4000634594,42,Grams,DRYING ROOM #8,12/11/2019 020 GOGO,,12/11/2019
1A400021266EDF4000634595,180,Grams,DRYING ROOM #8,12/11/2019 020 GOGO,,12/11/2019
1A400021266EDF4000634598,102,Grams,DRYING ROOM #8,12/11/2019 020 GOGO,,12/11/2019
1A400021266EDF4000634599,232,Grams,DRYING ROOM #8,12/11/2019 020 GOGO,,12/11/2019
1A400021266EDF4000634603,340,Grams,DRYING ROOM #8,12/11/2019 020 GOGO,,12/11/2019
1A400021266EDF4000634604,368,Grams,DRYING ROOM #8,12/11/2019 020 GOGO,,12/11/2019
1A400021266EDF4000634605,208,Grams,DRYING ROOM #8,12/11/2019 020 GOGO,,12/11/2019
1A400021266EDF4000634606,258,Grams,DRYING ROOM #8,12/11/2019 020 GOGO,,12/11/2019
1A400021266EDF4000634608,292,Grams,DRYING ROOM #8,12/11/2019 020 GOGO,,12/11/2019
1A400021266EDF4000634614,160,Grams,DRYING ROOM #8,12/11/2019 020 GOGO,,12/11/2019
1A400021266EDF4000634616,170,Grams,DRYING ROOM #8,12/11/2019 020 GOGO,,12/11/2019
1A400021266EDF4000634617,392,Grams,DRYING ROOM #8,12/11/2019 020 GOGO,,12/11/2019
1A400021266EDF4000634619,272,Grams,DRYING ROOM #8,12/11/2019 020 GOGO,,12/11/2019
1A400021266EDF4000634622,150,Grams,DRYING ROOM #8,12/11/2019 020 GOGO,,12/11/2019
1A400021266EDF4000634623,244,Grams,DRYING ROOM #8,12/11/2019 020 GOGO,,12/11/2019
1A400021266EDF4000634624,394,Grams,DRYING ROOM #8,12/11/2019 020 GOGO,,12/11/2019
1A400021266EDF4000634625,78,Grams,DRYING ROOM #8,12/11/2019 020 GOGO,,12/11/2019
1A400021266EDF4000634627,348,Grams,DRYING ROOM #8,12/11/2019 020 GOGO,,12/11/2019
1A400021266EDF4000634630,160,Grams,DRYING ROOM #8,12/11/2019 020 GOGO,,12/11/2019
1A400021266EDF4000634655,88,Grams,DRYING ROOM #8,12/11/2019 020 GOGO,,12/11/2019
1A400021266EDF4000634658,266,Grams,DRYING ROOM #8,12/11/2019 020 GOGO,,12/11/2019
1A400021266EDF4000634660,250,Grams,DRYING ROOM #8,12/11/2019 020 GOGO,,12/11/2019
1A400021266EDF4000634661,202,Grams,DRYING ROOM #8,12/11/2019 020 GOGO,,12/11/2019
1A400021266EDF4000634662,374,Grams,DRYING ROOM #8,12/11/2019 020 GOGO,,12/11/2019
1A400021266EDF4000634664,170,Grams,DRYING ROOM #8,12/11/2019 020 GOGO,,12/11/2019
1A400021266EDF4000634665,112,Grams,DRYING ROOM #8,12/11/2019 020 GOGO,,12/11/2019
1A400021266EDF4000634667,284,Grams,DRYING ROOM #8,12/11/2019 020 GOGO,,12/11/2019
1A400021266EDF4000634668,322,Grams,DRYING ROOM #8,12/11/2019 020 GOGO,,12/11/2019
1A400021266EDF4000634669,258,Grams,DRYING ROOM #8,12/11/2019 020 GOGO,,12/11/2019
1A400021266EDF4000634670,206,Grams,DRYING ROOM #8,12/11/2019 020 GOGO,,12/11/2019
1A400021266EDF4000634673,232,Grams,DRYING ROOM #8,12/11/2019 020 GOGO,,12/11/2019
1A400021266EDF4000634674,176,Grams,DRYING ROOM #8,12/11/2019 020 GOGO,,12/11/2019
1A400021266EDF4000634675,252,Grams,DRYING ROOM #8,12/11/2019 020 GOGO,,12/11/2019
1A400021266EDF4000634676,204,Grams,DRYING ROOM #8,12/11/2019 020 GOGO,,12/11/2019
1A400021266EDF4000634677,282,Grams,DRYING ROOM #8,12/11/2019 020 GOGO,,12/11/2019
1A400021266EDF4000634678,278,Grams,DRYING ROOM #8,12/11/2019 020 GOGO,,12/11/2019
1A400021266EDF4000634682,110,Grams,DRYING ROOM #8,12/11/2019 020 GOGO,,12/11/2019
1A400021266EDF4000634687,44,Grams,DRYING ROOM #8,12/11/2019 020 GOGO,,12/11/2019
1A400021266EDF4000634707,134,Grams,DRYING ROOM #8,12/11/2019 020 GOGO,,12/11/2019
1A400021266EDF4000634714,496,Grams,DRYING ROOM #8,12/11/2019 020 GOGO,,12/11/2019
1A400021266EDF4000634725,262,Grams,DRYING ROOM #8,12/11/2019 020 GOGO,,12/11/2019
1A400021266EDF4000634727,146,Grams,DRYING ROOM #8,12/11/2019 020 GOGO,,12/11/2019
1A400021266EDF4000634729,10,Grams,DRYING ROOM #8,12/11/2019 020 GOGO,,12/11/2019
1A400021266EDF4000634731,398,Grams,DRYING ROOM #8,12/11/2019 020 BLSTBO,,12/11/2019
1A400021266EDF4000634732,276,Grams,DRYING ROOM #8,12/11/2019 020 BLSTBO,,12/11/2019
1A400021266EDF4000634734,420,Grams,DRYING ROOM #8,12/11/2019 020 BLSTBO,,12/11/2019
1A400021266EDF4000634735,324,Grams,DRYING ROOM #8,12/11/2019 020 BLSTBO,,12/11/2019
1A400021266EDF4000634736,320,Grams,DRYING ROOM #8,12/11/2019 020 BLSTBO,,12/11/2019
1A400021266EDF4000634737,122,Grams,DRYING ROOM #8,12/11/2019 020 BLSTBO,,12/11/2019
1A400021266EDF4000634738,372,Grams,DRYING ROOM #8,12/11/2019 020 BLSTBO,,12/11/2019
1A400021266EDF4000634739,458,Grams,DRYING ROOM #8,12/11/2019 020 BLSTBO,,12/11/2019
1A400021266EDF4000634740,376,Grams,DRYING ROOM #8,12/11/2019 020 BLSTBO,,12/11/2019
1A400021266EDF4000634744,336,Grams,DRYING ROOM #8,12/11/2019 020 BLSTBO,,12/11/2019
1A400021266EDF4000634831,134,Grams,DRYING ROOM #8,12/11/2019 020 BLSTBO,,12/11/2019
1A400021266EDF4000634833,82,Grams,DRYING ROOM #8,12/11/2019 020 BLSTBO,,12/11/2019
1A400021266EDF4000634834,402,Grams,DRYING ROOM #8,12/11/2019 020 BLSTBO,,12/11/2019
1A400021266EDF4000634836,80,Grams,DRYING ROOM #8,12/11/2019 020 BLSTBO,,12/11/2019
1A400021266EDF4000634837,122,Grams,DRYING ROOM #8,12/11/2019 020 BLSTBO,,12/11/2019
1A400021266EDF4000634838,346,Grams,DRYING ROOM #8,12/11/2019 020 BLSTBO,,12/11/2019
1A400021266EDF4000634839,370,Grams,DRYING ROOM #8,12/11/2019 020 BLSTBO,,12/11/2019
1A400021266EDF4000634840,144,Grams,DRYING ROOM #8,12/11/2019 020 BLSTBO,,12/11/2019
1A400021266EDF4000634841,174,Grams,DRYING ROOM #8,12/11/2019 020 BLSTBO,,12/11/2019
1A400021266EDF4000634843,426,Grams,DRYING ROOM #8,12/11/2019 020 BLSTBO,,12/11/2019
1A400021266EDF4000634844,404,Grams,DRYING ROOM #8,12/11/2019 020 BLSTBO,,12/11/2019
1A400021266EDF4000634845,136,Grams,DRYING ROOM #8,12/11/2019 020 BLSTBO,,12/11/2019
1A400021266EDF4000634846,44,Grams,DRYING ROOM #8,12/11/2019 020 BLSTBO,,12/11/2019
1A400021266EDF4000634847,56,Grams,DRYING ROOM #8,12/11/2019 020 BLSTBO,,12/11/2019
1A400021266EDF4000634848,370,Grams,DRYING ROOM #8,12/11/2019 020 BLSTBO,,12/11/2019
1A400021266EDF4000634849,352,Grams,DRYING ROOM #8,12/11/2019 020 BLSTBO,,12/11/2019
1A400021266EDF4000634850,434,Grams,DRYING ROOM #8,12/11/2019 020 BLSTBO,,12/11/2019
1A400021266EDF4000634851,52,Grams,DRYING ROOM #8,12/11/2019 020 BLSTBO,,12/11/2019
1A400021266EDF4000634852,422,Grams,DRYING ROOM #8,12/11/2019 020 BLSTBO,,12/11/2019
1A400021266EDF4000634853,382,Grams,DRYING ROOM #8,12/11/2019 020 BLSTBO,,12/11/2019
1A400021266EDF4000634854,426,Grams,DRYING ROOM #8,12/11/2019 020 BLSTBO,,12/11/2019
1A400021266EDF4000634855,252,Grams,DRYING ROOM #8,12/11/2019 020 BLSTBO,,12/11/2019
1A400021266EDF4000634858,278,Grams,DRYING ROOM #8,12/11/2019 020 BLSTBO,,12/11/2019
1A400021266EDF4000634859,36,Grams,DRYING ROOM #8,12/11/2019 020 BLSTBO,,12/11/2019
1A400021266EDF4000634860,320,Grams,DRYING ROOM #8,12/11/2019 020 BLSTBO,,12/11/2019
1A400021266EDF4000634861,400,Grams,DRYING ROOM #8,12/11/2019 020 BLSTBO,,12/11/2019
1A400021266EDF4000634862,334,Grams,DRYING ROOM #8,12/11/2019 020 BLSTBO,,12/11/2019
1A400021266EDF4000634863,40,Grams,DRYING ROOM #8,12/11/2019 020 BLSTBO,,12/11/2019
1A400021266EDF4000634865,384,Grams,DRYING ROOM #8,12/11/2019 020 BLSTBO,,12/11/2019
1A400021266EDF4000634866,414,Grams,DRYING ROOM #8,12/11/2019 020 BLSTBO,,12/11/2019
1A400021266EDF4000634868,330,Grams,DRYING ROOM #8,12/11/2019 020 BLSTBO,,12/11/2019
1A400021266EDF4000634869,398,Grams,DRYING ROOM #8,12/11/2019 020 BLSTBO,,12/11/2019
1A400021266EDF4000634870,418,Grams,DRYING ROOM #8,12/11/2019 020 BLSTBO,,12/11/2019
1A400021266EDF4000634872,332,Grams,DRYING ROOM #8,12/11/2019 020 BLSTBO,,12/11/2019
1A400021266EDF4000634873,402,Grams,DRYING ROOM #8,12/11/2019 020 BLSTBO,,12/11/2019
1A400021266EDF4000634874,424,Grams,DRYING ROOM #8,12/11/2019 020 BLSTBO,,12/11/2019
1A400021266EDF4000634875,392,Grams,DRYING ROOM #8,12/11/2019 020 BLSTBO,,12/11/2019
1A400021266EDF4000634876,400,Grams,DRYING ROOM #8,12/11/2019 020 BLSTBO,,12/11/2019
1A400021266EDF4000634877,396,Grams,DRYING ROOM #8,12/11/2019 020 BLSTBO,,12/11/2019
1A400021266EDF4000634878,30,Grams,DRYING ROOM #8,12/11/2019 020 BLSTBO,,12/11/2019
1A400021266EDF4000634879,342,Grams,DRYING ROOM #8,12/11/2019 020 BLSTBO,,12/11/2019
1A400021266EDF4000634880,322,Grams,DRYING ROOM #8,12/11/2019 020 BLSTBO,,12/11/2019
1A400021266EDF4000634906,326,Grams,DRYING ROOM #8,12/11/2019 020 BLSTBO,,12/11/2019
1A400021266EDF4000634908,74,Grams,DRYING ROOM #8,12/11/2019 020 BLSTBO,,12/11/2019
1A400021266EDF4000634909,116,Grams,DRYING ROOM #8,12/11/2019 020 BLSTBO,,12/11/2019
1A400021266EDF4000634910,120,Grams,DRYING ROOM #8,12/11/2019 020 BLSTBO,,12/11/2019
1A400021266EDF4000634911,326,Grams,DRYING ROOM #8,12/11/2019 020 BLSTBO,,12/11/2019
1A400021266EDF4000634912,400,Grams,DRYING ROOM #8,12/11/2019 020 BLSTBO,,12/11/2019
1A400021266EDF4000634914,328,Grams,DRYING ROOM #8,12/11/2019 020 BLSTBO,,12/11/2019
1A400021266EDF4000634915,358,Grams,DRYING ROOM #8,12/11/2019 020 BLSTBO,,12/11/2019
1A400021266EDF4000634917,344,Grams,DRYING ROOM #8,12/11/2019 020 BLSTBO,,12/11/2019
1A400021266EDF4000634918,38,Grams,DRYING ROOM #8,12/11/2019 020 BLSTBO,,12/11/2019
1A400021266EDF4000634919,408,Grams,DRYING ROOM #8,12/11/2019 020 BLSTBO,,12/11/2019
1A400021266EDF4000634920,294,Grams,DRYING ROOM #8,12/11/2019 020 BLSTBO,,12/11/2019
1A400021266EDF4000634921,396,Grams,DRYING ROOM #8,12/11/2019 020 BLSTBO,,12/11/2019
1A400021266EDF4000634922,418,Grams,DRYING ROOM #8,12/11/2019 020 BLSTBO,,12/11/2019
1A400021266EDF4000634923,350,Grams,DRYING ROOM #8,12/11/2019 020 BLSTBO,,12/11/2019
1A400021266EDF4000634924,158,Grams,DRYING ROOM #8,12/11/2019 020 BLSTBO,,12/11/2019
1A400021266EDF4000634926,306,Grams,DRYING ROOM #8,12/11/2019 020 BLSTBO,,12/11/2019
1A400021266EDF4000634927,360,Grams,DRYING ROOM #8,12/11/2019 020 BLSTBO,,12/11/2019
1A400021266EDF4000634928,142,Grams,DRYING ROOM #8,12/11/2019 020 BLSTBO,,12/11/2019
1A400021266EDF4000634929,128,Grams,DRYING ROOM #8,12/11/2019 020 BLSTBO,,12/11/2019
1A400021266EDF4000635033,470,Grams,DRYING ROOM #8,12/11/2019 020 PUPU,,12/11/2019
1A400021266EDF4000635034,628,Grams,DRYING ROOM #8,12/11/2019 020 PUPU,,12/11/2019
1A400021266EDF4000635040,454,Grams,DRYING ROOM #8,12/11/2019 020 PUPU,,12/11/2019
1A400021266EDF4000635042,524,Grams,DRYING ROOM #8,12/11/2019 020 PUPU,,12/11/2019
1A400021266EDF4000635043,156,Grams,DRYING ROOM #8,12/11/2019 020 PUPU,,12/11/2019
1A400021266EDF4000635044,270,Grams,DRYING ROOM #8,12/11/2019 020 PUPU,,12/11/2019
1A400021266EDF4000635047,300,Grams,DRYING ROOM #8,12/11/2019 020 PUPU,,12/11/2019
1A400021266EDF4000635049,410,Grams,DRYING ROOM #8,12/11/2019 020 PUPU,,12/11/2019
1A400021266EDF4000635063,308,Grams,DRYING ROOM #8,12/11/2019 020 PUPU,,12/11/2019
1A400021266EDF4000635064,554,Grams,DRYING ROOM #8,12/11/2019 020 PUPU,,12/11/2019
1A400021266EDF4000635067,406,Grams,DRYING ROOM #8,12/11/2019 020 PUPU,,12/11/2019
1A400021266EDF4000635068,438,Grams,DRYING ROOM #8,12/11/2019 020 PUPU,,12/11/2019
1A400021266EDF4000635099,306,Grams,DRYING ROOM #8,12/11/2019 020 PUPU,,12/11/2019
1A400021266EDF4000635101,146,Grams,DRYING ROOM #8,12/11/2019 020 PUPU,,12/11/2019
1A400021266EDF4000635104,280,Grams,DRYING ROOM #8,12/11/2019 020 PUPU,,12/11/2019
1A400021266EDF4000635106,252,Grams,DRYING ROOM #8,12/11/2019 020 PUPU,,12/11/2019
1A400021266EDF4000635107,436,Grams,DRYING ROOM #8,12/11/2019 020 PUPU,,12/11/2019
1A400021266EDF4000635108,394,Grams,DRYING ROOM #8,12/11/2019 020 PUPU,,12/11/2019
1A400021266EDF4000635110,584,Grams,DRYING ROOM #8,12/11/2019 020 PUPU,,12/11/2019
1A400021266EDF4000635111,550,Grams,DRYING ROOM #8,12/11/2019 020 PUPU,,12/11/2019
