{
    "Phase 1": [
        "H-4",
        "H-5",
        "H-6",
        "H-7",
        "H-8",
        "I-4",
        "I-5",
        "I-6",
        "I-7",
        "I-8",
        "J-4",
        "J-5",
        "J-6",
        "J-7",
        "J-8",
        "K-4",
        "K-5",
        "K-6",
        "K-7",
        "K-8",
        "L-4",
        "L-5",
        "L-6",
        "L-7",
        "L-8",
        "M-4",
        "M-5",
        "M-6",
        "M-7",
        "M-8",
        "N-4",
        "N-5",
        "N-6",
        "N-7",
        "N-8",
        "O-4",
        "O-5",
        "O-6",
        "O-7",
        "O-8",
        "P-4",
        "P-5",
        "P-6",
        "P-7",
        "P-8",
        "Q-4",
        "Q-5",
        "Q-6",
        "Q-7",
        "Q-8",
        "R-4",
        "R-5",
        "R-6",
        "R-7",
        "R-8",
        "S-5",
        "S-6",
        "S-7",
        "S-8"
    ],
    "Phase 2": [
        "H-9",
        "H-10",
        "H-11",
        "H-12",
        "H-13",
        "H-14",
        "H-15",
        "I-9",
        "I-10",
        "I-11",
        "I-12",
        "I-13",
        "I-14",
        "I-15",
        "J-9",
        "J-10",
        "J-11",
        "J-12",
        "J-13",
        "J-14",
        "J-15",
        "K-9",
        "K-10",
        "K-11",
        "K-12",
        "K-13",
        "K-14",
        "K-15",
        "L-9",
        "L-10",
        "L-11",
        "L-12",
        "L-13",
        "L-14",
        "L-15",
        "M-9",
        "M-10",
        "M-11",
        "M-12",
        "M-13",
        "M-14",
        "M-15",
        "N-9",
        "N-10",
        "N-11",
        "N-12",
        "N-13",
        "N-14",
        "N-15",
        "O-9",
        "O-10",
        "O-11",
        "O-12",
        "O-13",
        "O-14",
        "O-15",
        "P-9",
        "P-10",
        "P-11",
        "P-12",
        "P-13",
        "P-14",
        "P-15",
        "Q-9",
        "Q-10",
        "Q-11",
        "Q-12",
        "Q-13",
        "Q-14",
        "Q-15",
        "R-9",
        "R-10",
        "R-11",
        "R-12",
        "R-13",
        "R-14",
        "R-15",
        "S-9",
        "S-10",
        "S-11",
        "S-12",
        "S-13",
        "S-14",
        "S-15"
    ],
    "Phase 3": [
        "A-16",
        "A-17",
        "A-18",
        "A-19",
        "A-20",
        "A-21",
        "A-22",
        "B-16",
        "B-17",
        "B-18",
        "B-19",
        "B-20",
        "B-21",
        "B-22",
        "C-16",
        "C-17",
        "C-18",
        "C-19",
        "C-20",
        "C-21",
        "C-22",
        "D-16",
        "D-17",
        "D-18",
        "D-19",
        "D-20",
        "D-21",
        "D-22",
        "E-16",
        "E-17",
        "E-18",
        "E-19",
        "E-20",
        "E-21",
        "E-22",
        "F-16",
        "F-17",
        "F-18",
        "F-19",
        "F-20",
        "F-21",
        "F-22",
        "G-16",
        "G-17",
        "G-18",
        "G-19",
        "G-20",
        "G-21",
        "G-22",
        "H-16",
        "H-17",
        "H-18",
        "H-19",
        "H-20",
        "H-21",
        "H-22",
        "I-16",
        "I-17",
        "I-18",
        "I-19",
        "I-20",
        "I-21",
        "I-22",
        "J-16",
        "J-17",
        "J-18",
        "J-19",
        "J-20",
        "J-21",
        "J-22",
        "K-16",
        "K-17",
        "K-18",
        "K-19",
        "K-20",
        "K-21",
        "K-22",
        "L-16",
        "L-17",
        "L-18",
        "L-19",
        "L-20",
        "L-21",
        "L-22",
        "M-16",
        "M-17",
        "M-18",
        "M-19",
        "M-20",
        "M-21",
        "M-22",
        "N-16",
        "N-17",
        "N-18",
        "N-19",
        "N-20",
        "N-21",
        "N-22",
        "O-16",
        "O-17",
        "O-18",
        "O-19",
        "O-20",
        "O-21",
        "O-22",
        "P-16",
        "P-17",
        "P-18",
        "P-19",
        "P-20",
        "P-21",
        "P-22",
        "Q-16",
        "Q-17",
        "Q-18",
        "Q-19",
        "Q-20",
        "Q-21",
        "Q-22",
        "R-16",
        "R-17",
        "R-18",
        "R-19",
        "R-20",
        "R-21",
        "R-22",
        "S-16",
        "S-17",
        "S-18",
        "S-19",
        "S-20",
        "S-21",
        "S-22"
    ],
    "Phase 4": [
        "A-23",
        "A-24",
        "A-25",
        "A-26",
        "A-27",
        "A-28",
        "A-29",
        "B-23",
        "B-24",
        "B-25",
        "B-26",
        "B-27",
        "B-28",
        "C-23",
        "C-24",
        "C-25",
        "C-26",
        "C-27",
        "C-28",
        "D-23",
        "D-24",
        "D-25",
        "D-26",
        "D-27",
        "D-28",
        "E-23",
        "E-24",
        "E-25",
        "E-26",
        "E-27",
        "E-28",
        "F-23",
        "F-24",
        "F-25",
        "F-26",
        "F-27",
        "F-28",
        "G-23",
        "G-24",
        "G-25",
        "G-26",
        "G-27",
        "G-28",
        "H-23",
        "H-24",
        "H-25",
        "H-26",
        "H-27",
        "H-28",
        "I-23",
        "I-24",
        "I-25",
        "I-26",
        "I-27",
        "I-28",
        "J-23",
        "J-24",
        "J-25",
        "J-26",
        "J-27",
        "J-28",
        "K-23",
        "K-24",
        "K-25",
        "K-26",
        "K-27",
        "K-28",
        "L-23",
        "L-24",
        "L-25",
        "L-26",
        "L-27",
        "L-28",
        "M-23",
        "M-24",
        "M-25",
        "M-26",
        "M-27",
        "M-28",
        "N-23",
        "N-24",
        "N-25",
        "N-26",
        "N-27",
        "N-28",
        "O-23",
        "O-24",
        "O-25",
        "O-26",
        "O-27",
        "O-28",
        "P-23",
        "P-24",
        "P-25",
        "P-26",
        "P-27",
        "P-28",
        "Q-23",
        "Q-24",
        "Q-25",
        "Q-26",
        "Q-27",
        "Q-28",
        "R-23",
        "R-24",
        "R-25",
        "R-26",
        "R-27",
        "R-28",
        "S-23",
        "S-24",
        "S-25",
        "S-26",
        "S-27",
        "S-28"
    ]
}
