1A400021266EDF4000631831,148,Grams,DRYING ROOM #8,12/11/2019 020 GOGO,,12/11/2019
1A400021266EDF4000631832,238,Grams,DRYING ROOM #8,12/11/2019 020 GOGO,,12/11/2019
1A400021266EDF4000631838,260,Grams,DRYING ROOM #8,12/11/2019 020 GOGO,,12/11/2019
1A400021266EDF4000631841,272,Grams,DRYING ROOM #8,12/11/2019 020 GOGO,,12/11/2019
1A400021266EDF4000631843,230,Grams,DRYING ROOM #8,12/11/2019 020 GOGO,,12/11/2019
1A400021266EDF4000631847,220,Grams,DRYING ROOM #8,12/11/2019 020 GOGO,,12/11/2019
1A400021266EDF4000631875,274,Grams,DRYING ROOM #8,12/11/2019 020 GOGO,,12/11/2019
1A400021266EDF4000631878,258,Grams,DRYING ROOM #8,12/11/2019 020 GOGO,,12/11/2019
1A400021266EDF4000631880,98,Grams,DRYING ROOM #8,12/11/2019 020 GOGO,,12/11/2019
1A400021266EDF4000631886,74,Grams,DRYING ROOM #8,12/11/2019 020 GOGO,,12/11/2019
1A400021266EDF4000631888,166,Grams,DRYING ROOM #8,12/11/2019 020 GOGO,,12/11/2019
1A400021266EDF4000631892,62,Grams,DRYING ROOM #8,12/11/2019 020 GOGO,,12/11/2019
1A400021266EDF4000631896,396,Grams,DRYING ROOM #8,12/11/2019 020 GOGO,,12/11/2019
1A400021266EDF4000631900,282,Grams,DRYING ROOM #8,12/11/2019 020 GOGO,,12/11/2019
1A400021266EDF4000631936,226,Grams,DRYING ROOM #8,12/11/2019 020 GOGO,,12/11/2019
1A400021266EDF4000631946,216,Grams,DRYING ROOM #8,12/11/2019 020 GOGO,,12/11/2019
1A400021266EDF4000631948,268,Grams,DRYING ROOM #8,12/11/2019 020 GOGO,,12/11/2019
1A400021266EDF4000631953,194,Grams,DRYING ROOM #8,12/11/2019 020 GOGO,,12/11/2019
1A400021266EDF4000631963,248,Grams,DRYING ROOM #8,12/11/2019 020 GOGO,,12/11/2019
1A400021266EDF4000631968,198,Grams,DRYING ROOM #8,12/11/2019 020 GOGO,,12/11/2019
1A400021266EDF4000631971,138,Grams,DRYING ROOM #8,12/11/2019 020 GOGO,,12/11/2019
1A400021266EDF4000631974,240,Grams,DRYING ROOM #8,12/11/2019 020 GOGO,,12/11/2019
1A400021266EDF4000631981,278,Grams,DRYING ROOM #8,12/11/2019 020 GOGO,,12/11/2019
1A400021266EDF4000632001,252,Grams,DRYING ROOM #8,12/11/2019 020 GOGO,,12/11/2019
1A400021266EDF4000632016,150,Grams,DRYING ROOM #8,12/11/2019 020 GOGO,,12/11/2019
1A400021266EDF4000632020,266,Grams,DRYING ROOM #8,12/11/2019 020 GOGO,,12/11/2019
1A400021266EDF4000632023,372,Grams,DRYING ROOM #8,12/11/2019 020 GOGO,,12/11/2019
1A400021266EDF4000632025,272,Grams,DRYING ROOM #8,12/11/2019 020 GOGO,,12/11/2019
1A400021266EDF4000632030,376,Grams,DRYING ROOM #8,12/11/2019 020 GOGO,,12/11/2019
1A400021266EDF4000632263,288,Grams,DRYING ROOM #8,12/11/2019 020 GOGO,,12/11/2019
1A400021266EDF4000632282,348,Grams,DRYING ROOM #8,12/11/2019 020 GOGO,,12/11/2019
1A400021266EDF4000632288,268,Grams,DRYING ROOM #8,12/11/2019 020 GOGO,,12/11/2019
1A400021266EDF4000632294,194,Grams,DRYING ROOM #8,12/11/2019 020 GOGO,,12/11/2019
1A400021266EDF4000632297,322,Grams,DRYING ROOM #8,12/11/2019 020 GOGO,,12/11/2019
1A400021266EDF4000632299,204,Grams,DRYING ROOM #8,12/11/2019 020 GOGO,,12/11/2019
1A400021266EDF4000632301,312,Grams,DRYING ROOM #8,12/11/2019 020 GOGO,,12/11/2019
1A400021266EDF4000632304,216,Grams,DRYING ROOM #8,12/11/2019 020 GOGO,,12/11/2019
1A400021266EDF4000632310,306,Grams,DRYING ROOM #8,12/11/2019 020 GOGO,,12/11/2019
1A400021266EDF4000632311,200,Grams,DRYING ROOM #8,12/11/2019 020 GOGO,,12/11/2019
1A400021266EDF4000632320,216,Grams,DRYING ROOM #8,12/11/2019 020 GOGO,,12/11/2019
1A400021266EDF4000632324,230,Grams,DRYING ROOM #8,12/11/2019 020 GOGO,,12/11/2019
1A400021266EDF4000632326,236,Grams,DRYING ROOM #8,12/11/2019 020 GOGO,,12/11/2019
1A400021266EDF4000632757,324,Grams,DRYING ROOM #8,12/11/2019 020 RU,,12/11/2019
1A400021266EDF4000632759,314,Grams,DRYING ROOM #8,12/11/2019 020 RU,,12/11/2019
1A400021266EDF4000632768,332,Grams,DRYING ROOM #8,12/11/2019 020 RU,,12/11/2019
1A400021266EDF4000632773,302,Grams,DRYING ROOM #8,12/11/2019 020 RU,,12/11/2019
1A400021266EDF4000632774,292,Grams,DRYING ROOM #8,12/11/2019 020 RU,,12/11/2019
1A400021266EDF4000632777,382,Grams,DRYING ROOM #8,12/11/2019 020 RU,,12/11/2019
1A400021266EDF4000632807,366,Grams,DRYING ROOM #8,12/11/2019 020 RU,,12/11/2019
1A400021266EDF4000632811,386,Grams,DRYING ROOM #8,12/11/2019 020 RU,,12/11/2019
1A400021266EDF4000632818,352,Grams,DRYING ROOM #8,12/11/2019 020 RU,,12/11/2019
1A400021266EDF4000632822,358,Grams,DRYING ROOM #8,12/11/2019 020 RU,,12/11/2019
1A400021266EDF4000633832,170,Grams,DRYING ROOM #8,12/11/2019 020 SE,,12/11/2019
1A400021266EDF4000633833,244,Grams,DRYING ROOM #8,12/11/2019 020 SE,,12/11/2019
1A400021266EDF4000633834,230,Grams,DRYING ROOM #8,12/11/2019 020 SE,,12/11/2019
1A400021266EDF4000633835,164,Grams,DRYING ROOM #8,12/11/2019 020 SE,,12/11/2019
1A400021266EDF4000633836,292,Grams,DRYING ROOM #8,12/11/2019 020 SE,,12/11/2019
1A400021266EDF4000633837,334,Grams,DRYING ROOM #8,12/11/2019 020 SE,,12/11/2019
1A400021266EDF4000633838,272,Grams,DRYING ROOM #8,12/11/2019 020 SE,,12/11/2019
1A400021266EDF4000633839,380,Grams,DRYING ROOM #8,12/11/2019 020 SE,,12/11/2019
1A400021266EDF4000633843,272,Grams,DRYING ROOM #8,12/11/2019 020 SE,,12/11/2019
1A400021266EDF4000633845,312,Grams,DRYING ROOM #8,12/11/2019 020 SE,,12/11/2019
1A400021266EDF4000633846,170,Grams,DRYING ROOM #8,12/11/2019 020 SE,,12/11/2019
1A400021266EDF4000633847,278,Grams,DRYING ROOM #8,12/11/2019 020 SE,,12/11/2019
1A400021266EDF4000633848,270,Grams,DRYING ROOM #8,12/11/2019 020 SE,,12/11/2019
1A400021266EDF4000633849,280,Grams,DRYING ROOM #8,12/11/2019 020 SE,,12/11/2019
1A400021266EDF4000633850,250,Grams,DRYING ROOM #8,12/11/2019 020 SE,,12/11/2019
1A400021266EDF4000633851,360,Grams,DRYING ROOM #8,12/11/2019 020 SE,,12/11/2019
1A400021266EDF4000633853,148,Grams,DRYING ROOM #8,12/11/2019 020 SE,,12/11/2019
1A400021266EDF4000633854,272,Grams,DRYING ROOM #8,12/11/2019 020 SE,,12/11/2019
1A400021266EDF4000633855,174,Grams,DRYING ROOM #8,12/11/2019 020 SE,,12/11/2019
1A400021266EDF4000633868,266,Grams,DRYING ROOM #8,12/11/2019 020 SE,,12/11/2019
1A400021266EDF4000633875,332,Grams,DRYING ROOM #8,12/11/2019 020 SE,,12/11/2019
1A400021266EDF4000633882,190,Grams,DRYING ROOM #8,12/11/2019 020 SE,,12/11/2019
1A400021266EDF4000633883,64,Grams,DRYING ROOM #8,12/11/2019 020 SE,,12/11/2019
1A400021266EDF4000633884,346,Grams,DRYING ROOM #8,12/11/2019 020 SE,,12/11/2019
1A400021266EDF4000633885,360,Grams,DRYING ROOM #8,12/11/2019 020 SE,,12/11/2019
1A400021266EDF4000633886,268,Grams,DRYING ROOM #8,12/11/2019 020 SE,,12/11/2019
1A400021266EDF4000633889,278,Grams,DRYING ROOM #8,12/11/2019 020 SE,,12/11/2019
1A400021266EDF4000633890,268,Grams,DRYING ROOM #8,12/11/2019 020 SE,,12/11/2019
1A400021266EDF4000633892,172,Grams,DRYING ROOM #8,12/11/2019 020 SE,,12/11/2019
1A400021266EDF4000633893,260,Grams,DRYING ROOM #8,12/11/2019 020 SE,,12/11/2019
1A400021266EDF4000633894,130,Grams,DRYING ROOM #8,12/11/2019 020 SE,,12/11/2019
1A400021266EDF4000633895,260,Grams,DRYING ROOM #8,12/11/2019 020 SE,,12/11/2019
1A400021266EDF4000633896,184,Grams,DRYING ROOM #8,12/11/2019 020 SE,,12/11/2019
1A400021266EDF4000633898,236,Grams,DRYING ROOM #8,12/11/2019 020 SE,,12/11/2019
1A400021266EDF4000633901,350,Grams,DRYING ROOM #8,12/11/2019 020 SE,,12/11/2019
1A400021266EDF4000633902,366,Grams,DRYING ROOM #8,12/11/2019 020 SE,,12/11/2019
1A400021266EDF4000633904,244,Grams,DRYING ROOM #8,12/11/2019 020 SE,,12/11/2019
1A400021266EDF4000633905,276,Grams,DRYING ROOM #8,12/11/2019 020 SE,,12/11/2019
1A400021266EDF4000633911,382,Grams,DRYING ROOM #8,12/11/2019 020 SE,,12/11/2019
1A400021266EDF4000633916,242,Grams,DRYING ROOM #8,12/11/2019 020 SE,,12/11/2019
1A400021266EDF4000633918,260,Grams,DRYING ROOM #8,12/11/2019 020 SE,,12/11/2019
1A400021266EDF4000633930,290,Grams,DRYING ROOM #8,12/11/2019 020 SE,,12/11/2019
1A400021266EDF4000633931,326,Grams,DRYING ROOM #8,12/11/2019 020 ULXLAVILO,,12/11/2019
1A400021266EDF4000633936,168,Grams,DRYING ROOM #8,12/11/2019 020 ULXLAVILO,,12/11/2019
1A400021266EDF4000633940,170,Grams,DRYING ROOM #8,12/11/2019 020 ULXLAVILO,,12/11/2019
1A400021266EDF4000633941,392,Grams,DRYING ROOM #8,12/11/2019 020 ULXLAVILO,,12/11/2019
1A400021266EDF4000633943,462,Grams,DRYING ROOM #8,12/11/2019 020 ULXLAVILO,,12/11/2019
1A400021266EDF4000633944,330,Grams,DRYING ROOM #8,12/11/2019 020 ULXLAVILO,,12/11/2019
1A400021266EDF4000633945,370,Grams,DRYING ROOM #8,12/11/2019 020 ULXLAVILO,,12/11/2019
1A400021266EDF4000633946,288,Grams,DRYING ROOM #8,12/11/2019 020 ULXLAVILO,,12/11/2019
1A400021266EDF4000633947,346,Grams,DRYING ROOM #8,12/11/2019 020 ULXLAVILO,,12/11/2019
1A400021266EDF4000633948,396,Grams,DRYING ROOM #8,12/11/2019 020 ULXLAVILO,,12/11/2019
1A400021266EDF4000633949,264,Grams,DRYING ROOM #8,12/11/2019 020 ULXLAVILO,,12/11/2019
1A400021266EDF4000633950,300,Grams,DRYING ROOM #8,12/11/2019 020 ULXLAVILO,,12/11/2019
1A400021266EDF4000633951,372,Grams,DRYING ROOM #8,12/11/2019 020 ULXLAVILO,,12/11/2019
1A400021266EDF4000633953,306,Grams,DRYING ROOM #8,12/11/2019 020 ULXLAVILO,,12/11/2019
1A400021266EDF4000633954,408,Grams,DRYING ROOM #8,12/11/2019 020 ULXLAVILO,,12/11/2019
1A400021266EDF4000633955,80,Grams,DRYING ROOM #8,12/11/2019 020 ULXLAVILO,,12/11/2019
1A400021266EDF4000633956,372,Grams,DRYING ROOM #8,12/11/2019 020 ULXLAVILO,,12/11/2019
1A400021266EDF4000633985,288,Grams,DRYING ROOM #8,12/11/2019 020 ULXLAVILO,,12/11/2019
1A400021266EDF4000633986,338,Grams,DRYING ROOM #8,12/11/2019 020 ULXLAVILO,,12/11/2019
1A400021266EDF4000633987,320,Grams,DRYING ROOM #8,12/11/2019 020 ULXLAVILO,,12/11/2019
1A400021266EDF4000633989,364,Grams,DRYING ROOM #8,12/11/2019 020 ULXLAVILO,,12/11/2019
1A400021266EDF4000633995,396,Grams,DRYING ROOM #8,12/11/2019 020 ULXLAVILO,,12/11/2019
1A400021266EDF4000633996,312,Grams,DRYING ROOM #8,12/11/2019 020 ULXLAVILO,,12/11/2019
1A400021266EDF4000634004,340,Grams,DRYING ROOM #8,12/11/2019 020 ULXLAVILO,,12/11/2019
1A400021266EDF4000634007,396,Grams,DRYING ROOM #8,12/11/2019 020 ULXLAVILO,,12/11/2019
1A400021266EDF4000634008,220,Grams,DRYING ROOM #8,12/11/2019 020 ULXLAVILO,,12/11/2019
1A400021266EDF4000634010,448,Grams,DRYING ROOM #8,12/11/2019 020 ULXLAVILO,,12/11/2019
1A400021266EDF4000634012,406,Grams,DRYING ROOM #8,12/11/2019 020 ULXLAVILO,,12/11/2019
1A400021266EDF4000634013,220,Grams,DRYING ROOM #8,12/11/2019 020 ULXLAVILO,,12/11/2019
1A400021266EDF4000634015,296,Grams,DRYING ROOM #8,12/11/2019 020 ULXLAVILO,,12/11/2019
1A400021266EDF4000634017,334,Grams,DRYING ROOM #8,12/11/2019 020 ULXLAVILO,,12/11/2019
1A400021266EDF4000634018,326,Grams,DRYING ROOM #8,12/11/2019 020 ULXLAVILO,,12/11/2019
1A400021266EDF4000634019,300,Grams,DRYING ROOM #8,12/11/2019 020 ULXLAVILO,,12/11/2019
1A400021266EDF4000634020,220,Grams,DRYING ROOM #8,12/11/2019 020 ULXLAVILO,,12/11/2019
1A400021266EDF4000634021,284,Grams,DRYING ROOM #8,12/11/2019 020 ULXLAVILO,,12/11/2019
1A400021266EDF4000634022,374,Grams,DRYING ROOM #8,12/11/2019 020 ULXLAVILO,,12/11/2019
1A400021266EDF4000634023,376,Grams,DRYING ROOM #8,12/11/2019 020 ULXLAVILO,,12/11/2019
1A400021266EDF4000634024,340,Grams,DRYING ROOM #8,12/11/2019 020 ULXLAVILO,,12/11/2019
1A400021266EDF4000634025,358,Grams,DRYING ROOM #8,12/11/2019 020 ULXLAVILO,,12/11/2019
1A400021266EDF4000634026,414,Grams,DRYING ROOM #8,12/11/2019 020 ULXLAVILO,,12/11/2019
1A400021266EDF4000634027,366,Grams,DRYING ROOM #8,12/11/2019 020 ULXLAVILO,,12/11/2019
1A400021266EDF4000634028,356,Grams,DRYING ROOM #8,12/11/2019 020 ULXLAVILO,,12/11/2019
1A400021266EDF4000634029,368,Grams,DRYING ROOM #8,12/11/2019 020 ULXLAVILO,,12/11/2019
1A400021266EDF4000634030,298,Grams,DRYING ROOM #8,12/11/2019 020 ULXLAVILO,,12/11/2019
1A400021266EDF4000634031,414,Grams,DRYING ROOM #8,12/11/2019 020 LIDI,,12/11/2019
1A400021266EDF4000634032,352,Grams,DRYING ROOM #8,12/11/2019 020 LIDI,,12/11/2019
1A400021266EDF4000634033,348,Grams,DRYING ROOM #8,12/11/2019 020 LIDI,,12/11/2019
1A400021266EDF4000634035,204,Grams,DRYING ROOM #8,12/11/2019 020 LIDI,,12/11/2019
1A400021266EDF4000634037,356,Grams,DRYING ROOM #8,12/11/2019 020 LIDI,,12/11/2019
1A400021266EDF4000634038,316,Grams,DRYING ROOM #8,12/11/2019 020 LIDI,,12/11/2019
1A400021266EDF4000634039,476,Grams,DRYING ROOM #8,12/11/2019 020 LIDI,,12/11/2019
1A400021266EDF4000634040,190,Grams,DRYING ROOM #8,12/11/2019 020 LIDI,,12/11/2019
1A400021266EDF4000634041,356,Grams,DRYING ROOM #8,12/11/2019 020 LIDI,,12/11/2019
1A400021266EDF4000634042,352,Grams,DRYING ROOM #8,12/11/2019 020 LIDI,,12/11/2019
1A400021266EDF4000634043,346,Grams,DRYING ROOM #8,12/11/2019 020 LIDI,,12/11/2019
1A400021266EDF4000634044,304,Grams,DRYING ROOM #8,12/11/2019 020 LIDI,,12/11/2019
1A400021266EDF4000634045,290,Grams,DRYING ROOM #8,12/11/2019 020 LIDI,,12/11/2019
1A400021266EDF4000634046,328,Grams,DRYING ROOM #8,12/11/2019 020 LIDI,,12/11/2019
1A400021266EDF4000634047,274,Grams,DRYING ROOM #8,12/11/2019 020 LIDI,,12/11/2019
1A400021266EDF4000634048,360,Grams,DRYING ROOM #8,12/11/2019 020 LIDI,,12/11/2019
1A400021266EDF4000634049,258,Grams,DRYING ROOM #8,12/11/2019 020 LIDI,,12/11/2019
1A400021266EDF4000634050,330,Grams,DRYING ROOM #8,12/11/2019 020 LIDI,,12/11/2019
1A400021266EDF4000634052,336,Grams,DRYING ROOM #8,12/11/2019 020 LIDI,,12/11/2019
1A400021266EDF4000634053,344,Grams,DRYING ROOM #8,12/11/2019 020 LIDI,,12/11/2019
1A400021266EDF4000634054,232,Grams,DRYING ROOM #8,12/11/2019 020 LIDI,,12/11/2019
1A400021266EDF4000634056,352,Grams,DRYING ROOM #8,12/11/2019 020 LIDI,,12/11/2019
1A400021266EDF4000634057,294,Grams,DRYING ROOM #8,12/11/2019 020 LIDI,,12/11/2019
1A400021266EDF4000634058,318,Grams,DRYING ROOM #8,12/11/2019 020 LIDI,,12/11/2019
1A400021266EDF4000634060,298,Grams,DRYING ROOM #8,12/11/2019 020 LIDI,,12/11/2019
1A400021266EDF4000634061,166,Grams,DRYING ROOM #8,12/11/2019 020 LIDI,,12/11/2019
1A400021266EDF4000634062,356,Grams,DRYING ROOM #8,12/11/2019 020 LIDI,,12/11/2019
1A400021266EDF4000634063,306,Grams,DRYING ROOM #8,12/11/2019 020 LIDI,,12/11/2019
1A400021266EDF4000634064,288,Grams,DRYING ROOM #8,12/11/2019 020 LIDI,,12/11/2019
1A400021266EDF4000634065,340,Grams,DRYING ROOM #8,12/11/2019 020 LIDI,,12/11/2019
1A400021266EDF4000634066,310,Grams,DRYING ROOM #8,12/11/2019 020 LIDI,,12/11/2019
1A400021266EDF4000634067,304,Grams,DRYING ROOM #8,12/11/2019 020 LIDI,,12/11/2019
1A400021266EDF4000634068,346,Grams,DRYING ROOM #8,12/11/2019 020 LIDI,,12/11/2019
1A400021266EDF4000634072,390,Grams,DRYING ROOM #8,12/11/2019 020 LIDI,,12/11/2019
1A400021266EDF4000634073,352,Grams,DRYING ROOM #8,12/11/2019 020 LIDI,,12/11/2019
1A400021266EDF4000634074,224,Grams,DRYING ROOM #8,12/11/2019 020 LIDI,,12/11/2019
1A400021266EDF4000634075,354,Grams,DRYING ROOM #8,12/11/2019 020 LIDI,,12/11/2019
1A400021266EDF4000634076,268,Grams,DRYING ROOM #8,12/11/2019 020 LIDI,,12/11/2019
1A400021266EDF4000634077,262,Grams,DRYING ROOM #8,12/11/2019 020 LIDI,,12/11/2019
1A400021266EDF4000634078,274,Grams,DRYING ROOM #8,12/11/2019 020 LIDI,,12/11/2019
1A400021266EDF4000634079,390,Grams,DRYING ROOM #8,12/11/2019 020 LIDI,,12/11/2019
1A400021266EDF4000634080,364,Grams,DRYING ROOM #8,12/11/2019 020 LIDI,,12/11/2019
1A400021266EDF4000634081,280,Grams,DRYING ROOM #8,12/11/2019 020 LIDI,,12/11/2019
1A400021266EDF4000634082,382,Grams,DRYING ROOM #8,12/11/2019 020 LIDI,,12/11/2019
1A400021266EDF4000634083,304,Grams,DRYING ROOM #8,12/11/2019 020 LIDI,,12/11/2019
1A400021266EDF4000634085,376,Grams,DRYING ROOM #8,12/11/2019 020 LIDI,,12/11/2019
1A400021266EDF4000634086,352,Grams,DRYING ROOM #8,12/11/2019 020 LIDI,,12/11/2019
1A400021266EDF4000634087,358,Grams,DRYING ROOM #8,12/11/2019 020 LIDI,,12/11/2019
1A400021266EDF4000634088,382,Grams,DRYING ROOM #8,12/11/2019 020 LIDI,,12/11/2019
1A400021266EDF4000634089,392,Grams,DRYING ROOM #8,12/11/2019 020 LIDI,,12/11/2019
1A400021266EDF4000634091,348,Grams,DRYING ROOM #8,12/11/2019 020 LIDI,,12/11/2019
1A400021266EDF4000634092,334,Grams,DRYING ROOM #8,12/11/2019 020 LIDI,,12/11/2019
1A400021266EDF4000634093,264,Grams,DRYING ROOM #8,12/11/2019 020 LIDI,,12/11/2019
1A400021266EDF4000634094,296,Grams,DRYING ROOM #8,12/11/2019 020 LIDI,,12/11/2019
1A400021266EDF4000634095,348,Grams,DRYING ROOM #8,12/11/2019 020 LIDI,,12/11/2019
1A400021266EDF4000634096,308,Grams,DRYING ROOM #8,12/11/2019 020 LIDI,,12/11/2019
1A400021266EDF4000634097,340,Grams,DRYING ROOM #8,12/11/2019 020 LIDI,,12/11/2019
1A400021266EDF4000634098,304,Grams,DRYING ROOM #8,12/11/2019 020 LIDI,,12/11/2019
1A400021266EDF4000634099,222,Grams,DRYING ROOM #8,12/11/2019 020 LIDI,,12/11/2019
1A400021266EDF4000634100,366,Grams,DRYING ROOM #8,12/11/2019 020 LIDI,,12/11/2019
1A400021266EDF4000634101,346,Grams,DRYING ROOM #8,12/11/2019 020 LIDI,,12/11/2019
1A400021266EDF4000634102,250,Grams,DRYING ROOM #8,12/11/2019 020 LIDI,,12/11/2019
1A400021266EDF4000634103,330,Grams,DRYING ROOM #8,12/11/2019 020 LIDI,,12/11/2019
1A400021266EDF4000634104,354,Grams,DRYING ROOM #8,12/11/2019 020 LIDI,,12/11/2019
1A400021266EDF4000634105,308,Grams,DRYING ROOM #8,12/11/2019 020 LIDI,,12/11/2019
1A400021266EDF4000634106,302,Grams,DRYING ROOM #8,12/11/2019 020 LIDI,,12/11/2019
1A400021266EDF4000634107,352,Grams,DRYING ROOM #8,12/11/2019 020 LIDI,,12/11/2019
1A400021266EDF4000634108,338,Grams,DRYING ROOM #8,12/11/2019 020 LIDI,,12/11/2019
1A400021266EDF4000634109,258,Grams,DRYING ROOM #8,12/11/2019 020 LIDI,,12/11/2019
1A400021266EDF4000634110,360,Grams,DRYING ROOM #8,12/11/2019 020 LIDI,,12/11/2019
1A400021266EDF4000634111,184,Grams,DRYING ROOM #8,12/11/2019 020 LIDI,,12/11/2019
1A400021266EDF4000634112,338,Grams,DRYING ROOM #8,12/11/2019 020 LIDI,,12/11/2019
1A400021266EDF4000634113,278,Grams,DRYING ROOM #8,12/11/2019 020 LIDI,,12/11/2019
1A400021266EDF4000634114,324,Grams,DRYING ROOM #8,12/11/2019 020 LIDI,,12/11/2019
1A400021266EDF4000634115,228,Grams,DRYING ROOM #8,12/11/2019 020 LIDI,,12/11/2019
1A400021266EDF4000634116,350,Grams,DRYING ROOM #8,12/11/2019 020 LIDI,,12/11/2019
1A400021266EDF4000634118,268,Grams,DRYING ROOM #8,12/11/2019 020 LIDI,,12/11/2019
1A400021266EDF4000634119,132,Grams,DRYING ROOM #8,12/11/2019 020 LIDI,,12/11/2019
1A400021266EDF4000634120,380,Grams,DRYING ROOM #8,12/11/2019 020 LIDI,,12/11/2019
1A400021266EDF4000634122,286,Grams,DRYING ROOM #8,12/11/2019 020 LIDI,,12/11/2019
1A400021266EDF4000634124,350,Grams,DRYING ROOM #8,12/11/2019 020 LIDI,,12/11/2019
1A400021266EDF4000634125,284,Grams,DRYING ROOM #8,12/11/2019 020 LIDI,,12/11/2019
1A400021266EDF4000634126,362,Grams,DRYING ROOM #8,12/11/2019 020 LIDI,,12/11/2019
1A400021266EDF4000634127,270,Grams,DRYING ROOM #8,12/11/2019 020 LIDI,,12/11/2019
1A400021266EDF4000634128,362,Grams,DRYING ROOM #8,12/11/2019 020 LIDI,,12/11/2019
1A400021266EDF4000634129,348,Grams,DRYING ROOM #8,12/11/2019 020 LIDI,,12/11/2019
1A400021266EDF4000634130,306,Grams,DRYING ROOM #8,12/11/2019 020 LIDI,,12/11/2019
1A400021266EDF4000634143,190,Grams,DRYING ROOM #8,12/11/2019 020 RU,,12/11/2019
1A400021266EDF4000634144,178,Grams,DRYING ROOM #8,12/11/2019 020 RU,,12/11/2019
1A400021266EDF4000634149,262,Grams,DRYING ROOM #8,12/11/2019 020 RU,,12/11/2019
1A400021266EDF4000634152,278,Grams,DRYING ROOM #8,12/11/2019 020 RU,,12/11/2019
1A400021266EDF4000634153,226,Grams,DRYING ROOM #8,12/11/2019 020 RU,,12/11/2019
1A400021266EDF4000634154,264,Grams,DRYING ROOM #8,12/11/2019 020 RU,,12/11/2019
1A400021266EDF4000634156,216,Grams,DRYING ROOM #8,12/11/2019 020 RU,,12/11/2019
1A400021266EDF4000634165,266,Grams,DRYING ROOM #8,12/11/2019 020 RU,,12/11/2019
1A400021266EDF4000634168,248,Grams,DRYING ROOM #8,12/11/2019 020 RU,,12/11/2019
1A400021266EDF4000634169,232,Grams,DRYING ROOM #8,12/11/2019 020 RU,,12/11/2019
1A400021266EDF4000634172,270,Grams,DRYING ROOM #8,12/11/2019 020 RU,,12/11/2019
1A400021266EDF4000634174,284,Grams,DRYING ROOM #8,12/11/2019 020 RU,,12/11/2019
1A400021266EDF4000634175,232,Grams,DRYING ROOM #8,12/11/2019 020 RU,,12/11/2019
1A400021266EDF4000634177,254,Grams,DRYING ROOM #8,12/11/2019 020 RU,,12/11/2019
1A400021266EDF4000634178,246,Grams,DRYING ROOM #8,12/11/2019 020 RU,,12/11/2019
1A400021266EDF4000634181,84,Grams,DRYING ROOM #8,12/11/2019 020 RU,,12/11/2019
1A400021266EDF4000634182,258,Grams,DRYING ROOM #8,12/11/2019 020 RU,,12/11/2019
1A400021266EDF4000634183,246,Grams,DRYING ROOM #8,12/11/2019 020 RU,,12/11/2019
1A400021266EDF4000634184,178,Grams,DRYING ROOM #8,12/11/2019 020 RU,,12/11/2019
1A400021266EDF4000634185,300,Grams,DRYING ROOM #8,12/11/2019 020 RU,,12/11/2019
1A400021266EDF4000634186,256,Grams,DRYING ROOM #8,12/11/2019 020 RU,,12/11/2019
1A400021266EDF4000634188,218,Grams,DRYING ROOM #8,12/11/2019 020 RU,,12/11/2019
1A400021266EDF4000634189,256,Grams,DRYING ROOM #8,12/11/2019 020 RU,,12/11/2019
1A400021266EDF4000634190,284,Grams,DRYING ROOM #8,12/11/2019 020 RU,,12/11/2019
1A400021266EDF4000634191,282,Grams,DRYING ROOM #8,12/11/2019 020 RU,,12/11/2019
1A400021266EDF4000634192,264,Grams,DRYING ROOM #8,12/11/2019 020 RU,,12/11/2019
1A400021266EDF4000634193,100,Grams,DRYING ROOM #8,12/11/2019 020 RU,,12/11/2019
1A400021266EDF4000634194,232,Grams,DRYING ROOM #8,12/11/2019 020 RU,,12/11/2019
1A400021266EDF4000634195,236,Grams,DRYING ROOM #8,12/11/2019 020 RU,,12/11/2019
1A400021266EDF4000634196,278,Grams,DRYING ROOM #8,12/11/2019 020 RU,,12/11/2019
1A400021266EDF4000634197,112,Grams,DRYING ROOM #8,12/11/2019 020 RU,,12/11/2019
1A400021266EDF4000634198,302,Grams,DRYING ROOM #8,12/11/2019 020 RU,,12/11/2019
1A400021266EDF4000634199,216,Grams,DRYING ROOM #8,12/11/2019 020 RU,,12/11/2019
1A400021266EDF4000634200,274,Grams,DRYING ROOM #8,12/11/2019 020 RU,,12/11/2019
1A400021266EDF4000634201,166,Grams,DRYING ROOM #8,12/11/2019 020 RU,,12/11/2019
1A400021266EDF4000634202,166,Grams,DRYING ROOM #8,12/11/2019 020 RU,,12/11/2019
1A400021266EDF4000634203,246,Grams,DRYING ROOM #8,12/11/2019 020 RU,,12/11/2019
1A400021266EDF4000634204,376,Grams,DRYING ROOM #8,12/11/2019 020 RU,,12/11/2019
1A400021266EDF4000634205,296,Grams,DRYING ROOM #8,12/11/2019 020 RU,,12/11/2019
1A400021266EDF4000634206,150,Grams,DRYING ROOM #8,12/11/2019 020 RU,,12/11/2019
1A400021266EDF4000634207,84,Grams,DRYING ROOM #8,12/11/2019 020 RU,,12/11/2019
1A400021266EDF4000634208,218,Grams,DRYING ROOM #8,12/11/2019 020 RU,,12/11/2019
1A400021266EDF4000634209,124,Grams,DRYING ROOM #8,12/11/2019 020 RU,,12/11/2019
1A400021266EDF4000634210,74,Grams,DRYING ROOM #8,12/11/2019 020 RU,,12/11/2019
1A400021266EDF4000634211,290,Grams,DRYING ROOM #8,12/11/2019 020 RU,,12/11/2019
1A400021266EDF4000634212,290,Grams,DRYING ROOM #8,12/11/2019 020 RU,,12/11/2019
1A400021266EDF4000634213,302,Grams,DRYING ROOM #8,12/11/2019 020 RU,,12/11/2019
1A400021266EDF4000634215,192,Grams,DRYING ROOM #8,12/11/2019 020 RU,,12/11/2019
1A400021266EDF4000634216,250,Grams,DRYING ROOM #8,12/11/2019 020 RU,,12/11/2019
1A400021266EDF4000634217,266,Grams,DRYING ROOM #8,12/11/2019 020 RU,,12/11/2019
1A400021266EDF4000634218,270,Grams,DRYING ROOM #8,12/11/2019 020 RU,,12/11/2019
1A400021266EDF4000634219,306,Grams,DRYING ROOM #8,12/11/2019 020 RU,,12/11/2019
1A400021266EDF4000634220,150,Grams,DRYING ROOM #8,12/11/2019 020 RU,,12/11/2019
1A400021266EDF4000634222,328,Grams,DRYING ROOM #8,12/11/2019 020 RU,,12/11/2019
1A400021266EDF4000634224,208,Grams,DRYING ROOM #8,12/11/2019 020 RU,,12/11/2019
1A400021266EDF4000634225,174,Grams,DRYING ROOM #8,12/11/2019 020 RU,,12/11/2019
1A400021266EDF4000634226,110,Grams,DRYING ROOM #8,12/11/2019 020 RU,,12/11/2019
1A400021266EDF4000634227,234,Grams,DRYING ROOM #8,12/11/2019 020 RU,,12/11/2019
1A400021266EDF4000634228,160,Grams,DRYING ROOM #8,12/11/2019 020 RU,,12/11/2019
1A400021266EDF4000634230,146,Grams,DRYING ROOM #8,12/11/2019 020 RU,,12/11/2019
1A400021266EDF4000634233,168,Grams,DRYING ROOM #8,12/11/2019 020 HY,,12/11/2019
1A400021266EDF4000634236,346,Grams,DRYING ROOM #8,12/11/2019 020 HY,,12/11/2019
1A400021266EDF4000634240,280,Grams,DRYING ROOM #8,12/11/2019 020 HY,,12/11/2019
1A400021266EDF4000634241,278,Grams,DRYING ROOM #8,12/11/2019 020 HY,,12/11/2019
1A400021266EDF4000634242,364,Grams,DRYING ROOM #8,12/11/2019 020 HY,,12/11/2019
1A400021266EDF4000634243,352,Grams,DRYING ROOM #8,12/11/2019 020 HY,,12/11/2019
1A400021266EDF4000634246,154,Grams,DRYING ROOM #8,12/11/2019 020 HY,,12/11/2019
1A400021266EDF4000634247,240,Grams,DRYING ROOM #8,12/11/2019 020 HY,,12/11/2019
1A400021266EDF4000634249,68,Grams,DRYING ROOM #8,12/11/2019 020 HY,,12/11/2019
1A400021266EDF4000634251,378,Grams,DRYING ROOM #8,12/11/2019 020 HY,,12/11/2019
1A400021266EDF4000634253,284,Grams,DRYING ROOM #8,12/11/2019 020 HY,,12/11/2019
1A400021266EDF4000634254,190,Grams,DRYING ROOM #8,12/11/2019 020 HY,,12/11/2019
1A400021266EDF4000634255,366,Grams,DRYING ROOM #8,12/11/2019 020 HY,,12/11/2019
1A400021266EDF4000634256,354,Grams,DRYING ROOM #8,12/11/2019 020 HY,,12/11/2019
1A400021266EDF4000634257,400,Grams,DRYING ROOM #8,12/11/2019 020 HY,,12/11/2019
