[
    "Veg A-1- MOMS",
    "Veg A-2- MOMS",
    "Veg A-3- MOMS",
    "Veg A-4- MOMS",
    "Veg A-5- MOMS",
    "Veg A-6- MOMS",
    "Veg A-7- MOMS",
    "Veg A-8- MOMS",
    "Veg B-1- MOMS",
    "Veg B-2- MOMS",
    "Veg B-3- MOMS",
    "Veg B-4- MOMS",
    "Veg B-5- MOMS",
    "Veg B-6- MOMS",
    "Veg B-7- MOMS",
    "Veg B-8- MOMS",
    "Veg C-1- MOMS",
    "Veg C-2- MOMS",
    "Veg C-3- MOMS",
    "Veg C-4- MOMS",
    "Veg C-5- MOMS",
    "Veg C-6- MOMS",
    "Veg C-7- MOMS",
    "Veg C-8- MOMS",
    "Veg D-1- MOMS",
    "Veg D-2- MOMS",
    "Veg D-3- MOMS",
    "Veg D-4- MOMS",
    "Veg D-5- MOMS",
    "Veg D-6- MOMS",
    "Veg D-7- MOMS",
    "Veg D-8- MOMS",
    "Veg E-1",
    "Veg E-2",
    "Veg E-3",
    "Veg E-4",
    "Veg E-5",
    "Veg E-6",
    "Veg E-7",
    "Veg E-8",
    "Veg F-1",
    "Veg F-2",
    "Veg F-3",
    "Veg F-4",
    "Veg F-5",
    "Veg F-6",
    "Veg F-7",
    "Veg F-8",
    "Veg G-3",
    "Veg G-4",
    "Veg G-5",
    "Veg G-6",
    "Veg G-7",
    "Veg G-8",
    "Veg A-9",
    "Veg A-10",
    "Veg A-11",
    "Veg A-12",
    "Veg A-13",
    "Veg A-14",
    "Veg A-15",
    "Veg B-9",
    "Veg B-10",
    "Veg B-11",
    "Veg B-12",
    "Veg B-13",
    "Veg B-14",
    "Veg B-15",
    "Veg C-9",
    "Veg C-10",
    "Veg C-11",
    "Veg C-12",
    "Veg C-13",
    "Veg C-14",
    "Veg C-15",
    "Veg D-9",
    "Veg D-10",
    "Veg D-11",
    "Veg D-12",
    "Veg D-13",
    "Veg D-14",
    "Veg D-15",
    "Veg E-9",
    "Veg E-10",
    "Veg E-11",
    "Veg E-12",
    "Veg E-13",
    "Veg E-14",
    "Veg E-15",
    "Veg F-9",
    "Veg F-10",
    "Veg F-11",
    "Veg F-12",
    "Veg F-13",
    "Veg F-14",
    "Veg F-15",
    "Veg G-9",
    "Veg G-10",
    "Veg G-11",
    "Veg G-12",
    "Veg G-13",
    "Veg G-14",
    "Veg G-15",
    "Flower H-4",
    "Flower H-5",
    "Flower H-6",
    "Flower H-7",
    "Flower H-8",
    "Flower I-4",
    "Flower I-5",
    "Flower I-6",
    "Flower I-7",
    "Flower I-8",
    "Flower J-4",
    "Flower J-5",
    "Flower J-6",
    "Flower J-7",
    "Flower J-8",
    "Flower K-4",
    "Flower K-5",
    "Flower K-6",
    "Flower K-7",
    "Flower K-8",
    "Flower L-4",
    "Flower L-5",
    "Flower L-6",
    "Flower L-7",
    "Flower L-8",
    "Flower M-4",
    "Flower M-5",
    "Flower M-6",
    "Flower M-7",
    "Flower M-8",
    "Flower N-4",
    "Flower N-5",
    "Flower N-6",
    "Flower N-7",
    "Flower N-8",
    "Flower O-4",
    "Flower O-5",
    "Flower O-6",
    "Flower O-7",
    "Flower O-8",
    "Flower P-4",
    "Flower P-5",
    "Flower P-6",
    "Flower P-7",
    "Flower P-8",
    "Flower Q-4",
    "Flower Q-5",
    "Flower Q-6",
    "Flower Q-7",
    "Flower Q-8",
    "Flower R-4",
    "Flower R-5",
    "Flower R-6",
    "Flower R-7",
    "Flower R-8",
    "Flower S-5",
    "Flower S-6",
    "Flower S-7",
    "Flower S-8",
    "Flower H-9",
    "Flower H-10",
    "Flower H-11",
    "Flower H-12",
    "Flower H-13",
    "Flower H-14",
    "Flower H-15",
    "Flower I-9",
    "Flower I-10",
    "Flower I-11",
    "Flower I-12",
    "Flower I-13",
    "Flower I-14",
    "Flower I-15",
    "Flower J-9",
    "Flower J-10",
    "Flower J-11",
    "Flower J-12",
    "Flower J-13",
    "Flower J-14",
    "Flower J-15",
    "Flower K-9",
    "Flower K-10",
    "Flower K-11",
    "Flower K-12",
    "Flower K-13",
    "Flower K-14",
    "Flower K-15",
    "Flower L-9",
    "Flower L-10",
    "Flower L-11",
    "Flower L-12",
    "Flower L-13",
    "Flower L-14",
    "Flower L-15",
    "Flower M-9",
    "Flower M-10",
    "Flower M-11",
    "Flower M-12",
    "Flower M-13",
    "Flower M-14",
    "Flower M-15",
    "Flower N-9",
    "Flower N-10",
    "Flower N-11",
    "Flower N-12",
    "Flower N-13",
    "Flower N-14",
    "Flower N-15",
    "Flower O-9",
    "Flower O-10",
    "Flower O-11",
    "Flower O-12",
    "Flower O-13",
    "Flower O-14",
    "Flower O-15",
    "Flower P-9",
    "Flower P-10",
    "Flower P-11",
    "Flower P-12",
    "Flower P-13",
    "Flower P-14",
    "Flower P-15",
    "Flower Q-9",
    "Flower Q-10",
    "Flower Q-11",
    "Flower Q-12",
    "Flower Q-13",
    "Flower Q-14",
    "Flower Q-15",
    "Flower R-9",
    "Flower R-10",
    "Flower R-11",
    "Flower R-12",
    "Flower R-13",
    "Flower R-14",
    "Flower R-15",
    "Flower S-9",
    "Flower S-10",
    "Flower S-11",
    "Flower S-12",
    "Flower S-13",
    "Flower S-14",
    "Flower S-15",
    "Flower A-16",
    "Flower A-17",
    "Flower A-18",
    "Flower A-19",
    "Flower A-20",
    "Flower A-21",
    "Flower A-22",
    "Flower B-16",
    "Flower B-17",
    "Flower B-18",
    "Flower B-19",
    "Flower B-20",
    "Flower B-21",
    "Flower B-22",
    "Flower C-16",
    "Flower C-17",
    "Flower C-18",
    "Flower C-19",
    "Flower C-20",
    "Flower C-21",
    "Flower C-22",
    "Flower D-16",
    "Flower D-17",
    "Flower D-18",
    "Flower D-19",
    "Flower D-20",
    "Flower D-21",
    "Flower D-22",
    "Flower E-16",
    "Flower E-17",
    "Flower E-18",
    "Flower E-19",
    "Flower E-20",
    "Flower E-21",
    "Flower E-22",
    "Flower F-16",
    "Flower F-17",
    "Flower F-18",
    "Flower F-19",
    "Flower F-20",
    "Flower F-21",
    "Flower F-22",
    "Flower G-16",
    "Flower G-17",
    "Flower G-18",
    "Flower G-19",
    "Flower G-20",
    "Flower G-21",
    "Flower G-22",
    "Flower H-16",
    "Flower H-17",
    "Flower H-18",
    "Flower H-19",
    "Flower H-20",
    "Flower H-21",
    "Flower H-22",
    "Flower I-16",
    "Flower I-17",
    "Flower I-18",
    "Flower I-19",
    "Flower I-20",
    "Flower I-21",
    "Flower I-22",
    "Flower J-16",
    "Flower J-17",
    "Flower J-18",
    "Flower J-19",
    "Flower J-20",
    "Flower J-21",
    "Flower J-22",
    "Flower K-16",
    "Flower K-17",
    "Flower K-18",
    "Flower K-19",
    "Flower K-20",
    "Flower K-21",
    "Flower K-22",
    "Flower L-16",
    "Flower L-17",
    "Flower L-18",
    "Flower L-19",
    "Flower L-20",
    "Flower L-21",
    "Flower L-22",
    "Flower M-16",
    "Flower M-17",
    "Flower M-18",
    "Flower M-19",
    "Flower M-20",
    "Flower M-21",
    "Flower M-22",
    "Flower N-16",
    "Flower N-17",
    "Flower N-18",
    "Flower N-19",
    "Flower N-20",
    "Flower N-21",
    "Flower N-22",
    "Flower O-16",
    "Flower O-17",
    "Flower O-18",
    "Flower O-19",
    "Flower O-20",
    "Flower O-21",
    "Flower O-22",
    "Flower P-16",
    "Flower P-17",
    "Flower P-18",
    "Flower P-19",
    "Flower P-20",
    "Flower P-21",
    "Flower P-22",
    "Flower Q-16",
    "Flower Q-17",
    "Flower Q-18",
    "Flower Q-19",
    "Flower Q-20",
    "Flower Q-21",
    "Flower Q-22",
    "Flower R-16",
    "Flower R-17",
    "Flower R-18",
    "Flower R-19",
    "Flower R-20",
    "Flower R-21",
    "Flower R-22",
    "Flower S-16",
    "Flower S-17",
    "Flower S-18",
    "Flower S-19",
    "Flower S-20",
    "Flower S-21",
    "Flower S-22",
    "Flower A-23",
    "Flower A-24",
    "Flower A-25",
    "Flower A-26",
    "Flower A-27",
    "Flower A-28",
    "Flower A-29",
    "Flower B-23",
    "Flower B-24",
    "Flower B-25",
    "Flower B-26",
    "Flower B-27",
    "Flower B-28",
    "Flower C-23",
    "Flower C-24",
    "Flower C-25",
    "Flower C-26",
    "Flower C-27",
    "Flower C-28",
    "Flower D-23",
    "Flower D-24",
    "Flower D-25",
    "Flower D-26",
    "Flower D-27",
    "Flower D-28",
    "Flower E-23",
    "Flower E-24",
    "Flower E-25",
    "Flower E-26",
    "Flower E-27",
    "Flower E-28",
    "Flower F-23",
    "Flower F-24",
    "Flower F-25",
    "Flower F-26",
    "Flower F-27",
    "Flower F-28",
    "Flower G-23",
    "Flower G-24",
    "Flower G-25",
    "Flower G-26",
    "Flower G-27",
    "Flower G-28",
    "Flower H-23",
    "Flower H-24",
    "Flower H-25",
    "Flower H-26",
    "Flower H-27",
    "Flower H-28",
    "Flower I-23",
    "Flower I-24",
    "Flower I-25",
    "Flower I-26",
    "Flower I-27",
    "Flower I-28",
    "Flower J-23",
    "Flower J-24",
    "Flower J-25",
    "Flower J-26",
    "Flower J-27",
    "Flower J-28",
    "Flower K-23",
    "Flower K-24",
    "Flower K-25",
    "Flower K-26",
    "Flower K-27",
    "Flower K-28",
    "Flower L-23",
    "Flower L-24",
    "Flower L-25",
    "Flower L-26",
    "Flower L-27",
    "Flower L-28",
    "Flower M-23",
    "Flower M-24",
    "Flower M-25",
    "Flower M-26",
    "Flower M-27",
    "Flower M-28",
    "Flower N-23",
    "Flower N-24",
    "Flower N-25",
    "Flower N-26",
    "Flower N-27",
    "Flower N-28",
    "Flower O-23",
    "Flower O-24",
    "Flower O-25",
    "Flower O-26",
    "Flower O-27",
    "Flower O-28",
    "Flower P-23",
    "Flower P-24",
    "Flower P-25",
    "Flower P-26",
    "Flower P-27",
    "Flower P-28",
    "Flower Q-23",
    "Flower Q-24",
    "Flower Q-25",
    "Flower Q-26",
    "Flower Q-27",
    "Flower Q-28",
    "Flower R-23",
    "Flower R-24",
    "Flower R-25",
    "Flower R-26",
    "Flower R-27",
    "Flower R-28",
    "Flower S-23",
    "Flower S-24",
    "Flower S-25",
    "Flower S-26",
    "Flower S-27",
    "Flower S-28"
]