1A400021266EDF4000632221,366,Grams,DRYING ROOM #7,12/04/2019 020 SE,,12/4/2019
1A400021266EDF4000632225,410,Grams,DRYING ROOM #7,12/04/2019 020 SE,,12/4/2019
1A400021266EDF4000632226,368,Grams,DRYING ROOM #7,12/04/2019 020 SE,,12/4/2019
1A400021266EDF4000632230,394,Grams,DRYING ROOM #7,12/04/2019 020 SE,,12/4/2019
