{
    "1.H.1": "15",
    "1.H.2": "15",
    "1.I.1": "14",
    "1.I.2": "15",
    "1.J.1": "15",
    "1.J.2": "15",
    "1.K.1": "15",
    "1.K.2": "15",
    "1.L.1": "14",
    "1.L.2": "15",
    "1.L.3": "15",
    "1.L.4": "15",
    "1.L.5": "15",
    "1.M.1": "14",
    "1.M.2": "15",
    "1.M.3": "15",
    "1.M.4": "15",
    "1.M.5": "15",
    "1.N.1": "15",
    "1.N.2": "15",
    "1.N.3": "15",
    "1.N.4": "15",
    "1.N.5": "15",
    "1.O.1": "14",
    "1.O.2": "15",
    "1.O.3": "15",
    "1.O.4": "15",
    "1.O.5": "15",
    "1.P.1": "14",
    "1.P.2": "15",
    "1.P.3": "15",
    "1.P.4": "15",
    "1.P.5": "15",
    "1.Q.1": "11",
    "1.Q.2": "12",
    "1.Q.3": "12",
    "1.Q.4": "12",
    "1.Q.5": "12",
    "1.R.1": "12",
    "1.R.2": "12",
    "1.R.3": "12",
    "1.R.4": "12",
    "1.R.5": "12",
    "1.S.1": "11",
    "1.S.2": "12",
    "1.S.3": "12",
    "1.S.4": "12",
    "1.S.5": "12",
    "2.H.1": "21",
    "2.H.2": "21",
    "2.I.1": "21",
    "2.I.2": "21",
    "2.J.1": "20",
    "2.J.2": "21",
    "2.K.1": "21",
    "2.K.2": "21",
    "2.L.1": "20",
    "2.L.2": "21",
    "2.L.3": "21",
    "2.L.4": "21",
    "2.L.5": "21",
    "2.M.1": "21",
    "2.M.2": "21",
    "2.M.3": "21",
    "2.M.4": "21",
    "2.M.5": "21",
    "2.N.1": "20",
    "2.N.2": "21",
    "2.N.3": "21",
    "2.N.4": "21",
    "2.N.5": "21",
    "2.O.1": "21",
    "2.O.2": "21",
    "2.O.3": "21",
    "2.O.4": "21",
    "2.O.5": "21",
    "2.P.1": "20",
    "2.P.2": "21",
    "2.P.3": "21",
    "2.P.4": "21",
    "2.P.5": "21",
    "2.Q.1": "21",
    "2.Q.2": "21",
    "2.Q.3": "21",
    "2.Q.4": "21",
    "2.Q.5": "21",
    "2.R.1": "20",
    "2.R.2": "21",
    "2.R.3": "21",
    "2.R.4": "21",
    "2.R.5": "21",
    "2.S.1": "20",
    "2.S.2": "21",
    "2.S.3": "21",
    "2.S.4": "21",
    "2.S.5": "21",
    "3.A.1": "20",
    "3.A.2": "21",
    "3.A.3": "21",
    "3.A.4": "21",
    "3.B.1": "21",
    "3.B.2": "21",
    "3.B.3": "21",
    "3.B.4": "21",
    "3.C.1": "20",
    "3.C.2": "21",
    "3.C.3": "21",
    "3.C.4": "21",
    "3.D.1": "21",
    "3.D.2": "21",
    "3.D.3": "21",
    "3.D.4": "21",
    "3.E.1": "20",
    "3.E.2": "21",
    "3.E.3": "21",
    "3.E.4": "21",
    "3.F.1": "21",
    "3.F.2": "21",
    "3.F.3": "21",
    "3.F.4": "21",
    "3.G.1": "20",
    "3.G.2": "21",
    "3.G.3": "21",
    "3.G.4": "21",
    "3.H.1": "21",
    "3.H.2": "21",
    "3.I.1": "20",
    "3.I.2": "21",
    "3.J.1": "21",
    "3.J.2": "21",
    "3.K.1": "21",
    "3.K.2": "21",
    "3.L.1": "20",
    "3.L.2": "21",
    "3.L.3": "21",
    "3.L.4": "21",
    "3.L.5": "21",
    "3.M.1": "20",
    "3.M.2": "21",
    "3.M.3": "21",
    "3.M.4": "21",
    "3.M.5": "21",
    "3.N.1": "21",
    "3.N.2": "21",
    "3.N.3": "21",
    "3.N.4": "21",
    "3.N.5": "21",
    "3.O.1": "20",
    "3.O.2": "21",
    "3.O.3": "21",
    "3.O.4": "21",
    "3.O.5": "21",
    "3.P.1": "21",
    "3.P.2": "21",
    "3.P.3": "21",
    "3.P.4": "21",
    "3.P.5": "21",
    "3.Q.1": "20",
    "3.Q.2": "21",
    "3.Q.3": "21",
    "3.Q.4": "21",
    "3.Q.5": "21",
    "3.R.1": "21",
    "3.R.2": "21",
    "3.R.3": "21",
    "3.R.4": "21",
    "3.R.5": "21",
    "3.S.1": "20",
    "3.S.2": "21",
    "3.S.3": "21",
    "3.S.4": "21",
    "3.S.5": "21",
    "4.A.1": "18",
    "4.A.2": "18",
    "4.A.3": "18",
    "4.A.4": "18",
    "4.B.1": "17",
    "4.B.2": "18",
    "4.B.3": "18",
    "4.B.4": "18",
    "4.C.1": "18",
    "4.C.2": "18",
    "4.C.3": "18",
    "4.C.4": "18",
    "4.D.1": "17",
    "4.D.2": "18",
    "4.D.3": "18",
    "4.D.4": "18",
    "4.E.1": "18",
    "4.E.2": "18",
    "4.E.3": "18",
    "4.E.4": "18",
    "4.F.1": "17",
    "4.F.2": "18",
    "4.F.3": "18",
    "4.F.4": "18",
    "4.G.1": "17",
    "4.G.2": "18",
    "4.G.3": "18",
    "4.G.4": "18",
    "4.H.1": "18",
    "4.H.2": "18",
    "4.I.1": "18",
    "4.I.2": "18",
    "4.J.1": "17",
    "4.J.2": "18",
    "4.K.1": "18",
    "4.K.2": "18",
    "4.L.1": "17",
    "4.L.2": "18",
    "4.L.3": "18",
    "4.L.4": "18",
    "4.L.5": "18",
    "4.M.1": "18",
    "4.M.2": "18",
    "4.M.3": "18",
    "4.M.4": "18",
    "4.M.5": "18",
    "4.N.1": "17",
    "4.N.2": "18",
    "4.N.3": "18",
    "4.N.4": "18",
    "4.N.5": "18",
    "4.O.1": "18",
    "4.O.2": "18",
    "4.O.3": "18",
    "4.O.4": "18",
    "4.O.5": "18",
    "4.P.1": "17",
    "4.P.2": "18",
    "4.P.3": "18",
    "4.P.4": "18",
    "4.P.5": "18",
    "4.Q.1": "17",
    "4.Q.2": "18",
    "4.Q.3": "18",
    "4.Q.4": "18",
    "4.Q.5": "18",
    "4.R.1": "18",
    "4.R.2": "18",
    "4.R.3": "18",
    "4.R.4": "18",
    "4.R.5": "18",
    "4.S.1": "17",
    "4.S.2": "18",
    "4.S.3": "18",
    "4.S.4": "18",
    "4.S.5": "18"
}
