module gitlab.com/carp-suite/plugins/carpdriver

go 1.19

require (
	github.com/google/flatbuffers v23.3.3+incompatible
	github.com/google/uuid v1.3.0
	github.com/stretchr/testify v1.8.2
	github.com/wapc/wapc-guest-tinygo v0.3.3
	google.golang.org/grpc v1.54.0
	google.golang.org/protobuf v1.28.1
)

require (
	github.com/davecgh/go-spew v1.1.1 // indirect
	github.com/golang/protobuf v1.5.2 // indirect
	github.com/pmezard/go-difflib v1.0.0 // indirect
	golang.org/x/net v0.8.0 // indirect
	golang.org/x/sys v0.6.0 // indirect
	golang.org/x/text v0.8.0 // indirect
	google.golang.org/genproto v0.0.0-20230110181048-76db0878b65f // indirect
	gopkg.in/yaml.v3 v3.0.1 // indirect
)
