{
    "petition-open":[
        "America.US",
        "America.BO",
        "America.BR",
        "America.CA",
        "America.CL",
        "America.CR",
        "America.CU",
        "America.DO",
        "America.EC",
        "America.GT",
        "America.HN",
        "America.MX",
        "America.NI",
        "America.PA",
        "Europe.FI",
        "Europe.FR",
        "Europe.DE",
        "Europe.GR",
        "Europe.IE",
        "Europe.PT",
        "Europe.RU",
        "Europe.ES",
        "Europe.UA",
        "Europe.UK",
        "Oceania.AU",
        "Oceania.TL",
        "Asia.AF",
        "Asia.BD",
        "Asia.KH",
        "Asia.IN",
        "Asia.IR",
        "Asia.MV",
        "Asia.VN",
        "Asia.IL",
        "Asia.TR",
        "Africa.AO",
        "Africa.DZ",
        "Africa.EG",
        "Africa.MZ",
        "Africa.NG",
        "Africa.CV",
        "Africa.GQ",
        "Africa.GW",
        "Africa.ST"
    ],

    "Europe": {
        "AD": {
            "name": "Andorra",
            "native": "Andorra",
            "countryCode": "AD",
            "continent": "EU",
            "region": "Europe",
            "petitionUrl": "",
            "signees": 0
        },
        "AL": {
            "name": "Albania",
            "native": "Shqipëria",
            "countryCode": "AL",
            "continent": "EU",
            "region": "Europe",
            "petitionUrl": "",
            "signees": 0
        },
        "AT": {
            "name": "Austria",
            "native": "Österreich",
            "countryCode": "AT",
            "continent": "EU",
            "region": "Europe",
            "petitionUrl": "",
            "signees": 0
        },
        "AX": {
            "name": "Åland",
            "native": "Åland",
            "countryCode": "AX",
            "continent": "EU",
            "region": "Europe",
            "petitionUrl": "",
            "signees": 0
        },
        "BA": {
            "name": "Bosnia and Herzegovina",
            "native": "Bosna i Hercegovina",
            "countryCode": "BA",
            "continent": "EU",
            "region": "Europe",
            "petitionUrl": "",
            "signees": 0
        },
        "BE": {
            "name": "Belgium",
            "native": "België",
            "countryCode": "BE",
            "continent": "EU",
            "region": "Europe",
            "petitionUrl": "",
            "signees": 0
        },
        "BG": {
            "name": "Bulgaria",
            "native": "България",
            "countryCode": "BG",
            "continent": "EU",
            "region": "Europe",
            "petitionUrl": "",
            "signees": 0
        },
        "BY": {
            "name": "Belarus",
            "native": "Белару́сь",
            "countryCode": "BY",
            "continent": "EU",
            "region": "Europe",
            "petitionUrl": "",
            "signees": 0
        },
        "CH": {
            "name": "Switzerland",
            "native": "Schweiz",
            "countryCode": "CH",
            "continent": "EU",
            "region": "Europe",
            "petitionUrl": "",
            "signees": 0
        },
        "CY": {
            "name": "Cyprus",
            "native": "Κύπρος",
            "countryCode": "CY",
            "continent": "EU",
            "region": "Europe",
            "petitionUrl": "",
            "signees": 0
        },
        "CZ": {
            "name": "Czech Republic",
            "native": "Česká republika",
            "countryCode": "CZ",
            "continent": "EU",
            "region": "Europe",
            "petitionUrl": "",
            "signees": 0
        },
        "DE": {
            "name": "Germany",
            "native": "Deutschland",
            "countryCode": "DE",
            "continent": "EU",
            "region": "Europe",
            "petitionUrl": "https://chng.it/vNN6mtXm5z",
            "signees": 5
        },
        "DK": {
            "name": "Denmark",
            "native": "Danmark",
            "countryCode": "DK",
            "continent": "EU",
            "region": "Europe",
            "petitionUrl": "",
            "signees": 0
        },
        "EE": {
            "name": "Estonia",
            "native": "Eesti",
            "countryCode": "EE",
            "continent": "EU",
            "region": "Europe",
            "petitionUrl": "",
            "signees": 0
        },
        "ES": {
            "name": "Spain",
            "native": "España",
            "countryCode": "ES",
            "continent": "EU",
            "region": "Europe",
            "petitionUrl": "https://chng.it/mgvr8rfC52",
            "signees": 63
        },
        "FI": {
            "name": "Finland",
            "native": "Suomi",
            "countryCode": "FI",
            "continent": "EU",
            "region": "Europe",
            "petitionUrl": "https://chng.it/DPkZjsJdjB",
            "signees": 268
        },
        "FO": {
            "name": "Faroe Islands",
            "native": "Føroyar",
            "countryCode": "FO",
            "continent": "EU",
            "region": "Europe",
            "petitionUrl": "",
            "signees": 0
        },
        "FR": {
            "name": "France",
            "native": "France",
            "countryCode": "FR",
            "continent": "EU",
            "region": "Europe",
            "petitionUrl": "https://chng.it/X5LSQnwWpm",
            "signees": 24
        },
        "GB": {
            "name": "United Kingdom",
            "native": "United Kingdom",
            "countryCode": "GB",
            "continent": "EU",
            "region": "Europe",
            "petitionUrl": "https://chng.it/TRC6TjVpyn",
            "signees": 44
        },
        "GG": {
            "name": "Guernsey",
            "native": "Guernsey",
            "countryCode": "GG",
            "continent": "EU",
            "region": "Europe",
            "petitionUrl": "",
            "signees": 0
        },
        "GI": {
            "name": "Gibraltar",
            "native": "Gibraltar",
            "countryCode": "GI",
            "continent": "EU",
            "region": "Europe",
            "petitionUrl": "",
            "signees": 0
        },
        "GR": {
            "name": "Greece",
            "native": "Ελλάδα",
            "countryCode": "GR",
            "continent": "EU",
            "region": "Europe",
            "petitionUrl": "https://chng.it/p92Tdnk2SK",
            "signees": 78
        },
        "HR": {
            "name": "Croatia",
            "native": "Hrvatska",
            "countryCode": "HR",
            "continent": "EU",
            "region": "Europe",
            "petitionUrl": "",
            "signees": 0
        },
        "HU": {
            "name": "Hungary",
            "native": "Magyarország",
            "countryCode": "HU",
            "continent": "EU",
            "region": "Europe",
            "petitionUrl": "",
            "signees": 0
        },
        "IE": {
            "name": "Ireland",
            "native": "Éire",
            "countryCode": "IE",
            "continent": "EU",
            "region": "Europe",
            "petitionUrl": "https://chng.it/hfT62Gx62Z",
            "signees": 24
        },
        "IM": {
            "name": "Isle of Man",
            "native": "Isle of Man",
            "countryCode": "IM",
            "continent": "EU",
            "region": "Europe",
            "petitionUrl": "",
            "signees": 0
        },
        "IS": {
            "name": "Iceland",
            "native": "Ísland",
            "countryCode": "IS",
            "continent": "EU",
            "region": "Europe",
            "petitionUrl": "",
            "signees": 0
        },
        "IT": {
            "name": "Italy",
            "native": "Italia",
            "countryCode": "IT",
            "continent": "EU",
            "region": "Europe",
            "petitionUrl": "",
            "signees": 0
        },
        "JE": {
            "name": "Jersey",
            "native": "Jersey",
            "countryCode": "JE",
            "continent": "EU",
            "region": "Europe",
            "petitionUrl": "",
            "signees": 0
        },
        "LI": {
            "name": "Liechtenstein",
            "native": "Liechtenstein",
            "countryCode": "LI",
            "continent": "EU",
            "region": "Europe",
            "petitionUrl": "",
            "signees": 0
        },
        "LT": {
            "name": "Lithuania",
            "native": "Lietuva",
            "countryCode": "LT",
            "continent": "EU",
            "region": "Europe",
            "petitionUrl": "",
            "signees": 0
        },
        "LU": {
            "name": "Luxembourg",
            "native": "Luxembourg",
            "countryCode": "LU",
            "continent": "EU",
            "region": "Europe",
            "petitionUrl": "",
            "signees": 0
        },
        "LV": {
            "name": "Latvia",
            "native": "Latvija",
            "countryCode": "LV",
            "continent": "EU",
            "region": "Europe",
            "petitionUrl": "",
            "signees": 0
        },
        "MC": {
            "name": "Monaco",
            "native": "Monaco",
            "countryCode": "MC",
            "continent": "EU",
            "region": "Europe",
            "petitionUrl": "",
            "signees": 0
        },
        "MD": {
            "name": "Moldova",
            "native": "Moldova",
            "countryCode": "MD",
            "continent": "EU",
            "region": "Europe",
            "petitionUrl": "",
            "signees": 0
        },
        "ME": {
            "name": "Montenegro",
            "native": "Црна Гора",
            "countryCode": "ME",
            "continent": "EU",
            "region": "Europe",
            "petitionUrl": "",
            "signees": 0
        },
        "MK": {
            "name": "North Macedonia",
            "native": "Северна Македонија",
            "countryCode": "MK",
            "continent": "EU",
            "region": "Europe",
            "petitionUrl": "",
            "signees": 0
        },
        "MT": {
            "name": "Malta",
            "native": "Malta",
            "countryCode": "MT",
            "continent": "EU",
            "region": "Europe",
            "petitionUrl": "",
            "signees": 0
        },
        "NL": {
            "name": "Netherlands",
            "native": "Nederland",
            "countryCode": "NL",
            "continent": "EU",
            "region": "Europe",
            "petitionUrl": "",
            "signees": 0
        },
        "NO": {
            "name": "Norway",
            "native": "Norge",
            "countryCode": "NO",
            "continent": "EU",
            "region": "Europe",
            "petitionUrl": "",
            "signees": 0
        },
        "PL": {
            "name": "Poland",
            "native": "Polska",
            "countryCode": "PL",
            "continent": "EU",
            "region": "Europe",
            "petitionUrl": "",
            "signees": 0
        },
        "PT": {
            "name": "Portugal",
            "native": "Portugal",
            "countryCode": "PT",
            "continent": "EU",
            "region": "Europe",
            "petitionUrl": "",
            "signees": 0
        },
        "RO": {
            "name": "Romania",
            "native": "România",
            "countryCode": "RO",
            "continent": "EU",
            "region": "Europe",
            "petitionUrl": "",
            "signees": 0
        },
        "RS": {
            "name": "Serbia",
            "native": "Србија",
            "countryCode": "RS",
            "continent": "EU",
            "region": "Europe",
            "petitionUrl": "",
            "signees": 0
        },
        "RU": {
            "name": "Russia",
            "native": "Россия",
            "continent": "EU",
            "region": "Europe",
            "countryCode": "RU",
            "petitionUrl": "https://chng.it/2zbnmvJPRC",
            "signees": 229
        },
        "SE": {
            "name": "Sweden",
            "native": "Sverige",
            "countryCode": "SE",
            "continent": "EU",
            "region": "Europe",
            "petitionUrl": "",
            "signees": 0
        },
        "SI": {
            "name": "Slovenia",
            "native": "Slovenija",
            "countryCode": "SI",
            "continent": "EU",
            "region": "Europe",
            "petitionUrl": "",
            "signees": 0
        },
        "SJ": {
            "name": "Svalbard and Jan Mayen",
            "native": "Svalbard og Jan Mayen",
            "countryCode": "SJ",
            "continent": "EU",
            "region": "Europe",
            "petitionUrl": "",
            "signees": 0
        },
        "SK": {
            "name": "Slovakia",
            "native": "Slovensko",
            "countryCode": "SK",
            "continent": "EU",
            "region": "Europe",
            "petitionUrl": "",
            "signees": 0
        },
        "SM": {
            "name": "San Marino",
            "native": "San Marino",
            "countryCode": "SM",
            "continent": "EU",
            "region": "Europe",
            "petitionUrl": "",
            "signees": 0
        },
        "UA": {
            "name": "Ukraine",
            "native": "Україна",
            "countryCode": "UA",
            "continent": "EU",
            "region": "Europe",
            "petitionUrl": "http://chng.it/KhPLBbyWVn",
            "signees": 44
        },
        "VA": {
            "name": "Vatican City",
            "native": "Vaticano",
            "countryCode": "VA",
            "continent": "EU",
            "region": "Europe",
            "petitionUrl": "",
            "signees": 0
        },
        "XK": {
            "name": "Kosovo",
            "native": "Republika e Kosovës",
            "countryCode": "XK",
            "continent": "EU",
            "region": "Europe",
            "petitionUrl": "",
            "signees": 0
        }
    },
    "Asia": {
        "AE": {
            "name": "United Arab Emirates",
            "native": "دولة الإمارات العربية المتحدة",
            "countryCode": "AE",
            "continent": "AS",
            "region": "Asia",
            "petitionUrl": "",
            "signees": 0
        },
        "AF": {
            "name": "Afghanistan",
            "native": "افغانستان",
            "countryCode": "AF",
            "continent": "AS",
            "region": "Asia",
            "petitionUrl": "https://chng.it/Zk5PKfFSCV",
            "signees": 2
        },
        "AM": {
            "name": "Armenia",
            "native": "Հայաստան",
            "countryCode": "AM",
            "continent": "AS",
            "region": "Asia",
            "petitionUrl": "",
            "signees": 0
        },
        "AZ": {
            "name": "Azerbaijan",
            "native": "Azərbaycan",
            "continent": "AS",
            "region": "Asia",
            "countryCode": "AZ",
            "petitionUrl": "",
            "signees": 0
        },
        "BD": {
            "name": "Bangladesh",
            "native": "Bangladesh",
            "countryCode": "BD",
            "continent": "AS",
            "region": "Asia",
            "petitionUrl": "https://chng.it/pvsdrfgnyx",
            "signees": 2
        },
        "BH": {
            "name": "Bahrain",
            "native": "‏البحرين",
            "countryCode": "BH",
            "continent": "AS",
            "region": "Asia",
            "petitionUrl": "",
            "signees": 0
        },
        "BN": {
            "name": "Brunei",
            "native": "Negara Brunei Darussalam",
            "countryCode": "BN",
            "continent": "AS",
            "region": "Asia",
            "petitionUrl": "",
            "signees": 0
        },
        "BT": {
            "name": "Bhutan",
            "native": "ʼbrug-yul",
            "countryCode": "BT",
            "continent": "AS",
            "region": "Asia",
            "petitionUrl": "",
            "signees": 0
        },
        "CC": {
            "name": "Cocos [Keeling] Islands",
            "native": "Cocos (Keeling) Islands",
            "countryCode": "CC",
            "continent": "AS",
            "region": "Asia",
            "petitionUrl": "",
            "signees": 0
        },
        "CN": {
            "name": "China",
            "native": "中国",
            "countryCode": "CN",
            "continent": "AS",
            "region": "Asia",
            "petitionUrl": "",
            "signees": 0
        },
        "CX": {
            "name": "Christmas Island",
            "native": "Christmas Island",
            "countryCode": "CX",
            "continent": "AS",
            "region": "Asia",
            "petitionUrl": "",
            "signees": 0
        },
        "GE": {
            "name": "Georgia",
            "native": "საქართველო",
            "countryCode": "GE",
            "continent": "AS",
            "region": "Asia",
            "petitionUrl": "",
            "signees": 0
        },
        "HK": {
            "name": "Hong Kong",
            "native": "香港",
            "countryCode": "HK",
            "continent": "AS",
            "region": "Asia",
            "petitionUrl": "",
            "signees": 0
        },
        "ID": {
            "name": "Indonesia",
            "native": "Indonesia",
            "countryCode": "ID",
            "continent": "AS",
            "region": "Asia",
            "petitionUrl": "",
            "signees": 0
        },
        "IL": {
            "name": "Israel",
            "native": "יִשְׂרָאֵל",
            "countryCode": "IL",
            "continent": "AS",
            "region": "Asia",
            "petitionUrl": "https://chng.it/Cb2pvh26tx",
            "signees": 137
        },
        "IN": {
            "name": "India",
            "native": "भारत",
            "countryCode": "IN",
            "continent": "AS",
            "region": "Asia",
            "petitionUrl": "https://chng.it/tdkcgqH9X6",
            "signees": 186
        },
        "IO": {
            "name": "British Indian Ocean Territory",
            "native": "British Indian Ocean Territory",
            "countryCode": "IO",
            "continent": "AS",
            "region": "Asia",
            "petitionUrl": "",
            "signees": 0
        },
        "IQ": {
            "name": "Iraq",
            "native": "العراق",
            "countryCode": "IQ",
            "continent": "AS",
            "region": "Asia",
            "petitionUrl": "",
            "signees": 0
        },
        "IR": {
            "name": "Iran",
            "native": "ایران",
            "countryCode": "IR",
            "continent": "AS",
            "region": "Asia",
            "petitionUrl": "https://chng.it/bpvbZh5Rmn",
            "signees": 0
        },
        "JO": {
            "name": "Jordan",
            "native": "الأردن",
            "countryCode": "JO",
            "continent": "AS",
            "region": "Asia",
            "petitionUrl": "",
            "signees": 0
        },
        "JP": {
            "name": "Japan",
            "native": "日本",
            "countryCode": "JP",
            "continent": "AS",
            "region": "Asia",
            "petitionUrl": "",
            "signees": 0
        },
        "KG": {
            "name": "Kyrgyzstan",
            "native": "Кыргызстан",
            "countryCode": "KG",
            "continent": "AS",
            "region": "Asia",
            "petitionUrl": "",
            "signees": 0
        },
        "KH": {
            "name": "Cambodia",
            "native": "Kâmpŭchéa",
            "countryCode": "KH",
            "continent": "AS",
            "region": "Asia",
            "petitionUrl": "https://chng.it/XxPBkDWYFK",
            "signees": 2
        },
        "KP": {
            "name": "North Korea",
            "native": "북한",
            "countryCode": "KP",
            "continent": "AS",
            "region": "Asia",
            "petitionUrl": "",
            "signees": 0
        },
        "KR": {
            "name": "South Korea",
            "native": "대한민국",
            "countryCode": "KR",
            "continent": "AS",
            "region": "Asia",
            "petitionUrl": "",
            "signees": 0
        },
        "KW": {
            "name": "Kuwait",
            "native": "الكويت",
            "countryCode": "KW",
            "continent": "AS",
            "region": "Asia",
            "petitionUrl": "",
            "signees": 0
        },
        "KZ": {
            "name": "Kazakhstan",
            "native": "Қазақстан",
            "continent": "AS",
            "region": "Asia",
            "countryCode": "KZ",
            "petitionUrl": "",
            "signees": 0
        },
        "LA": {
            "name": "Laos",
            "native": "ສປປລາວ",
            "countryCode": "LA",
            "continent": "AS",
            "region": "Asia",
            "petitionUrl": "",
            "signees": 0
        },
        "LB": {
            "name": "Lebanon",
            "native": "لبنان",
            "countryCode": "LB",
            "continent": "AS",
            "region": "Asia",
            "petitionUrl": "",
            "signees": 0
        },
        "LK": {
            "name": "Sri Lanka",
            "native": "śrī laṃkāva",
            "countryCode": "LK",
            "continent": "AS",
            "region": "Asia",
            "petitionUrl": "",
            "signees": 0
        },
        "MM": {
            "name": "Myanmar [Burma]",
            "native": "မြန်မာ",
            "countryCode": "MM",
            "continent": "AS",
            "region": "Asia",
            "petitionUrl": "",
            "signees": 0
        },
        "MN": {
            "name": "Mongolia",
            "native": "Монгол улс",
            "countryCode": "MN",
            "continent": "AS",
            "region": "Asia",
            "petitionUrl": "",
            "signees": 0
        },
        "MO": {
            "name": "Macao",
            "native": "澳門",
            "countryCode": "MO",
            "continent": "AS",
            "region": "Asia",
            "petitionUrl": "",
            "signees": 0
        },
        "MV": {
            "name": "Maldives",
            "native": "Maldives",
            "countryCode": "MV",
            "continent": "AS",
            "region": "Asia",
            "petitionUrl": "https://chng.it/gvbQ95SdGn",
            "signees": 210
        },
        "MY": {
            "name": "Malaysia",
            "native": "Malaysia",
            "countryCode": "MY",
            "continent": "AS",
            "region": "Asia",
            "petitionUrl": "",
            "signees": 0
        },
        "NP": {
            "name": "Nepal",
            "native": "नपल",
            "countryCode": "NP",
            "continent": "AS",
            "region": "Asia",
            "petitionUrl": "",
            "signees": 0
        },
        "OM": {
            "name": "Oman",
            "native": "عمان",
            "countryCode": "OM",
            "continent": "AS",
            "region": "Asia",
            "petitionUrl": "",
            "signees": 0
        },
        "PH": {
            "name": "Philippines",
            "native": "Pilipinas",
            "countryCode": "PH",
            "continent": "AS",
            "region": "Asia",
            "petitionUrl": "",
            "signees": 0
        },
        "PK": {
            "name": "Pakistan",
            "native": "Pakistan",
            "countryCode": "PK",
            "continent": "AS",
            "region": "Asia",
            "petitionUrl": "",
            "signees": 0
        },
        "PS": {
            "name": "Palestine",
            "native": "فلسطين",
            "countryCode": "PS",
            "continent": "AS",
            "region": "Asia",
            "petitionUrl": "",
            "signees": 0
        },
        "QA": {
            "name": "Qatar",
            "native": "قطر",
            "countryCode": "QA",
            "continent": "AS",
            "region": "Asia",
            "petitionUrl": "",
            "signees": 0
        },
        "SA": {
            "name": "Saudi Arabia",
            "native": "العربية السعودية",
            "countryCode": "SA",
            "continent": "AS",
            "region": "Asia",
            "petitionUrl": "",
            "signees": 0
        },
        "SG": {
            "name": "Singapore",
            "native": "Singapore",
            "countryCode": "SG",
            "continent": "AS",
            "region": "Asia",
            "petitionUrl": "",
            "signees": 0
        },
        "SY": {
            "name": "Syria",
            "native": "سوريا",
            "countryCode": "SY",
            "continent": "AS",
            "region": "Asia",
            "petitionUrl": "",
            "signees": 0
        },
        "TH": {
            "name": "Thailand",
            "native": "ประเทศไทย",
            "countryCode": "TH",
            "continent": "AS",
            "region": "Asia",
            "petitionUrl": "",
            "signees": 0
        },
        "TJ": {
            "name": "Tajikistan",
            "native": "Тоҷикистон",
            "countryCode": "TJ",
            "continent": "AS",
            "region": "Asia",
            "petitionUrl": "",
            "signees": 0
        },
        "TM": {
            "name": "Turkmenistan",
            "native": "Türkmenistan",
            "countryCode": "TM",
            "continent": "AS",
            "region": "Asia",
            "petitionUrl": "",
            "signees": 0
        },
        "TR": {
            "name": "Turkey",
            "native": "Türkiye",
            "countryCode": "TR",
            "continent": "AS",
            "region": "Asia",
            "petitionUrl": "https://chng.it/RLV6wgpnMQ",
            "signees": 9
        },
        "TW": {
            "name": "Taiwan",
            "native": "臺灣",
            "countryCode": "TW",
            "continent": "AS",
            "region": "Asia",
            "petitionUrl": "",
            "signees": 0
        },
        "UZ": {
            "name": "Uzbekistan",
            "native": "O‘zbekiston",
            "countryCode": "UZ",
            "continent": "AS",
            "region": "Asia",
            "petitionUrl": "",
            "signees": 0
        },
        "VN": {
            "name": "Vietnam",
            "native": "Việt Nam",
            "countryCode": "VN",
            "continent": "AS",
            "region": "Asia",
            "petitionUrl": "https://chng.it/XcYWvdm5hp",
            "signees": 33
        },
        "YE": {
            "name": "Yemen",
            "native": "اليَمَن",
            "countryCode": "YE",
            "continent": "AS",
            "region": "Asia",
            "petitionUrl": "",
            "signees": 0
        }
    },
    "America": {
        "AG": {
            "name": "Antigua and Barbuda",
            "native": "Antigua and Barbuda",
            "countryCode": "AG",
            "continent": "NA",
            "region": "America",
            "petitionUrl": "",
            "signees": 0
        },
        "AI": {
            "name": "Anguilla",
            "native": "Anguilla",
            "countryCode": "AI",
            "continent": "NA",
            "region": "America",
            "petitionUrl": "",
            "signees": 0
        },
        "AR": {
            "name": "Argentina",
            "native": "Argentina",
            "countryCode": "AR",
            "continent": "SA",
            "region": "America",
            "petitionUrl": "",
            "signees": 0
        },
        "AW": {
            "name": "Aruba",
            "native": "Aruba",
            "countryCode": "AW",
            "continent": "NA",
            "region": "America",
            "petitionUrl": "",
            "signees": 0
        },
        "BB": {
            "name": "Barbados",
            "native": "Barbados",
            "countryCode": "BB",
            "continent": "NA",
            "region": "America",
            "petitionUrl": "",
            "signees": 0
        },
        "BL": {
            "name": "Saint Barthélemy",
            "native": "Saint-Barthélemy",
            "countryCode": "BL",
            "continent": "NA",
            "region": "America",
            "petitionUrl": "",
            "signees": 0
        },
        "BM": {
            "name": "Bermuda",
            "native": "Bermuda",
            "countryCode": "BM",
            "continent": "NA",
            "region": "America",
            "petitionUrl": "",
            "signees": 0
        },
        "BO": {
            "name": "Bolivia",
            "native": "Bolivia",
            "countryCode": "BO",
            "continent": "SA",
            "region": "America",
            "petitionUrl": "https://chng.it/FCnvtPMzY8",
            "signees": 1
        },
        "BQ": {
            "name": "Bonaire",
            "native": "Bonaire",
            "countryCode": "BQ",
            "continent": "NA",
            "region": "America",
            "petitionUrl": "",
            "signees": 0
        },
        "BR": {
            "name": "Brazil",
            "native": "Brasil",
            "countryCode": "BR",
            "continent": "SA",
            "region": "America",
            "petitionUrl": "https://chng.it/WRskvV6Syy",
            "signees": 82
        },
        "BS": {
            "name": "Bahamas",
            "native": "Bahamas",
            "countryCode": "BS",
            "continent": "NA",
            "region": "America",
            "petitionUrl": "",
            "signees": 0
        },
        "BZ": {
            "name": "Belize",
            "native": "Belize",
            "countryCode": "BZ",
            "continent": "NA",
            "region": "America",
            "petitionUrl": "",
            "signees": 0
        },
        "CA": {
            "name": "Canada",
            "native": "Canada",
            "countryCode": "CA",
            "continent": "NA",
            "region": "America",
            "petitionUrl": "https://chng.it/tnHkSzLxMN",
            "signees": 8
        },
        "CL": {
            "name": "Chile",
            "native": "Chile",
            "countryCode": "CL",
            "continent": "SA",
            "region": "America",
            "petitionUrl": "https://chng.it/DgPZmhpKgt",
            "signees": 10
        },
        "CO": {
            "name": "Colombia",
            "native": "Colombia",
            "countryCode": "CO",
            "continent": "SA",
            "region": "America",
            "petitionUrl": "",
            "signees": 0
        },
        "CR": {
            "name": "Costa Rica",
            "native": "Costa Rica",
            "countryCode": "CR",
            "continent": "NA",
            "region": "America",
            "petitionUrl": "https://chng.it/CgqC5W8Qnd",
            "signees": 1
        },
        "CU": {
            "name": "Cuba",
            "native": "Cuba",
            "countryCode": "CU",
            "continent": "NA",
            "region": "America",
            "petitionUrl": "https://chng.it/v6BtjHfVqN",
            "signees": 1
        },
        "CW": {
            "name": "Curacao",
            "native": "Curaçao",
            "countryCode": "CW",
            "continent": "NA",
            "region": "America",
            "petitionUrl": "",
            "signees": 0
        },
        "DM": {
            "name": "Dominica",
            "native": "Dominica",
            "countryCode": "DM",
            "continent": "NA",
            "region": "America",
            "petitionUrl": "",
            "signees": 0
        },
        "DO": {
            "name": "Dominican Republic",
            "native": "República Dominicana",
            "countryCode": "DO",
            "continent": "NA",
            "region": "America",
            "petitionUrl": "https://chng.it/4n9Lwv2zyd",
            "signees": 1
        },
        "EC": {
            "name": "Ecuador",
            "native": "Ecuador",
            "countryCode": "EC",
            "continent": "SA",
            "region": "America",
            "petitionUrl": "https://chng.it/5yZSdSPP96",
            "signees": 1
        },
        "FK": {
            "name": "Falkland Islands",
            "native": "Falkland Islands",
            "countryCode": "FK",
            "continent": "SA",
            "region": "America",
            "petitionUrl": "",
            "signees": 0
        },
        "GD": {
            "name": "Grenada",
            "native": "Grenada",
            "countryCode": "GD",
            "continent": "NA",
            "region": "America",
            "petitionUrl": "",
            "signees": 0
        },
        "GF": {
            "name": "French Guiana",
            "native": "Guyane française",
            "countryCode": "GF",
            "continent": "SA",
            "region": "America",
            "petitionUrl": "",
            "signees": 0
        },
        "GL": {
            "name": "Greenland",
            "native": "Kalaallit Nunaat",
            "countryCode": "GL",
            "continent": "NA",
            "region": "America",
            "petitionUrl": "",
            "signees": 0
        },
        "GP": {
            "name": "Guadeloupe",
            "native": "Guadeloupe",
            "countryCode": "GP",
            "continent": "NA",
            "region": "America",
            "petitionUrl": "",
            "signees": 0
        },
        "GT": {
            "name": "Guatemala",
            "native": "Guatemala",
            "countryCode": "GT",
            "continent": "NA",
            "region": "America",
            "petitionUrl": "https://chng.it/dzGw8Ywc",
            "signees": 1
        },
        "GY": {
            "name": "Guyana",
            "native": "Guyana",
            "countryCode": "GY",
            "continent": "SA",
            "region": "America",
            "petitionUrl": "",
            "signees": 0
        },
        "HN": {
            "name": "Honduras",
            "native": "Honduras",
            "countryCode": "HN",
            "continent": "NA",
            "region": "America",
            "petitionUrl": "https://chng.it/vGYd5vKN5Z",
            "signees": 0
        },
        "HT": {
            "name": "Haiti",
            "native": "Haïti",
            "countryCode": "HT",
            "continent": "NA",
            "region": "America",
            "petitionUrl": "",
            "signees": 0
        },
        "JM": {
            "name": "Jamaica",
            "native": "Jamaica",
            "countryCode": "JM",
            "continent": "NA",
            "region": "America",
            "petitionUrl": "",
            "signees": 0
        },
        "KN": {
            "name": "Saint Kitts and Nevis",
            "native": "Saint Kitts and Nevis",
            "countryCode": "KN",
            "continent": "NA",
            "region": "America",
            "petitionUrl": "",
            "signees": 0
        },
        "KY": {
            "name": "Cayman Islands",
            "native": "Cayman Islands",
            "countryCode": "KY",
            "continent": "NA",
            "region": "America",
            "petitionUrl": "",
            "signees": 0
        },
        "LC": {
            "name": "Saint Lucia",
            "native": "Saint Lucia",
            "countryCode": "LC",
            "continent": "NA",
            "region": "America",
            "petitionUrl": "",
            "signees": 0
        },
        "MF": {
            "name": "Saint Martin",
            "native": "Saint-Martin",
            "countryCode": "MF",
            "continent": "NA",
            "region": "America",
            "petitionUrl": "",
            "signees": 0
        },
        "MQ": {
            "name": "Martinique",
            "native": "Martinique",
            "countryCode": "MQ",
            "continent": "NA",
            "region": "America",
            "petitionUrl": "",
            "signees": 0
        },
        "MS": {
            "name": "Montserrat",
            "native": "Montserrat",
            "countryCode": "MS",
            "continent": "NA",
            "region": "America",
            "petitionUrl": "",
            "signees": 0
        },
        "MX": {
            "name": "Mexico",
            "native": "México",
            "countryCode": "MX",
            "continent": "NA",
            "region": "America",
            "petitionUrl": "https://chng.it/QVR8fgKkvN",
            "signees": 3
        },
        "NI": {
            "name": "Nicaragua",
            "native": "Nicaragua",
            "countryCode": "NI",
            "continent": "NA",
            "region": "America",
            "petitionUrl": "https://chng.it/w74Bn7hvQp",
            "signees": 0
        },
        "PA": {
            "name": "Panama",
            "native": "Panamá",
            "countryCode": "PA",
            "continent": "NA",
            "region": "America",
            "petitionUrl": "https://chng.it/Zjztd68PdQ",
            "signees": 1
        },
        "PE": {
            "name": "Peru",
            "native": "Perú",
            "countryCode": "PE",
            "continent": "SA",
            "region": "America",
            "petitionUrl": "",
            "signees": 0
        },
        "PM": {
            "name": "Saint Pierre and Miquelon",
            "native": "Saint-Pierre-et-Miquelon",
            "countryCode": "PM",
            "continent": "NA",
            "region": "America",
            "petitionUrl": "",
            "signees": 0
        },
        "PR": {
            "name": "Puerto Rico",
            "native": "Puerto Rico",
            "countryCode": "PR",
            "continent": "NA",
            "region": "America",
            "petitionUrl": "",
            "signees": 0
        },
        "PY": {
            "name": "Paraguay",
            "native": "Paraguay",
            "countryCode": "PY",
            "continent": "SA",
            "region": "America",
            "petitionUrl": "",
            "signees": 0
        },
        "SR": {
            "name": "Suriname",
            "native": "Suriname",
            "countryCode": "SR",
            "continent": "SA",
            "region": "America",
            "petitionUrl": "",
            "signees": 0
        },
        "SV": {
            "name": "El Salvador",
            "native": "El Salvador",
            "countryCode": "SV",
            "continent": "NA",
            "region": "America",
            "petitionUrl": "",
            "signees": 0
        },
        "SX": {
            "name": "Sint Maarten",
            "native": "Sint Maarten",
            "countryCode": "SX",
            "continent": "NA",
            "region": "America",
            "petitionUrl": "",
            "signees": 0
        },
        "TC": {
            "name": "Turks and Caicos Islands",
            "native": "Turks and Caicos Islands",
            "countryCode": "TC",
            "continent": "NA",
            "region": "America",
            "petitionUrl": "",
            "signees": 0
        },
        "TT": {
            "name": "Trinidad and Tobago",
            "native": "Trinidad and Tobago",
            "countryCode": "TT",
            "continent": "NA",
            "region": "America",
            "petitionUrl": "",
            "signees": 0
        },
        "US": {
            "name": "United States",
            "native": "United States",
            "countryCode": "US",
            "continent": "NA",
            "region": "America",
            "petitionUrl": "https://chng.it/7WZbBvGzpk",
            "signees": 118
        },
        "UY": {
            "name": "Uruguay",
            "native": "Uruguay",
            "countryCode": "UY",
            "continent": "SA",
            "region": "America",
            "petitionUrl": "",
            "signees": 0
        },
        "VC": {
            "name": "Saint Vincent and the Grenadines",
            "native": "Saint Vincent and the Grenadines",
            "countryCode": "VC",
            "continent": "NA",
            "region": "America",
            "petitionUrl": "",
            "signees": 0
        },
        "VE": {
            "name": "Venezuela",
            "native": "Venezuela",
            "countryCode": "VE",
            "continent": "SA",
            "region": "America",
            "petitionUrl": "",
            "signees": 0
        },
        "VG": {
            "name": "British Virgin Islands",
            "native": "British Virgin Islands",
            "countryCode": "VG",
            "continent": "NA",
            "region": "America",
            "petitionUrl": "",
            "signees": 0
        },
        "VI": {
            "name": "U.S. Virgin Islands",
            "native": "United States Virgin Islands",
            "countryCode": "VI",
            "continent": "NA",
            "region": "America",
            "petitionUrl": "",
            "signees": 0
        }
    },
    "Africa": {
        "AO": {
            "name": "Angola",
            "native": "Angola",
            "countryCode": "AO",
            "continent": "AF",
            "region": "Africa",
            "petitionUrl": "https://chng.it/wpZZpdfwRf",
            "signees": 1
        },
        "BF": {
            "name": "Burkina Faso",
            "native": "Burkina Faso",
            "countryCode": "BF",
            "continent": "AF",
            "region": "Africa",
            "petitionUrl": "",
            "signees": 0
        },
        "BI": {
            "name": "Burundi",
            "native": "Burundi",
            "countryCode": "BI",
            "continent": "AF",
            "region": "Africa",
            "petitionUrl": "",
            "signees": 0
        },
        "BJ": {
            "name": "Benin",
            "native": "Bénin",
            "countryCode": "BJ",
            "continent": "AF",
            "region": "Africa",
            "petitionUrl": "",
            "signees": 0
        },
        "BW": {
            "name": "Botswana",
            "native": "Botswana",
            "countryCode": "BW",
            "continent": "AF",
            "region": "Africa",
            "petitionUrl": "",
            "signees": 0
        },
        "CD": {
            "name": "Democratic Republic of the Congo",
            "native": "République démocratique du Congo",
            "countryCode": "CD",
            "continent": "AF",
            "region": "Africa",
            "petitionUrl": "",
            "signees": 0
        },
        "CF": {
            "name": "Central African Republic",
            "native": "Ködörösêse tî Bêafrîka",
            "countryCode": "CF",
            "continent": "AF",
            "region": "Africa",
            "petitionUrl": "",
            "signees": 0
        },
        "CG": {
            "name": "Republic of the Congo",
            "native": "République du Congo",
            "countryCode": "CG",
            "continent": "AF",
            "region": "Africa",
            "petitionUrl": "",
            "signees": 0
        },
        "CI": {
            "name": "Ivory Coast",
            "native": "Côte d'Ivoire",
            "countryCode": "CI",
            "continent": "AF",
            "region": "Africa",
            "petitionUrl": "",
            "signees": 0
        },
        "CM": {
            "name": "Cameroon",
            "native": "Cameroon",
            "countryCode": "CM",
            "continent": "AF",
            "region": "Africa",
            "petitionUrl": "",
            "signees": 0
        },
        "CV": {
            "name": "Cape Verde",
            "native": "Cabo Verde",
            "countryCode": "CV",
            "continent": "AF",
            "region": "Africa",
            "petitionUrl": "https://chng.it/ZdmjnLS9dS",
            "signees": 2
        },
        "DJ": {
            "name": "Djibouti",
            "native": "Djibouti",
            "countryCode": "DJ",
            "continent": "AF",
            "region": "Africa",
            "petitionUrl": "",
            "signees": 0
        },
        "DZ": {
            "name": "Algeria",
            "native": "الجزائر",
            "countryCode": "DZ",
            "continent": "AF",
            "region": "Africa",
            "petitionUrl": "https://chng.it/qGjSX4rj",
            "signees": 1
        },
        "EG": {
            "name": "Egypt",
            "native": "مصر‎",
            "countryCode": "EG",
            "continent": "AF",
            "region": "Africa",
            "petitionUrl": "https://chng.it/sNJNFbq4",
            "signees": 4
        },
        "EH": {
            "name": "Western Sahara",
            "native": "الصحراء الغربية",
            "countryCode": "EH",
            "continent": "AF",
            "region": "Africa",
            "petitionUrl": "",
            "signees": 0
        },
        "ER": {
            "name": "Eritrea",
            "native": "ኤርትራ",
            "countryCode": "ER",
            "continent": "AF",
            "region": "Africa",
            "petitionUrl": "",
            "signees": 0
        },
        "ET": {
            "name": "Ethiopia",
            "native": "ኢትዮጵያ",
            "countryCode": "ET",
            "continent": "AF",
            "region": "Africa",
            "petitionUrl": "",
            "signees": 0
        },
        "GA": {
            "name": "Gabon",
            "native": "Gabon",
            "countryCode": "GA",
            "continent": "AF",
            "region": "Africa",
            "petitionUrl": "",
            "signees": 0
        },
        "GH": {
            "name": "Ghana",
            "native": "Ghana",
            "countryCode": "GH",
            "continent": "AF",
            "region": "Africa",
            "petitionUrl": "",
            "signees": 0
        },
        "GM": {
            "name": "Gambia",
            "native": "Gambia",
            "countryCode": "GM",
            "continent": "AF",
            "region": "Africa",
            "petitionUrl": "",
            "signees": 0
        },
        "GN": {
            "name": "Guinea",
            "native": "Guinée",
            "countryCode": "GN",
            "continent": "AF",
            "region": "Africa",
            "petitionUrl": "",
            "signees": 0
        },
        "GQ": {
            "name": "Equatorial Guinea",
            "native": "Guinea Ecuatorial",
            "countryCode": "GQ",
            "continent": "AF",
            "region": "Africa",
            "petitionUrl": "https://chng.it/b8hVnky78w",
            "signees": 1
        },
        "GW": {
            "name": "Guinea-Bissau",
            "native": "Guiné-Bissau",
            "countryCode": "GW",
            "continent": "AF",
            "region": "Africa",
            "petitionUrl": "https://chng.it/CwrLgVpZC4",
            "signees": 1
        },
        "KE": {
            "name": "Kenya",
            "native": "Kenya",
            "countryCode": "KE",
            "continent": "AF",
            "region": "Africa",
            "petitionUrl": "",
            "signees": 0
        },
        "KM": {
            "name": "Comoros",
            "native": "Komori",
            "countryCode": "KM",
            "continent": "AF",
            "region": "Africa",
            "petitionUrl": "",
            "signees": 0
        },
        "LR": {
            "name": "Liberia",
            "native": "Liberia",
            "countryCode": "LR",
            "continent": "AF",
            "region": "Africa",
            "petitionUrl": "",
            "signees": 0
        },
        "LS": {
            "name": "Lesotho",
            "native": "Lesotho",
            "countryCode": "LS",
            "continent": "AF",
            "region": "Africa",
            "petitionUrl": "",
            "signees": 0
        },
        "LY": {
            "name": "Libya",
            "native": "‏ليبيا",
            "countryCode": "LY",
            "continent": "AF",
            "region": "Africa",
            "petitionUrl": "",
            "signees": 0
        },
        "MA": {
            "name": "Morocco",
            "native": "المغرب",
            "countryCode": "MA",
            "continent": "AF",
            "region": "Africa",
            "petitionUrl": "",
            "signees": 0
        },
        "MG": {
            "name": "Madagascar",
            "native": "Madagasikara",
            "countryCode": "MG",
            "continent": "AF",
            "region": "Africa",
            "petitionUrl": "",
            "signees": 0
        },
        "ML": {
            "name": "Mali",
            "native": "Mali",
            "countryCode": "ML",
            "continent": "AF",
            "region": "Africa",
            "petitionUrl": "",
            "signees": 0
        },
        "MR": {
            "name": "Mauritania",
            "native": "موريتانيا",
            "countryCode": "MR",
            "continent": "AF",
            "region": "Africa",
            "petitionUrl": "",
            "signees": 0
        },
        "MU": {
            "name": "Mauritius",
            "native": "Maurice",
            "countryCode": "MU",
            "continent": "AF",
            "region": "Africa",
            "petitionUrl": "",
            "signees": 0
        },
        "MW": {
            "name": "Malawi",
            "native": "Malawi",
            "countryCode": "MW",
            "continent": "AF",
            "region": "Africa",
            "petitionUrl": "",
            "signees": 0
        },
        "MZ": {
            "name": "Mozambique",
            "native": "Moçambique",
            "countryCode": "MZ",
            "continent": "AF",
            "region": "Africa",
            "petitionUrl": "https://chng.it/7gQhYC5Qbw",
            "signees": 1
        },
        "NA": {
            "name": "Namibia",
            "native": "Namibia",
            "countryCode": "NA",
            "continent": "AF",
            "region": "Africa",
            "petitionUrl": "",
            "signees": 0
        },
        "NE": {
            "name": "Niger",
            "native": "Niger",
            "countryCode": "NE",
            "continent": "AF",
            "region": "Africa",
            "petitionUrl": "",
            "signees": 0
        },
        "NG": {
            "name": "Nigeria",
            "native": "Nigeria",
            "countryCode": "NG",
            "continent": "AF",
            "region": "Africa",
            "petitionUrl": "https://chng.it/Y4FhgK98wn",
            "signees": 6
        },
        "RE": {
            "name": "Réunion",
            "native": "La Réunion",
            "countryCode": "RE",
            "continent": "AF",
            "region": "Africa",
            "petitionUrl": "",
            "signees": 0
        },
        "RW": {
            "name": "Rwanda",
            "native": "Rwanda",
            "countryCode": "RW",
            "continent": "AF",
            "region": "Africa",
            "petitionUrl": "",
            "signees": 0
        },
        "SC": {
            "name": "Seychelles",
            "native": "Seychelles",
            "countryCode": "SC",
            "continent": "AF",
            "region": "Africa",
            "petitionUrl": "",
            "signees": 0
        },
        "SD": {
            "name": "Sudan",
            "native": "السودان",
            "countryCode": "SD",
            "continent": "AF",
            "region": "Africa",
            "petitionUrl": "",
            "signees": 0
        },
        "SH": {
            "name": "Saint Helena",
            "native": "Saint Helena",
            "countryCode": "SH",
            "continent": "AF",
            "region": "Africa",
            "petitionUrl": "",
            "signees": 0
        },
        "SL": {
            "name": "Sierra Leone",
            "native": "Sierra Leone",
            "countryCode": "SL",
            "continent": "AF",
            "region": "Africa",
            "petitionUrl": "",
            "signees": 0
        },
        "SN": {
            "name": "Senegal",
            "native": "Sénégal",
            "countryCode": "SN",
            "continent": "AF",
            "region": "Africa",
            "petitionUrl": "",
            "signees": 0
        },
        "SO": {
            "name": "Somalia",
            "native": "Soomaaliya",
            "countryCode": "SO",
            "continent": "AF",
            "region": "Africa",
            "petitionUrl": "",
            "signees": 0
        },
        "SS": {
            "name": "South Sudan",
            "native": "South Sudan",
            "countryCode": "SS",
            "continent": "AF",
            "region": "Africa",
            "petitionUrl": "",
            "signees": 0
        },
        "ST": {
            "name": "São Tomé and Príncipe",
            "native": "São Tomé e Príncipe",
            "countryCode": "ST",
            "continent": "AF",
            "region": "Africa",
            "petitionUrl": "https://chng.it/rfQr2gycWS",
            "signees": 1
        },
        "SZ": {
            "name": "Swaziland",
            "native": "Swaziland",
            "countryCode": "SZ",
            "continent": "AF",
            "region": "Africa",
            "petitionUrl": "",
            "signees": 0
        },
        "TD": {
            "name": "Chad",
            "native": "Tchad",
            "countryCode": "TD",
            "continent": "AF",
            "region": "Africa",
            "petitionUrl": "",
            "signees": 0
        },
        "TG": {
            "name": "Togo",
            "native": "Togo",
            "countryCode": "TG",
            "continent": "AF",
            "region": "Africa",
            "petitionUrl": "",
            "signees": 0
        },
        "TN": {
            "name": "Tunisia",
            "native": "تونس",
            "countryCode": "TN",
            "continent": "AF",
            "region": "Africa",
            "petitionUrl": "",
            "signees": 0
        },
        "TZ": {
            "name": "Tanzania",
            "native": "Tanzania",
            "countryCode": "TZ",
            "continent": "AF",
            "region": "Africa",
            "petitionUrl": "",
            "signees": 0
        },
        "UG": {
            "name": "Uganda",
            "native": "Uganda",
            "countryCode": "UG",
            "continent": "AF",
            "region": "Africa",
            "petitionUrl": "",
            "signees": 0
        },
        "YT": {
            "name": "Mayotte",
            "native": "Mayotte",
            "countryCode": "YT",
            "continent": "AF",
            "region": "Africa",
            "petitionUrl": "",
            "signees": 0
        },
        "ZA": {
            "name": "South Africa",
            "native": "South Africa",
            "countryCode": "ZA",
            "continent": "AF",
            "region": "Africa",
            "petitionUrl": "",
            "signees": 0
        },
        "ZM": {
            "name": "Zambia",
            "native": "Zambia",
            "countryCode": "ZM",
            "continent": "AF",
            "region": "Africa",
            "petitionUrl": "",
            "signees": 0
        },
        "ZW": {
            "name": "Zimbabwe",
            "native": "Zimbabwe",
            "countryCode": "ZW",
            "continent": "AF",
            "region": "Africa",
            "petitionUrl": "",
            "signees": 0
        }
    },
    "Antartica": {
        "AQ": {
            "name": "Antarctica",
            "native": "Antarctica",
            "countryCode": "AQ",
            "continent": "AN",
            "region": "Antartica",
            "petitionUrl": "",
            "signees": 0
        },
        "BV": {
            "name": "Bouvet Island",
            "native": "Bouvetøya",
            "countryCode": "BV",
            "continent": "AN",
            "region": "Antartica",
            "petitionUrl": "",
            "signees": 0
        },
        "GS": {
            "name": "South Georgia and the South Sandwich Islands",
            "native": "South Georgia",
            "countryCode": "GS",
            "continent": "AN",
            "region": "Antartica",
            "petitionUrl": "",
            "signees": 0
        },
        "HM": {
            "name": "Heard Island and McDonald Islands",
            "native": "Heard Island and McDonald Islands",
            "countryCode": "HM",
            "continent": "AN",
            "region": "Antartica",
            "petitionUrl": "",
            "signees": 0
        },
        "TF": {
            "name": "French Southern Territories",
            "native": "Territoire des Terres australes et antarctiques fr",
            "countryCode": "TF",
            "continent": "AN",
            "region": "Antartica",
            "petitionUrl": "",
            "signees": 0
        }
    },
    "Oceania": {
        "AS": {
            "name": "American Samoa",
            "native": "American Samoa",
            "countryCode": "AS",
            "continent": "OC",
            "region": "Oceania",
            "petitionUrl": "",
            "signees": 0
        },
        "AU": {
            "name": "Australia",
            "native": "Australia",
            "countryCode": "AU",
            "continent": "OC",
            "region": "Oceania",
            "petitionUrl": "https://chng.it/nrnsZBTGN5",
            "signees": 1
        },
        "CK": {
            "name": "Cook Islands",
            "native": "Cook Islands",
            "countryCode": "CK",
            "continent": "OC",
            "region": "Oceania",
            "petitionUrl": "",
            "signees": 0
        },
        "FJ": {
            "name": "Fiji",
            "native": "Fiji",
            "countryCode": "FJ",
            "continent": "OC",
            "region": "Oceania",
            "petitionUrl": "",
            "signees": 0
        },
        "FM": {
            "name": "Micronesia",
            "native": "Micronesia",
            "countryCode": "FM",
            "continent": "OC",
            "region": "Oceania",
            "petitionUrl": "",
            "signees": 0
        },
        "GU": {
            "name": "Guam",
            "native": "Guam",
            "countryCode": "GU",
            "continent": "OC",
            "region": "Oceania",
            "petitionUrl": "",
            "signees": 0
        },
        "KI": {
            "name": "Kiribati",
            "native": "Kiribati",
            "countryCode": "KI",
            "continent": "OC",
            "region": "Oceania",
            "petitionUrl": "",
            "signees": 0
        },
        "MH": {
            "name": "Marshall Islands",
            "native": "M̧ajeļ",
            "countryCode": "MH",
            "continent": "OC",
            "region": "Oceania",
            "petitionUrl": "",
            "signees": 0
        },
        "MP": {
            "name": "Northern Mariana Islands",
            "native": "Northern Mariana Islands",
            "countryCode": "MP",
            "continent": "OC",
            "region": "Oceania",
            "petitionUrl": "",
            "signees": 0
        },
        "NC": {
            "name": "New Caledonia",
            "native": "Nouvelle-Calédonie",
            "countryCode": "NC",
            "continent": "OC",
            "region": "Oceania",
            "petitionUrl": "",
            "signees": 0
        },
        "NF": {
            "name": "Norfolk Island",
            "native": "Norfolk Island",
            "countryCode": "NF",
            "continent": "OC",
            "region": "Oceania",
            "petitionUrl": "",
            "signees": 0
        },
        "NR": {
            "name": "Nauru",
            "native": "Nauru",
            "countryCode": "NR",
            "continent": "OC",
            "region": "Oceania",
            "petitionUrl": "",
            "signees": 0
        },
        "NU": {
            "name": "Niue",
            "native": "Niuē",
            "countryCode": "NU",
            "continent": "OC",
            "region": "Oceania",
            "petitionUrl": "",
            "signees": 0
        },
        "NZ": {
            "name": "New Zealand",
            "native": "New Zealand",
            "countryCode": "NZ",
            "continent": "OC",
            "region": "Oceania",
            "petitionUrl": "",
            "signees": 0
        },
        "PF": {
            "name": "French Polynesia",
            "native": "Polynésie française",
            "countryCode": "PF",
            "continent": "OC",
            "region": "Oceania",
            "petitionUrl": "",
            "signees": 0
        },
        "PG": {
            "name": "Papua New Guinea",
            "native": "Papua Niugini",
            "countryCode": "PG",
            "continent": "OC",
            "region": "Oceania",
            "petitionUrl": "",
            "signees": 0
        },
        "PN": {
            "name": "Pitcairn Islands",
            "native": "Pitcairn Islands",
            "countryCode": "PN",
            "continent": "OC",
            "region": "Oceania",
            "petitionUrl": "",
            "signees": 0
        },
        "PW": {
            "name": "Palau",
            "native": "Palau",
            "countryCode": "PW",
            "continent": "OC",
            "region": "Oceania",
            "petitionUrl": "",
            "signees": 0
        },
        "SB": {
            "name": "Solomon Islands",
            "native": "Solomon Islands",
            "countryCode": "SB",
            "continent": "OC",
            "region": "Oceania",
            "petitionUrl": "",
            "signees": 0
        },
        "TK": {
            "name": "Tokelau",
            "native": "Tokelau",
            "countryCode": "TK",
            "continent": "OC",
            "region": "Oceania",
            "petitionUrl": "",
            "signees": 0
        },
        "TL": {
            "name": "East Timor",
            "native": "Timor-Leste",
            "countryCode": "TL",
            "continent": "OC",
            "region": "Oceania",
            "petitionUrl": "https://chng.it/F7QsL4XcrR",
            "signees": 1
        },
        "TO": {
            "name": "Tonga",
            "native": "Tonga",
            "countryCode": "TO",
            "continent": "OC",
            "region": "Oceania",
            "petitionUrl": "",
            "signees": 0
        },
        "TV": {
            "name": "Tuvalu",
            "native": "Tuvalu",
            "countryCode": "TV",
            "continent": "OC",
            "region": "Oceania",
            "petitionUrl": "",
            "signees": 0
        },
        "UM": {
            "name": "U.S. Minor Outlying Islands",
            "native": "United States Minor Outlying Islands",
            "countryCode": "UM",
            "continent": "OC",
            "region": "Oceania",
            "petitionUrl": "",
            "signees": 0
        },
        "VU": {
            "name": "Vanuatu",
            "native": "Vanuatu",
            "countryCode": "VU",
            "continent": "OC",
            "region": "Oceania",
            "petitionUrl": "",
            "signees": 0
        },
        "WF": {
            "name": "Wallis and Futuna",
            "native": "Wallis et Futuna",
            "countryCode": "WF",
            "continent": "OC",
            "region": "Oceania",
            "petitionUrl": "",
            "signees": 0
        },
        "WS": {
            "name": "Samoa",
            "native": "Samoa",
            "countryCode": "WS",
            "continent": "OC",
            "region": "Oceania",
            "petitionUrl": "",
            "signees": 0
        }
    }
}