[
  {
    "id": "f38bae63-1738-4de2-96dc-2f2f32aa7525",
    "data": [
      {
        "text": "como está sua manhã por enquanto",
        "userDefined": false
      }
    ],
    "isTemplate": false,
    "count": 0,
    "updated": 0
  },
  {
    "id": "48993f91-1507-4b39-9d1c-80b45005d335",
    "data": [
      {
        "text": "como estão as coisas",
        "userDefined": false
      }
    ],
    "isTemplate": false,
    "count": 0,
    "updated": 0
  },
  {
    "id": "adb23e95-6c5c-4102-b95e-66a7b2b8a305",
    "data": [
      {
        "text": "como vai seu dia",
        "userDefined": false
      }
    ],
    "isTemplate": false,
    "count": 0,
    "updated": 0
  },
  {
    "id": "538c9a0a-9ba9-45af-8453-bbbe65b829da",
    "data": [
      {
        "text": "está tudo bem",
        "userDefined": false
      }
    ],
    "isTemplate": false,
    "count": 1,
    "updated": 0
  },
  {
    "id": "8b3b246f-9ab1-4c92-b3c7-03b222b8b6a5",
    "data": [
      {
        "text": "como vai você",
        "userDefined": false
      }
    ],
    "isTemplate": false,
    "count": 0,
    "updated": 0
  },
  {
    "id": "0e1ab0ff-1ffc-4337-ae5f-72b89c769ef9",
    "data": [
      {
        "text": "como vão as coisas",
        "userDefined": false
      }
    ],
    "isTemplate": false,
    "count": 0,
    "updated": 0
  },
  {
    "id": "7b910d17-05dd-4409-916e-2ebdc000ee60",
    "data": [
      {
        "text": "você está bem",
        "userDefined": false
      }
    ],
    "isTemplate": false,
    "count": 0,
    "updated": 0
  },
  {
    "id": "b1c5f6fb-e83e-4948-89c9-23ab5d4a7a18",
    "data": [
      {
        "text": "como você está se sentindo",
        "userDefined": false
      }
    ],
    "isTemplate": false,
    "count": 0,
    "updated": 0
  }
]