[
  {
    "id": "9c544236-5d9e-4426-8690-e06094d2e8d0",
    "data": [
      {
        "text": "To bem tambem, e voce?",
        "userDefined": false
      }
    ],
    "isTemplate": false,
    "count": 0
  },
  {
    "id": "22a8e793-b7ff-4823-b7a9-a23f1643d27d",
    "data": [
      {
        "text": "Estou bem também, e você?",
        "userDefined": false
      }
    ],
    "isTemplate": false,
    "count": 0
  },
  {
    "id": "ce6bb60b-c8f6-4b44-b067-3bc290279efe",
    "data": [
      {
        "text": "Estou bem também e vc?",
        "userDefined": false
      }
    ],
    "isTemplate": false,
    "count": 0
  },
  {
    "id": "c8980b5e-0e94-47e9-bfe8-778b6a1522cf",
    "data": [
      {
        "text": "to bem tbm, e vc?",
        "userDefined": false
      }
    ],
    "isTemplate": false,
    "count": 0
  },
  {
    "id": "25c2b9d5-2c86-496b-9112-0e8c6d89247d",
    "data": [
      {
        "text": "to mal cara, e tu?",
        "userDefined": false
      }
    ],
    "isTemplate": false,
    "count": 0
  },
  {
    "id": "4a3db3ce-e653-4686-a340-e4be8cf5392f",
    "data": [
      {
        "text": "to bem, como vai vc tbm?",
        "userDefined": false
      }
    ],
    "isTemplate": false,
    "count": 0
  },
  {
    "id": "43b708a0-f759-4dc5-96ad-416572305bba",
    "data": [
      {
        "text": "to marromenos e vc?",
        "userDefined": false
      }
    ],
    "isTemplate": false,
    "count": 0
  },
  {
    "id": "016139b1-3658-4fb5-9550-60b4ac2feffe",
    "data": [
      {
        "text": "to bem e vc?",
        "userDefined": false
      }
    ],
    "isTemplate": false,
    "count": 0
  },
  {
    "id": "53d0f520-5208-4540-aab7-b7157519a077",
    "data": [
      {
        "text": "to bem e você?",
        "userDefined": false
      }
    ],
    "isTemplate": false,
    "count": 0
  },
  {
    "id": "238110f8-e4cf-428a-a20e-c825d12b3af7",
    "data": [
      {
        "text": "Vou bem, obrigado, e você?",
        "userDefined": false
      }
    ],
    "isTemplate": false,
    "count": 0
  },
  {
    "id": "87551bd0-6512-42dd-9379-1cdb5a9eae9e",
    "data": [
      {
        "text": "Estou bem e você?",
        "userDefined": false
      }
    ],
    "isTemplate": false,
    "count": 0
  }
]