{
  "version": 1,
  "isRoot": true,
  "tools": {
    "fable": {
      "version": "3.7.2",
      "commands": [
        "fable"
      ]
    },
    "femto": {
      "version": "0.12.0",
      "commands": [
        "femto"
      ]
    },
    "paket": {
      "version": "6.2.1",
      "commands": [
        "paket"
      ]
    }
  }
}