[
    {
        "model": "service_rest.technician",
        "pk": 1,
        "fields": {
            "first_name": "Tony",
            "last_name": "Spaghetti",
            "employee_id": "tspaghetti"
        }
    },
    {
        "model": "service_rest.technician",
        "pk": 2,
        "fields": {
            "first_name": "Josh",
            "last_name": "Elder",
            "employee_id": "jelder"
        }
    },
    {
        "model": "service_rest.technician",
        "pk": 3,
        "fields": {
            "first_name": "Liz",
            "last_name": "Gonzalez",
            "employee_id": "lgonzolez"
        }
    },
    {
        "model": "service_rest.technician",
        "pk": 4,
        "fields": {
            "first_name": "Anthony",
            "last_name": "Woo",
            "employee_id": "awoo"
        }
    },
    {
        "model": "service_rest.technician",
        "pk": 5,
        "fields": {
            "first_name": "Carmen",
            "last_name": "Lemoine",
            "employee_id": "clemoine"
        }
    },
    {
        "model": "service_rest.appointment",
        "pk": 1,
        "fields": {
            "date_time": "2023-06-22T07:46:00Z",
            "reason": "Oil Change",
            "status": 0,
            "vin": "JH4KA4571LC033593",
            "customer": "Daniel",
            "technician": 1
        }
    },
    {
        "model": "service_rest.appointment",
        "pk": 2,
        "fields": {
            "date_time": "2023-06-19T10:50:00Z",
            "reason": "Tire Rotation",
            "status": 1,
            "vin": "5GAEV23718J129013",
            "customer": "Ian",
            "technician": 3
        }
    },
    {
        "model": "service_rest.appointment",
        "pk": 3,
        "fields": {
            "date_time": "2023-06-28T10:49:00Z",
            "reason": "Engine Noise",
            "status": 2,
            "vin": "JF1GPAD60D1803590",
            "customer": "Brett",
            "technician": 5
        }
    },
    {
        "model": "service_rest.appointment",
        "pk": 4,
        "fields": {
            "date_time": "2023-06-09T10:00:00Z",
            "reason": "Brakes",
            "status": 0,
            "vin": "WBAFR9C59BC270614",
            "customer": "Henry",
            "technician": 2
        }
    },
    {
        "model": "service_rest.appointment",
        "pk": 5,
        "fields": {
            "date_time": "2023-06-30T06:20:00Z",
            "reason": "Poor Gas Milage",
            "status": 0,
            "vin": "1B6MF36C6SS164013",
            "customer": "Curios George",
            "technician": 5
        }
    },
    {
        "model": "service_rest.appointment",
        "pk": 6,
        "fields": {
            "date_time": "2023-06-20T19:18:00Z",
            "reason": "Runs Hot",
            "status": 0,
            "vin": "JH4KA8170NC000665",
            "customer": "Hamk Pymm",
            "technician": 2
        }
    },
    {
        "model": "service_rest.appointment",
        "pk": 7,
        "fields": {
            "date_time": "2023-06-01T04:20:00Z",
            "reason": "Runs Cold",
            "status": 0,
            "vin": "JH4KA8170NC000665",
            "customer": "Hamk Pymm",
            "technician": 2
        }
    }
]
