{
  "name": "Convert to source format",
  "apiname": "Convert_to_source_format_1",
  "type": "Custom",
  "description": null,
  "version": 1,
  "volumeoptions": null,
  "steps": [
    {
      "name": "Convert",
      "apiname": "Convert_to_source_format_1_Convert_1",
      "type": "Function",
      "customtype": "Function",
      "config": {
        "functionName": "ConvertToSourceFomat",
        "parameters": [
          {
            "name": "git_json",
            "value": "{$Context.Repository.Credential}"
          },
          {
            "name": "destination_repository",
            "value": "{$Context.JobExecution__r.DataJson.destination}"
          },
          {
            "name": "branches",
            "value": "{$Context.JobExecution__r.DataJson.branches}"
          }
        ]
      }
    }
  ]
}