1 - 3 = -2
2 - 3 = -1
3 - 3 = 0
4 - 3 = 1
5 - 3 = 2
6 - 3 = 3
7 - 3 = 4
8 - 3 = 5
9 - 3 = 6
10 - 3 = 7
11 - 3 = 8
12 - 3 = 9
13 - 3 = 10
14 - 3 = 11
15 - 3 = 12
16 - 3 = 13
17 - 3 = 14
18 - 3 = 15
19 - 3 = 16
20 - 3 = 17
21 - 3 = 18
22 - 3 = 19
23 - 3 = 20
24 - 3 = 21
25 - 3 = 22
26 - 3 = 23
27 - 3 = 24
28 - 3 = 25
29 - 3 = 26
30 - 3 = 27
31 - 3 = 28
32 - 3 = 29
33 - 3 = 30
34 - 3 = 31
35 - 3 = 32
36 - 3 = 33
37 - 3 = 34
38 - 3 = 35
39 - 3 = 36
40 - 3 = 37
41 - 3 = 38
42 - 3 = 39
43 - 3 = 40
44 - 3 = 41
45 - 3 = 42
46 - 3 = 43
47 - 3 = 44
48 - 3 = 45
49 - 3 = 46
50 - 3 = 47
51 - 3 = 48
52 - 3 = 49
53 - 3 = 50
54 - 3 = 51
55 - 3 = 52
56 - 3 = 53
57 - 3 = 54
58 - 3 = 55
59 - 3 = 56
60 - 3 = 57
61 - 3 = 58
62 - 3 = 59
63 - 3 = 60
64 - 3 = 61
65 - 3 = 62
66 - 3 = 63
67 - 3 = 64
68 - 3 = 65
69 - 3 = 66
70 - 3 = 67
71 - 3 = 68
72 - 3 = 69
73 - 3 = 70
74 - 3 = 71
75 - 3 = 72
76 - 3 = 73
77 - 3 = 74
78 - 3 = 75
79 - 3 = 76
80 - 3 = 77
81 - 3 = 78
82 - 3 = 79
83 - 3 = 80
84 - 3 = 81
85 - 3 = 82
86 - 3 = 83
87 - 3 = 84
88 - 3 = 85
89 - 3 = 86
90 - 3 = 87
91 - 3 = 88
92 - 3 = 89
93 - 3 = 90
94 - 3 = 91
95 - 3 = 92
96 - 3 = 93
97 - 3 = 94
98 - 3 = 95
99 - 3 = 96
100 - 3 = 97
