1 + 3 = 4
2 + 3 = 5
3 + 3 = 6
4 + 3 = 7
5 + 3 = 8
6 + 3 = 9
7 + 3 = 10
8 + 3 = 11
9 + 3 = 12
10 + 3 = 13
11 + 3 = 14
12 + 3 = 15
13 + 3 = 16
14 + 3 = 17
15 + 3 = 18
16 + 3 = 19
17 + 3 = 20
18 + 3 = 21
19 + 3 = 22
20 + 3 = 23
21 + 3 = 24
22 + 3 = 25
23 + 3 = 26
24 + 3 = 27
25 + 3 = 28
26 + 3 = 29
27 + 3 = 30
28 + 3 = 31
29 + 3 = 32
30 + 3 = 33
31 + 3 = 34
32 + 3 = 35
33 + 3 = 36
34 + 3 = 37
35 + 3 = 38
36 + 3 = 39
37 + 3 = 40
38 + 3 = 41
39 + 3 = 42
40 + 3 = 43
41 + 3 = 44
42 + 3 = 45
43 + 3 = 46
44 + 3 = 47
45 + 3 = 48
46 + 3 = 49
47 + 3 = 50
48 + 3 = 51
49 + 3 = 52
50 + 3 = 53
51 + 3 = 54
52 + 3 = 55
53 + 3 = 56
54 + 3 = 57
55 + 3 = 58
56 + 3 = 59
57 + 3 = 60
58 + 3 = 61
59 + 3 = 62
60 + 3 = 63
61 + 3 = 64
62 + 3 = 65
63 + 3 = 66
64 + 3 = 67
65 + 3 = 68
66 + 3 = 69
67 + 3 = 70
68 + 3 = 71
69 + 3 = 72
70 + 3 = 73
71 + 3 = 74
72 + 3 = 75
73 + 3 = 76
74 + 3 = 77
75 + 3 = 78
76 + 3 = 79
77 + 3 = 80
78 + 3 = 81
79 + 3 = 82
80 + 3 = 83
81 + 3 = 84
82 + 3 = 85
83 + 3 = 86
84 + 3 = 87
85 + 3 = 88
86 + 3 = 89
87 + 3 = 90
88 + 3 = 91
89 + 3 = 92
90 + 3 = 93
91 + 3 = 94
92 + 3 = 95
93 + 3 = 96
94 + 3 = 97
95 + 3 = 98
96 + 3 = 99
97 + 3 = 100
98 + 3 = 101
99 + 3 = 102
100 + 3 = 103
