﻿web_cooperator_id	last_name	title	first_name	job	organization	organization_code	address_line1	address_line2	address_line3	city	postal_index	geography_id	primary_phone	secondary_phone	fax	email	is_active	category_code	organization_region	discipline	initials	note	created_date	created_by	modified_date	modified_by	owned_date	owned_by
1	Anonymous	\N	guest	\N	Org	\N	add1	\N	\N	Beltsville	12345	926	1234	\N	\N	guest@example.com	Y	\N	\N	\N	\N	\N	2010-12-30 07:24:49	5	\N	\N	2010-12-30 07:24:49	5
2	Tester	Dr.	FeedbackSubmitter	\N	Org	\N	addy1	\N	\N	Silver City	54321	926	12345555	\N	\N	fbsubmitter@example.com	Y	\N	\N	\N	\N	\N	2010-12-30 07:26:44	6	\N	\N	2010-12-30 07:26:44	6
3	Tester	Dr.	FeedbackOwner	\N	Org	\N	addy1	\N	\N	Atlantis	12345	926	1234	\N	\N	fbowner@example.com	Y	\N	\N	\N	\N	\N	2010-12-30 07:28:49	5	\N	\N	2010-12-30 07:28:49	5
