﻿sys_index_id	sys_table_id	index_name	is_unique	created_date	created_by	modified_date	modified_by	owned_date	owned_by
1	1	ndx_uniq_ac	Y	2009-02-04 18:54:39	1	2018-11-28 22:58:21	48	2009-02-04 18:54:39	1
3	1	ndx_fk_a_t	N	2009-02-04 19:45:29	1	2018-11-28 22:58:21	48	2009-02-04 19:45:29	1
5	1	ndx_fk_a_created	N	2009-02-04 19:46:04	1	2018-11-28 22:58:21	48	2009-02-04 19:46:04	1
6	1	ndx_fk_a_modified	N	2009-02-04 19:46:04	1	2018-11-28 22:58:21	48	2009-02-04 19:46:04	1
7	1	ndx_fk_a_owned	N	2009-02-04 19:46:04	1	2018-11-28 22:58:21	48	2009-02-04 19:46:04	1
8	2	ndx_fk_aa_a	N	2009-02-04 19:52:08	1	2011-05-26 20:54:02	48	2009-02-04 19:52:08	1
9	2	ndx_fk_aa_c	N	2009-02-04 19:52:08	1	2011-05-26 20:54:02	48	2009-02-04 19:52:08	1
10	2	ndx_fk_aa_m	N	2009-02-04 19:52:08	1	2011-05-26 20:54:02	48	2009-02-04 19:52:08	1
11	2	ndx_fk_aa_created	N	2009-02-04 19:52:08	1	2011-05-26 20:54:02	48	2009-02-04 19:52:08	1
12	2	ndx_fk_aa_modified	N	2009-02-04 19:52:08	1	2011-05-26 20:54:02	48	2009-02-04 19:52:08	1
13	2	ndx_fk_aa_owned	N	2009-02-04 19:52:08	1	2011-05-26 20:54:02	48	2009-02-04 19:52:08	1
43	8	ndx_uniq_ipr	Y	2009-02-04 19:52:09	1	2010-08-25 22:33:37	1	2009-02-04 19:52:09	1
44	8	ndx_fk_ar_a	N	2009-02-04 19:52:09	1	2010-08-25 22:33:37	1	2009-02-04 19:52:09	1
46	8	ndx_ipr_number	N	2009-02-04 19:52:09	1	2010-08-25 22:33:37	1	2009-02-04 19:52:09	1
47	8	ndx_ipr_crop	N	2009-02-04 19:52:09	1	2010-08-25 22:33:37	1	2009-02-04 19:52:09	1
48	8	ndx_fk_ar_c	N	2009-02-04 19:52:09	1	2010-08-25 22:33:37	1	2009-02-04 19:52:09	1
50	8	ndx_fk_ar_created	N	2009-02-04 19:52:09	1	2010-08-25 22:33:37	1	2009-02-04 19:52:09	1
51	8	ndx_fk_ar_modified	N	2009-02-04 19:52:09	1	2010-08-25 22:33:37	1	2009-02-04 19:52:09	1
52	8	ndx_fk_ar_owned	N	2009-02-04 19:52:09	1	2010-08-25 22:33:37	1	2009-02-04 19:52:09	1
68	11	ndx_fk_ap_created	N	2009-02-04 19:52:09	1	2010-10-21 14:14:01	48	2009-02-04 19:52:09	1
69	11	ndx_fk_ap_modified	N	2009-02-04 19:52:09	1	2010-10-21 14:14:01	48	2009-02-04 19:52:09	1
70	11	ndx_fk_ap_owned	N	2009-02-04 19:52:09	1	2010-10-21 14:14:01	48	2009-02-04 19:52:09	1
71	12	ndx_fk_aq_a	N	2009-02-04 19:52:10	1	2010-08-25 22:33:37	1	2009-02-04 19:52:10	1
72	12	ndx_fk_aq_c	N	2009-02-04 19:52:10	1	2010-08-25 22:33:37	1	2009-02-04 19:52:10	1
73	12	ndx_fk_aq_created	N	2009-02-04 19:52:10	1	2010-08-25 22:33:37	1	2009-02-04 19:52:10	1
74	12	ndx_fk_aq_modified	N	2009-02-04 19:52:10	1	2010-08-25 22:33:37	1	2009-02-04 19:52:10	1
75	12	ndx_fk_aq_owned	N	2009-02-04 19:52:10	1	2010-08-25 22:33:37	1	2009-02-04 19:52:10	1
81	14	ndx_fk_asm_as	N	2009-02-04 19:52:10	1	2010-08-25 22:33:37	1	2009-02-04 19:52:10	1
82	14	ndx_fk_asm_c	N	2009-02-04 19:52:10	1	2010-08-25 22:33:37	1	2009-02-04 19:52:10	1
83	14	ndx_fk_asm_created	N	2009-02-04 19:52:10	1	2010-08-25 22:33:37	1	2009-02-04 19:52:10	1
84	14	ndx_fk_asm_modified	N	2009-02-04 19:52:10	1	2010-08-25 22:33:37	1	2009-02-04 19:52:10	1
85	14	ndx_fk_asm_owned	N	2009-02-04 19:52:10	1	2010-08-25 22:33:37	1	2009-02-04 19:52:10	1
97	17	ndx_fk_are_sl	N	2009-02-04 19:52:10	1	2010-09-29 02:15:03	1	2009-02-04 19:52:10	1
98	17	ndx_fk_are_created	N	2009-02-04 19:52:10	1	2010-09-29 02:15:03	1	2009-02-04 19:52:10	1
99	17	ndx_fk_are_modified	N	2009-02-04 19:52:10	1	2010-09-29 02:15:03	1	2009-02-04 19:52:10	1
100	17	ndx_fk_are_owned	N	2009-02-04 19:52:10	1	2010-09-29 02:15:03	1	2009-02-04 19:52:10	1
101	18	ndx_fk_auil_c	N	2009-02-04 19:52:10	1	2010-08-25 22:33:38	1	2009-02-04 19:52:10	1
102	18	ndx_uil_group	N	2009-02-04 19:52:10	1	2010-08-25 22:33:38	1	2009-02-04 19:52:10	1
103	18	ndx_uil_tab	N	2009-02-04 19:52:10	1	2010-08-25 22:33:38	1	2009-02-04 19:52:10	1
104	18	ndx_fk_auil_created	N	2009-02-04 19:52:10	1	2010-08-25 22:33:38	1	2009-02-04 19:52:10	1
105	18	ndx_fk_auil_modified	N	2009-02-04 19:52:11	1	2010-08-25 22:33:38	1	2009-02-04 19:52:11	1
106	18	ndx_fk_auil_owned	N	2009-02-04 19:52:11	1	2010-08-25 22:33:38	1	2009-02-04 19:52:11	1
107	19	ndx_fk_ci_l	N	2009-02-04 19:52:11	1	2016-06-05 23:55:17	48	2009-02-04 19:52:11	1
108	19	ndx_fk_ci_created	N	2009-02-04 19:52:11	1	2016-06-05 23:55:17	48	2009-02-04 19:52:11	1
109	19	ndx_fk_ci_modified	N	2009-02-04 19:52:11	1	2016-06-05 23:55:17	48	2009-02-04 19:52:11	1
110	19	ndx_fk_ci_owned	N	2009-02-04 19:52:11	1	2016-06-05 23:55:17	48	2009-02-04 19:52:11	1
118	22	ndx_fk_cdval_cdgrp	N	2009-02-04 19:52:11	1	2010-08-25 22:33:38	1	2009-02-04 19:52:11	1
119	22	ndx_fk_cdval_created	N	2009-02-04 19:52:11	1	2010-08-25 22:33:38	1	2009-02-04 19:52:11	1
120	22	ndx_fk_cdval_modified	N	2009-02-04 19:52:11	1	2010-08-25 22:33:38	1	2009-02-04 19:52:11	1
121	22	ndx_fk_cdval_owned	N	2009-02-04 19:52:11	1	2010-08-25 22:33:38	1	2009-02-04 19:52:11	1
122	23	ndx_fk_cvl_cv	N	2009-02-04 19:52:11	1	2010-08-25 22:33:38	1	2009-02-04 19:52:11	1
123	23	ndx_fk_cvl_sl	N	2009-02-04 19:52:11	1	2010-08-25 22:33:38	1	2009-02-04 19:52:11	1
124	23	ndx_fk_cvl_created	N	2009-02-04 19:52:11	1	2010-08-25 22:33:38	1	2009-02-04 19:52:11	1
125	23	ndx_fk_cvl_modified	N	2009-02-04 19:52:11	1	2010-08-25 22:33:38	1	2009-02-04 19:52:11	1
126	23	ndx_fk_cvl_owned	N	2009-02-04 19:52:11	1	2010-08-25 22:33:38	1	2009-02-04 19:52:11	1
128	24	ndx_fk_c_cur_c	N	2009-02-04 19:52:11	1	2016-06-06 00:21:48	48	2009-02-04 19:52:11	1
129	24	ndx_co_full_name	N	2009-02-04 19:52:11	1	2016-06-06 00:21:48	48	2009-02-04 19:52:11	1
130	24	ndx_co_org_code	N	2009-02-04 19:52:11	1	2016-06-06 00:21:48	48	2009-02-04 19:52:11	1
131	24	ndx_fk_c_sl	N	2009-02-04 19:52:11	1	2016-06-06 00:21:48	48	2009-02-04 19:52:11	1
132	24	ndx_fk_c_created	N	2009-02-04 19:52:11	1	2016-06-06 00:21:48	48	2009-02-04 19:52:11	1
133	24	ndx_fk_c_modified	N	2009-02-04 19:52:11	1	2016-06-06 00:21:48	48	2009-02-04 19:52:11	1
134	24	ndx_fk_c_owned	N	2009-02-04 19:52:12	1	2016-06-06 00:21:48	48	2009-02-04 19:52:12	1
135	25	ndx_uniq_cg_name	Y	2009-02-04 19:52:12	1	2010-08-25 22:33:39	1	2009-02-04 19:52:12	1
136	25	ndx_fk_cg_created	N	2009-02-04 19:52:12	1	2010-08-25 22:33:39	1	2009-02-04 19:52:12	1
137	25	ndx_fk_cg_modified	N	2009-02-04 19:52:12	1	2010-08-25 22:33:39	1	2009-02-04 19:52:12	1
138	25	ndx_fk_cg_owned	N	2009-02-04 19:52:12	1	2010-08-25 22:33:39	1	2009-02-04 19:52:12	1
139	26	ndx_fk_cm_c	N	2009-02-04 19:52:12	1	2010-08-25 22:33:39	1	2009-02-04 19:52:12	1
140	26	ndx_fk_cm_cg	N	2009-02-04 19:52:12	1	2010-08-25 22:33:39	1	2009-02-04 19:52:12	1
141	26	ndx_fk_cm_created	N	2009-02-04 19:52:12	1	2010-08-25 22:33:39	1	2009-02-04 19:52:12	1
142	26	ndx_fk_cm_modified	N	2009-02-04 19:52:12	1	2010-08-25 22:33:39	1	2009-02-04 19:52:12	1
143	26	ndx_fk_cm_owned	N	2009-02-04 19:52:12	1	2010-08-25 22:33:39	1	2009-02-04 19:52:12	1
145	27	ndx_fk_cr_created	N	2009-02-04 19:52:12	1	2011-06-09 16:05:26	48	2009-02-04 19:52:12	1
146	27	ndx_fk_cr_modified	N	2009-02-04 19:52:12	1	2011-06-09 16:05:26	48	2009-02-04 19:52:12	1
147	27	ndx_fk_cr_owned	N	2009-02-04 19:52:12	1	2011-06-09 16:05:26	48	2009-02-04 19:52:12	1
148	28	ndx_uniq_ct	Y	2009-02-04 19:52:12	1	2012-08-28 20:47:32	48	2009-02-04 19:52:12	1
149	28	ndx_fk_ct_cr	N	2009-02-04 19:52:12	1	2012-08-28 20:47:32	48	2009-02-04 19:52:12	1
150	28	ndx_fk_ct_created	N	2009-02-04 19:52:12	1	2012-08-28 20:47:32	48	2009-02-04 19:52:12	1
151	28	ndx_fk_ct_modified	N	2009-02-04 19:52:12	1	2012-08-28 20:47:32	48	2009-02-04 19:52:12	1
152	28	ndx_fk_ct_owned	N	2009-02-04 19:52:12	1	2012-08-28 20:47:32	48	2009-02-04 19:52:12	1
153	29	ndx_fk_tct_tr	N	2009-02-04 19:52:12	1	2010-08-25 22:33:39	1	2009-02-04 19:52:12	1
154	29	ndx_fk_tct_created	N	2009-02-04 19:52:12	1	2010-08-25 22:33:39	1	2009-02-04 19:52:12	1
155	29	ndx_fk_tct_modified	N	2009-02-04 19:52:12	1	2010-08-25 22:33:39	1	2009-02-04 19:52:12	1
156	29	ndx_fk_tct_owned	N	2009-02-04 19:52:12	1	2010-08-25 22:33:39	1	2009-02-04 19:52:12	1
157	30	ndx_fk_ctcl_tc	N	2009-02-04 19:52:12	1	2010-08-25 22:33:39	1	2009-02-04 19:52:12	1
158	30	ndx_fk_ctcl_sl	N	2009-02-04 19:52:12	1	2010-08-25 22:33:39	1	2009-02-04 19:52:12	1
159	30	ndx_fk_ctcl_created	N	2009-02-04 19:52:12	1	2010-08-25 22:33:39	1	2009-02-04 19:52:12	1
160	30	ndx_fk_ctcl_modified	N	2009-02-04 19:52:12	1	2010-08-25 22:33:39	1	2009-02-04 19:52:12	1
161	30	ndx_fk_ctcl_owned	N	2009-02-04 19:52:12	1	2010-08-25 22:33:39	1	2009-02-04 19:52:12	1
162	31	ndx_fk_cto_ct	N	2009-02-04 19:52:13	1	2010-10-21 14:37:19	48	2009-02-04 19:52:13	1
163	31	ndx_fk_cto_ctc	N	2009-02-04 19:52:13	1	2010-10-21 14:37:19	48	2009-02-04 19:52:13	1
165	31	ndx_fk_cto_m	N	2009-02-04 19:52:13	1	2010-10-21 14:37:20	48	2009-02-04 19:52:13	1
167	31	ndx_fk_cto_i	N	2009-02-04 19:52:13	1	2010-10-21 14:37:20	48	2009-02-04 19:52:13	1
168	31	ndx_fk_cto_created	N	2009-02-04 19:52:13	1	2010-10-21 14:37:18	48	2009-02-04 19:52:13	1
169	31	ndx_fk_cto_modified	N	2009-02-04 19:52:13	1	2010-10-21 14:37:21	48	2009-02-04 19:52:13	1
170	31	ndx_fk_cto_owned	N	2009-02-04 19:52:13	1	2010-10-21 14:37:21	48	2009-02-04 19:52:13	1
208	38	ndx_fk_g_cur_g	N	2009-02-04 19:52:14	1	2018-11-14 20:57:10	48	2009-02-04 19:52:14	1
213	38	ndx_fk_g_created	N	2009-02-04 19:52:14	1	2018-11-14 20:57:10	48	2009-02-04 19:52:14	1
214	38	ndx_fk_g_modified	N	2009-02-04 19:52:14	1	2018-11-14 20:57:10	48	2009-02-04 19:52:14	1
215	38	ndx_fk_g_owned	N	2009-02-04 19:52:14	1	2018-11-14 20:57:10	48	2009-02-04 19:52:14	1
219	40	ndx_uniq_inv	Y	2009-02-04 19:52:14	1	2013-01-24 16:57:49	48	2009-02-04 19:52:14	1
220	40	ndx_inv_prefix	N	2009-02-04 19:52:14	1	2013-01-24 16:57:49	48	2009-02-04 19:52:14	1
221	40	ndx_inv_number	N	2009-02-04 19:52:14	1	2013-01-24 16:57:49	48	2009-02-04 19:52:14	1
222	40	ndx_fk_i_im	N	2009-02-04 19:52:14	1	2013-01-24 16:57:49	48	2009-02-04 19:52:14	1
224	40	ndx_fk_i_a	N	2009-02-04 19:52:14	1	2013-01-24 16:57:48	48	2009-02-04 19:52:14	1
225	40	ndx_fk_i_parent_i	N	2009-02-04 19:52:14	1	2013-01-24 16:57:49	48	2009-02-04 19:52:14	1
227	40	ndx_fk_i_backup_i	N	2009-02-04 19:52:14	1	2013-01-24 16:57:48	48	2009-02-04 19:52:14	1
228	40	ndx_fk_i_created	N	2009-02-04 19:52:14	1	2013-01-24 16:57:48	48	2009-02-04 19:52:14	1
229	40	ndx_fk_i_modified	N	2009-02-04 19:52:14	1	2013-01-24 16:57:49	48	2009-02-04 19:52:14	1
230	40	ndx_fk_i_owned	N	2009-02-04 19:52:14	1	2013-01-24 16:57:49	48	2009-02-04 19:52:14	1
231	41	ndx_fk_ia_i	N	2009-02-04 19:52:15	1	2016-06-05 23:59:00	48	2009-02-04 19:52:15	1
232	41	ndx_fk_ia_c	N	2009-02-04 19:52:15	1	2016-06-05 23:59:00	48	2009-02-04 19:52:15	1
233	41	ndx_fk_ia_m	N	2009-02-04 19:52:15	1	2016-06-05 23:59:00	48	2009-02-04 19:52:15	1
234	41	ndx_fk_ia_created	N	2009-02-04 19:52:15	1	2016-06-05 23:59:00	48	2009-02-04 19:52:15	1
235	41	ndx_fk_ia_modified	N	2009-02-04 19:52:15	1	2016-06-05 23:59:00	48	2009-02-04 19:52:15	1
236	41	ndx_fk_ia_owned	N	2009-02-04 19:52:15	1	2016-06-05 23:59:00	48	2009-02-04 19:52:15	1
251	45	ndx_fk_im_co	N	2009-02-04 19:52:15	1	2014-07-16 22:04:11	48	2009-02-04 19:52:15	1
252	45	ndx_fk_im_created	N	2009-02-04 19:52:15	1	2014-07-16 22:04:11	48	2009-02-04 19:52:15	1
253	45	ndx_fk_im_modified	N	2009-02-04 19:52:15	1	2014-07-16 22:04:11	48	2009-02-04 19:52:15	1
254	45	ndx_fk_im_owned	N	2009-02-04 19:52:15	1	2014-07-16 22:04:11	48	2009-02-04 19:52:15	1
255	46	ndx_uniq_iqs	Y	2009-02-04 19:52:15	1	2013-01-24 20:54:29	48	2009-02-04 19:52:15	1
256	46	ndx_fk_iqs_i	N	2009-02-04 19:52:15	1	2013-01-24 20:54:29	48	2009-02-04 19:52:15	1
257	46	ndx_iqs_test	N	2009-02-04 19:52:15	1	2013-01-24 20:54:29	48	2009-02-04 19:52:15	1
258	46	ndx_fk_iqs_created	N	2009-02-04 19:52:15	1	2013-01-24 20:54:29	48	2009-02-04 19:52:15	1
259	46	ndx_fk_iqs_modified	N	2009-02-04 19:52:15	1	2013-01-24 20:54:29	48	2009-02-04 19:52:15	1
260	46	ndx_fk_iqs_owned	N	2009-02-04 19:52:15	1	2013-01-24 20:54:29	48	2009-02-04 19:52:15	1
261	47	ndx_fk_iv_i	N	2009-02-04 19:52:16	1	2017-07-24 19:12:12	48	2009-02-04 19:52:16	1
263	47	ndx_fk_iv_created	N	2009-02-04 19:52:16	1	2017-07-24 19:12:12	48	2009-02-04 19:52:16	1
264	47	ndx_fk_iv_modified	N	2009-02-04 19:52:16	1	2017-07-24 19:12:12	48	2009-02-04 19:52:16	1
265	47	ndx_fk_iv_owned	N	2009-02-04 19:52:16	1	2017-07-24 19:12:12	48	2009-02-04 19:52:16	1
266	48	ndx_fk_l_created	N	2009-02-04 19:52:16	1	2019-06-18 15:08:02	48	2009-02-04 19:52:16	1
267	48	ndx_fk_l_modified	N	2009-02-04 19:52:16	1	2019-06-18 15:08:02	48	2009-02-04 19:52:16	1
268	48	ndx_fk_l_owned	N	2009-02-04 19:52:16	1	2019-06-18 15:08:02	48	2009-02-04 19:52:16	1
269	49	ndx_uniq_m	Y	2009-02-04 19:52:16	1	2016-06-06 00:11:14	48	2009-02-04 19:52:16	1
270	49	ndx_fk_m_g	N	2009-02-04 19:52:16	1	2016-06-06 00:11:14	48	2009-02-04 19:52:16	1
271	49	ndx_fk_m_created	N	2009-02-04 19:52:16	1	2016-06-06 00:11:14	48	2009-02-04 19:52:16	1
272	49	ndx_fk_m_modified	N	2009-02-04 19:52:16	1	2016-06-06 00:11:14	48	2009-02-04 19:52:16	1
273	49	ndx_fk_m_owned	N	2009-02-04 19:52:16	1	2016-06-06 00:11:14	48	2009-02-04 19:52:16	1
279	51	ndx_fk_mm_c	N	2009-02-04 19:52:16	1	2014-03-07 18:14:30	48	2009-02-04 19:52:16	1
280	51	ndx_fk_mm_m	N	2009-02-04 19:52:16	1	2014-03-07 18:14:30	48	2009-02-04 19:52:16	1
281	51	ndx_fk_mm_created	N	2009-02-04 19:52:16	1	2014-03-07 18:14:30	48	2009-02-04 19:52:16	1
282	51	ndx_fk_mm_modified	N	2009-02-04 19:52:16	1	2014-03-07 18:14:30	48	2009-02-04 19:52:16	1
283	51	ndx_fk_mm_owned	N	2009-02-04 19:52:16	1	2014-03-07 18:14:30	48	2009-02-04 19:52:16	1
284	52	ndx_fk_or_original_or	N	2009-02-04 19:52:16	1	2010-12-23 08:10:13	48	2009-02-04 19:52:16	1
288	52	ndx_fk_or_requestor_c	N	2009-02-04 19:52:16	1	2010-12-23 08:10:13	48	2009-02-04 19:52:16	1
289	52	ndx_fk_or_ship_to_c	N	2009-02-04 19:52:16	1	2010-12-23 08:10:13	48	2009-02-04 19:52:16	1
290	52	ndx_fk_or_final_c	N	2009-02-04 19:52:16	1	2010-12-23 08:10:13	48	2009-02-04 19:52:16	1
291	52	ndx_or_obtained	N	2009-02-04 19:52:16	1	2010-12-23 08:10:14	48	2009-02-04 19:52:16	1
292	52	ndx_fk_or_created	N	2009-02-04 19:52:16	1	2010-12-23 08:10:13	48	2009-02-04 19:52:16	1
293	52	ndx_fk_or_modified	N	2009-02-04 19:52:16	1	2010-12-23 08:10:13	48	2009-02-04 19:52:16	1
294	52	ndx_fk_or_owned	N	2009-02-04 19:52:16	1	2010-12-23 08:10:13	48	2009-02-04 19:52:16	1
295	53	ndx_fk_ora_or	N	2009-02-04 19:52:17	1	2014-07-15 20:45:22	48	2009-02-04 19:52:17	1
296	53	ndx_fk_ora_created	N	2009-02-04 19:52:17	1	2014-07-15 20:45:22	48	2009-02-04 19:52:17	1
297	53	ndx_fk_ora_modified	N	2009-02-04 19:52:17	1	2014-07-15 20:45:22	48	2009-02-04 19:52:17	1
298	53	ndx_fk_ora_owned	N	2009-02-04 19:52:17	1	2014-07-15 20:45:22	48	2009-02-04 19:52:17	1
300	54	ndx_fk_ori_or	N	2009-02-04 19:52:17	1	2017-08-16 05:06:33	48	2009-02-04 19:52:17	1
301	54	ndx_ori_item	N	2009-02-04 19:52:17	1	2017-08-16 05:06:33	48	2009-02-04 19:52:17	1
304	54	ndx_fk_ori_i	N	2009-02-04 19:52:17	1	2017-08-16 05:06:33	48	2009-02-04 19:52:17	1
307	54	ndx_fk_ori_created	N	2009-02-04 19:52:17	1	2017-08-16 05:06:33	48	2009-02-04 19:52:17	1
308	54	ndx_fk_ori_modified	N	2009-02-04 19:52:17	1	2017-08-16 05:06:33	48	2009-02-04 19:52:17	1
309	54	ndx_fk_ori_owned	N	2009-02-04 19:52:17	1	2017-08-16 05:06:33	48	2009-02-04 19:52:17	1
314	56	ndx_uniq_re	Y	2009-02-04 19:52:17	1	2010-08-25 22:33:43	1	2009-02-04 19:52:17	1
315	56	ndx_fk_r_created	N	2009-02-04 19:52:17	1	2010-08-25 22:33:43	1	2009-02-04 19:52:17	1
316	56	ndx_fk_r_modified	N	2009-02-04 19:52:17	1	2010-08-25 22:33:43	1	2009-02-04 19:52:17	1
317	56	ndx_fk_r_owned	N	2009-02-04 19:52:17	1	2010-08-25 22:33:43	1	2009-02-04 19:52:17	1
397	73	ndx_ta_name	N	2009-02-04 19:52:20	1	2010-08-25 22:33:47	1	2009-02-04 19:52:20	1
398	73	ndx_fk_ta_created	N	2009-02-04 19:52:20	1	2010-08-25 22:33:47	1	2009-02-04 19:52:20	1
399	73	ndx_fk_ta_modified	N	2009-02-04 19:52:20	1	2010-08-25 22:33:47	1	2009-02-04 19:52:20	1
400	73	ndx_fk_ta_owned	N	2009-02-04 19:52:20	1	2010-08-25 22:33:47	1	2009-02-04 19:52:20	1
407	75	ndx_cn_name	N	2009-02-04 19:52:20	1	2019-06-17 22:09:59	48	2009-02-04 19:52:20	1
408	75	ndx_cn_simplified_name	N	2009-02-04 19:52:20	1	2019-06-17 22:09:59	48	2009-02-04 19:52:20	1
409	75	ndx_fk_tcn_created	N	2009-02-04 19:52:20	1	2019-06-17 22:09:59	48	2009-02-04 19:52:20	1
410	75	ndx_fk_tcn_modified	N	2009-02-04 19:52:20	1	2019-06-17 22:09:59	48	2009-02-04 19:52:20	1
411	75	ndx_fk_tcn_owned	N	2009-02-04 19:52:20	1	2019-06-17 22:09:59	48	2009-02-04 19:52:20	1
418	77	ndx_fk_tf_cur_tf	N	2009-02-04 19:52:21	1	2014-03-07 18:16:29	48	2009-02-04 19:52:21	1
419	77	ndx_fk_tf_created	N	2009-02-04 19:52:21	1	2014-03-07 18:16:29	48	2009-02-04 19:52:21	1
420	77	ndx_fk_tf_modified	N	2009-02-04 19:52:21	1	2014-03-07 18:16:29	48	2009-02-04 19:52:21	1
421	77	ndx_fk_tf_owned	N	2009-02-04 19:52:21	1	2014-03-07 18:16:29	48	2009-02-04 19:52:21	1
422	78	ndx_uniq_tg	Y	2009-02-04 19:52:21	1	2016-06-06 00:30:03	48	2009-02-04 19:52:21	1
424	78	ndx_fk_tg_tf	N	2009-02-04 19:52:21	1	2016-06-06 00:30:03	48	2009-02-04 19:52:21	1
426	78	ndx_fk_tg_created	N	2009-02-04 19:52:21	1	2016-06-06 00:30:03	48	2009-02-04 19:52:21	1
427	78	ndx_fk_tg_modified	N	2009-02-04 19:52:21	1	2016-06-06 00:30:03	48	2009-02-04 19:52:21	1
428	78	ndx_fk_tg_owned	N	2009-02-04 19:52:21	1	2016-06-06 00:30:03	48	2009-02-04 19:52:21	1
450	83	ndx_tu_usage	N	2009-02-04 19:52:22	1	2014-07-22 14:28:24	48	2009-02-04 19:52:22	1
451	83	ndx_fk_tus_created	N	2009-02-04 19:52:22	1	2014-07-22 14:28:24	48	2009-02-04 19:52:22	1
452	83	ndx_fk_tus_modified	N	2009-02-04 19:52:22	1	2014-07-22 14:28:24	48	2009-02-04 19:52:22	1
453	83	ndx_fk_tus_owned	N	2009-02-04 19:52:22	1	2014-07-22 14:28:24	48	2009-02-04 19:52:22	1
475	103	ndx_fk_ga_created	N	2009-08-14 17:03:49	1	2010-08-25 22:33:40	1	2009-08-14 17:03:49	1
476	103	ndx_fk_ga_gm	N	2009-08-14 17:03:49	1	2010-08-25 22:33:40	1	2009-08-14 17:03:49	1
477	103	ndx_fk_ga_m	N	2009-08-14 17:03:49	1	2010-08-25 22:33:40	1	2009-08-14 17:03:49	1
478	103	ndx_fk_ga_modified	N	2009-08-14 17:03:49	1	2010-08-25 22:33:40	1	2009-08-14 17:03:49	1
479	103	ndx_fk_ga_owned	N	2009-08-14 17:03:49	1	2010-08-25 22:33:40	1	2009-08-14 17:03:49	1
480	103	ndx_uniq_ga	Y	2009-08-14 17:03:49	1	2010-08-25 22:33:40	1	2009-08-14 17:03:49	1
481	104	ndx_fk_gm_created	N	2009-08-14 17:03:49	1	2014-07-16 21:55:57	48	2009-08-14 17:03:49	1
482	104	ndx_fk_gm_modified	N	2009-08-14 17:03:49	1	2014-07-16 21:55:57	48	2009-08-14 17:03:49	1
483	104	ndx_fk_gm_owned	N	2009-08-14 17:03:49	1	2014-07-16 21:55:57	48	2009-08-14 17:03:49	1
485	104	ndx_uniq_gm_crop	Y	2009-08-14 17:03:49	1	2014-07-16 21:55:57	48	2009-08-14 17:03:49	1
491	106	ndx_fk_go_created	N	2009-08-14 17:03:49	1	2013-01-24 21:09:39	48	2009-08-14 17:03:49	1
492	106	ndx_fk_go_ga	N	2009-08-14 17:03:49	1	2013-01-24 21:09:39	48	2009-08-14 17:03:49	1
494	106	ndx_fk_go_modified	N	2009-08-14 17:03:49	1	2013-01-24 21:09:39	48	2009-08-14 17:03:49	1
495	106	ndx_fk_go_owned	N	2009-08-14 17:03:49	1	2013-01-24 21:09:39	48	2009-08-14 17:03:49	1
496	106	ndx_uniq_go	Y	2009-08-14 17:03:49	1	2013-01-24 21:09:39	48	2009-08-14 17:03:49	1
501	23	ndx_uniq_cvl	Y	2010-04-22 19:35:15	1	2010-08-25 22:33:38	1	2010-04-22 19:35:15	1
502	30	ndx_uniq_ctcl	Y	2010-04-22 19:37:33	1	2010-08-25 22:33:39	1	2010-04-22 19:37:33	1
527	126	ndx_fk_sugs_co	N	2010-05-06 06:46:18	1	2010-08-25 22:33:38	1	2010-05-06 06:46:18	1
528	126	ndx_fk_sugs_created	N	2010-05-06 06:46:18	1	2010-08-25 22:33:38	1	2010-05-06 06:46:18	1
529	126	ndx_fk_sugs_modified	N	2010-05-06 06:46:18	1	2010-08-25 22:33:38	1	2010-05-06 06:46:18	1
530	126	ndx_fk_sugs_owned	N	2010-05-06 06:46:18	1	2010-08-25 22:33:38	1	2010-05-06 06:46:18	1
531	126	ndx_uniq_sugs	Y	2010-05-06 06:46:18	1	2010-08-25 22:33:38	1	2010-05-06 06:46:18	1
550	131	ndx_fk_c	N	2010-06-28 18:43:21	1	2013-01-24 16:30:48	48	2010-06-28 18:43:21	1
551	131	ndx_fk_created	N	2010-06-28 18:43:21	1	2013-01-24 16:30:48	48	2010-06-28 18:43:21	1
552	131	ndx_fk_modified	N	2010-06-28 18:43:21	1	2013-01-24 16:30:48	48	2010-06-28 18:43:21	1
553	131	ndx_fk_owned	N	2010-06-28 18:43:21	1	2013-01-24 16:30:48	48	2010-06-28 18:43:21	1
554	131	ndx_uniq_ca	Y	2010-06-28 18:43:21	1	2013-01-24 16:30:48	48	2010-06-28 18:43:21	1
555	132	ndx_fk_cta_created	N	2010-06-28 18:43:21	1	2013-01-24 16:33:55	48	2010-06-28 18:43:21	1
556	132	ndx_fk_cta_ct	N	2010-06-28 18:43:21	1	2013-01-24 16:33:55	48	2010-06-28 18:43:21	1
557	132	ndx_fk_cta_modified	N	2010-06-28 18:43:21	1	2013-01-24 16:33:55	48	2010-06-28 18:43:21	1
558	132	ndx_fk_cta_owned	N	2010-06-28 18:43:21	1	2013-01-24 16:33:55	48	2010-06-28 18:43:21	1
559	132	ndx_uniq_cta	Y	2010-06-28 18:43:21	1	2013-01-24 16:33:55	48	2010-06-28 18:43:21	1
560	133	ndx_fk_ctca_created	N	2010-06-28 18:43:21	1	2013-01-24 16:37:56	48	2010-06-28 18:43:21	1
561	133	ndx_fk_ctca_ctc	N	2010-06-28 18:43:21	1	2013-01-24 16:37:56	48	2010-06-28 18:43:21	1
562	133	ndx_fk_ctca_modified	N	2010-06-28 18:43:21	1	2013-01-24 16:37:56	48	2010-06-28 18:43:21	1
563	133	ndx_fk_ctca_owned	N	2010-06-28 18:43:21	1	2013-01-24 16:37:56	48	2010-06-28 18:43:21	1
564	133	ndx_uniq_ctca	Y	2010-06-28 18:43:21	1	2013-01-24 16:37:56	48	2010-06-28 18:43:21	1
565	134	ndx_fk_ctl_created	N	2010-06-28 18:43:21	1	2010-08-25 22:33:39	1	2010-06-28 18:43:21	1
566	134	ndx_fk_ctl_modified	N	2010-06-28 18:43:21	1	2010-08-25 22:33:39	1	2010-06-28 18:43:21	1
567	134	ndx_fk_ctl_owned	N	2010-06-28 18:43:21	1	2010-08-25 22:33:39	1	2010-06-28 18:43:21	1
568	134	ndx_fk_ctl_sl	N	2010-06-28 18:43:21	1	2010-08-25 22:33:39	1	2010-06-28 18:43:21	1
569	134	ndx_fk_ctl_t	N	2010-06-28 18:43:21	1	2010-08-25 22:33:39	1	2010-06-28 18:43:21	1
570	134	ndx_uniq_ctl	Y	2010-06-28 18:43:21	1	2010-08-25 22:33:39	1	2010-06-28 18:43:21	1
571	135	ndx_fk_god_created	N	2010-06-28 18:43:21	1	2010-08-25 22:33:40	1	2010-06-28 18:43:21	1
572	135	ndx_fk_god_ga	N	2010-06-28 18:43:21	1	2010-08-25 22:33:40	1	2010-06-28 18:43:21	1
573	135	ndx_fk_god_i	N	2010-06-28 18:43:21	1	2010-08-25 22:33:40	1	2010-06-28 18:43:21	1
574	135	ndx_fk_god_modified	N	2010-06-28 18:43:21	1	2010-08-25 22:33:40	1	2010-06-28 18:43:21	1
575	135	ndx_fk_god_ob	N	2010-06-28 18:43:21	1	2010-08-25 22:33:40	1	2010-06-28 18:43:21	1
576	135	ndx_fk_god_owned	N	2010-06-28 18:43:21	1	2010-08-25 22:33:40	1	2010-06-28 18:43:21	1
577	135	ndx_uniq_god	Y	2010-06-28 18:43:21	1	2010-08-25 22:33:40	1	2010-06-28 18:43:21	1
584	137	ndx_fk_grm_created	N	2010-06-28 18:43:21	1	2010-08-25 22:33:40	1	2010-06-28 18:43:21	1
585	137	ndx_fk_grm_g	N	2010-06-28 18:43:21	1	2010-08-25 22:33:40	1	2010-06-28 18:43:21	1
586	137	ndx_fk_grm_modified	N	2010-06-28 18:43:21	1	2010-08-25 22:33:40	1	2010-06-28 18:43:21	1
587	137	ndx_fk_grm_owned	N	2010-06-28 18:43:21	1	2010-08-25 22:33:40	1	2010-06-28 18:43:21	1
588	137	ndx_fk_grm_r	N	2010-06-28 18:43:21	1	2010-08-25 22:33:40	1	2010-06-28 18:43:21	1
589	137	ndx_uniq_grm	Y	2010-06-28 18:43:21	1	2010-08-25 22:33:40	1	2010-06-28 18:43:21	1
602	140	ndx_fk_ivd_c	N	2010-06-28 18:43:22	1	2017-07-24 19:13:01	48	2010-06-28 18:43:22	1
603	140	ndx_fk_ivd_created	N	2010-06-28 18:43:22	1	2017-07-24 19:13:01	48	2010-06-28 18:43:22	1
604	140	ndx_fk_ivd_iv	N	2010-06-28 18:43:22	1	2017-07-24 19:13:01	48	2010-06-28 18:43:22	1
605	140	ndx_fk_ivd_modified	N	2010-06-28 18:43:22	1	2017-07-24 19:13:01	48	2010-06-28 18:43:22	1
606	140	ndx_fk_ivd_ori	N	2010-06-28 18:43:22	1	2017-07-24 19:13:01	48	2010-06-28 18:43:22	1
607	140	ndx_fk_ivd_owned	N	2010-06-28 18:43:22	1	2017-07-24 19:13:01	48	2010-06-28 18:43:22	1
608	140	ndx_uniq_ivd	Y	2010-06-28 18:43:22	1	2017-07-24 19:13:01	48	2010-06-28 18:43:22	1
609	141	ndx_fk_ivr_created	N	2010-06-28 18:43:22	1	2017-07-24 19:13:14	48	2010-06-28 18:43:22	1
610	141	ndx_fk_ivr_modified	N	2010-06-28 18:43:22	1	2017-07-24 19:13:14	48	2010-06-28 18:43:22	1
611	141	ndx_fk_ivr_owned	N	2010-06-28 18:43:22	1	2017-07-24 19:13:14	48	2010-06-28 18:43:22	1
613	141	ndx_uniq_ivr	Y	2010-06-28 18:43:22	1	2017-07-24 19:13:14	48	2010-06-28 18:43:22	1
614	142	ndx_fk_ng_created	N	2010-06-28 18:43:22	1	2010-08-25 22:33:42	1	2010-06-28 18:43:22	1
615	142	ndx_fk_ng_modified	N	2010-06-28 18:43:22	1	2010-08-25 22:33:42	1	2010-06-28 18:43:22	1
616	142	ndx_fk_ng_owned	N	2010-06-28 18:43:22	1	2010-08-25 22:33:42	1	2010-06-28 18:43:22	1
617	142	ndx_uniq_ng	Y	2010-06-28 18:43:22	1	2010-08-25 22:33:42	1	2010-06-28 18:43:22	1
618	143	ndx_fk_oat_or	N	2010-06-28 18:43:22	1	2013-01-24 16:45:20	48	2010-06-28 18:43:22	1
619	143	ndx_fk_orat_c	N	2010-06-28 18:43:22	1	2013-01-24 16:45:20	48	2010-06-28 18:43:22	1
620	143	ndx_fk_orat_created	N	2010-06-28 18:43:22	1	2013-01-24 16:45:20	48	2010-06-28 18:43:22	1
621	143	ndx_fk_orat_modified	N	2010-06-28 18:43:22	1	2013-01-24 16:45:20	48	2010-06-28 18:43:22	1
622	143	ndx_fk_orat_owned	N	2010-06-28 18:43:22	1	2013-01-24 16:45:20	48	2010-06-28 18:43:22	1
623	143	ndx_uniq_orat	Y	2010-06-28 18:43:22	1	2013-01-24 16:45:20	48	2010-06-28 18:43:22	1
630	146	ndx_uniq_sdb	Y	2010-06-28 18:43:22	1	2010-08-25 22:33:43	1	2010-06-28 18:43:22	1
631	147	ndx_uniq_sdbm	Y	2010-06-28 18:43:22	1	2010-08-25 22:33:43	1	2010-06-28 18:43:22	1
632	148	ndx_uniq_sdbml	Y	2010-06-28 18:43:22	1	2010-08-25 22:33:43	1	2010-06-28 18:43:22	1
634	150	ndx_fk_sr_created	N	2010-06-28 18:43:23	1	2010-08-25 22:33:44	1	2010-06-28 18:43:23	1
635	150	ndx_fk_sr_modified	N	2010-06-28 18:43:23	1	2010-08-25 22:33:44	1	2010-06-28 18:43:23	1
636	150	ndx_fk_sr_owned	N	2010-06-28 18:43:23	1	2010-08-25 22:33:44	1	2010-06-28 18:43:23	1
637	150	ndx_uniq_dataview	Y	2010-06-28 18:43:23	1	2010-08-25 22:33:44	1	2010-06-28 18:43:23	1
638	151	ndx_fk_srf_created	N	2010-06-28 18:43:23	1	2010-10-19 20:57:38	48	2010-06-28 18:43:23	1
639	151	ndx_fk_srf_modified	N	2010-06-28 18:43:23	1	2010-10-19 20:57:38	48	2010-06-28 18:43:23	1
640	151	ndx_fk_srf_owned	N	2010-06-28 18:43:23	1	2010-10-19 20:57:38	48	2010-06-28 18:43:23	1
641	151	ndx_fk_srf_sr	N	2010-06-28 18:43:23	1	2010-10-19 20:57:38	48	2010-06-28 18:43:23	1
642	151	ndx_fk_srf_stf	N	2010-06-28 18:43:23	1	2010-10-19 20:57:38	48	2010-06-28 18:43:23	1
643	151	ndx_uniq_sdf	Y	2010-06-28 18:43:23	1	2010-10-19 20:57:38	48	2010-06-28 18:43:23	1
644	152	ndx_fk_srfl_created	N	2010-06-28 18:43:23	1	2010-08-25 22:33:44	1	2010-06-28 18:43:23	1
645	152	ndx_fk_srfl_modified	N	2010-06-28 18:43:23	1	2010-08-25 22:33:44	1	2010-06-28 18:43:23	1
646	152	ndx_fk_srfl_owned	N	2010-06-28 18:43:23	1	2010-08-25 22:33:44	1	2010-06-28 18:43:23	1
647	152	ndx_fk_srfl_sl	N	2010-06-28 18:43:23	1	2010-08-25 22:33:44	1	2010-06-28 18:43:23	1
648	152	ndx_fk_srfl_srf	N	2010-06-28 18:43:23	1	2010-08-25 22:33:44	1	2010-06-28 18:43:23	1
649	152	ndx_uniq_sdfl	Y	2010-06-28 18:43:23	1	2010-08-25 22:33:44	1	2010-06-28 18:43:23	1
650	153	ndx_uniq_sdl	Y	2010-06-28 18:43:23	1	2010-08-25 22:33:44	1	2010-06-28 18:43:23	1
651	154	ndx_fk_srp_created	N	2010-06-28 18:43:23	1	2010-08-25 22:33:44	1	2010-06-28 18:43:23	1
652	154	ndx_fk_srp_modified	N	2010-06-28 18:43:23	1	2010-08-25 22:33:44	1	2010-06-28 18:43:23	1
653	154	ndx_fk_srp_owned	N	2010-06-28 18:43:23	1	2010-08-25 22:33:44	1	2010-06-28 18:43:23	1
654	154	ndx_fk_srp_sr	N	2010-06-28 18:43:23	1	2010-08-25 22:33:44	1	2010-06-28 18:43:23	1
655	154	ndx_uniq_sdp	Y	2010-06-28 18:43:23	1	2010-08-25 22:33:44	1	2010-06-28 18:43:23	1
656	155	ndx_uniq_sds	Y	2010-06-28 18:43:23	1	2010-08-25 22:33:44	1	2010-06-28 18:43:23	1
657	156	ndx_uniq_sf	Y	2010-06-28 18:43:23	1	2010-08-25 22:33:44	1	2010-06-28 18:43:23	1
658	157	ndx_uniq_sfg	Y	2010-06-28 18:43:23	1	2010-08-25 22:33:44	1	2010-06-28 18:43:23	1
659	158	ndx_sfgm	Y	2010-06-28 18:43:23	1	2010-08-25 22:33:45	1	2010-06-28 18:43:23	1
660	159	ndx_uniq_sfl	Y	2010-06-28 18:43:23	1	2010-08-25 22:33:45	1	2010-06-28 18:43:23	1
661	161	ndx_uniq_sgl	Y	2010-06-28 18:43:23	1	2010-08-25 22:33:45	1	2010-06-28 18:43:23	1
662	162	ndx_uniq_sgpm	Y	2010-06-28 18:43:23	1	2010-08-25 22:33:45	1	2010-06-28 18:43:23	1
663	163	ndx_uniq_sgum	Y	2010-06-28 18:43:23	1	2010-08-25 22:33:45	1	2010-06-28 18:43:23	1
664	164	ndx_fk_si_created	N	2010-06-28 18:43:23	1	2010-08-25 22:33:45	1	2010-06-28 18:43:23	1
665	164	ndx_fk_si_modified	N	2010-06-28 18:43:23	1	2010-08-25 22:33:45	1	2010-06-28 18:43:23	1
666	164	ndx_fk_si_owned	N	2010-06-28 18:43:23	1	2010-08-25 22:33:45	1	2010-06-28 18:43:23	1
667	164	ndx_fk_si_st	N	2010-06-28 18:43:23	1	2010-08-25 22:33:45	1	2010-06-28 18:43:23	1
668	164	ndx_uniq_si	Y	2010-06-28 18:43:23	1	2010-08-25 22:33:45	1	2010-06-28 18:43:23	1
669	165	ndx_fk_sif_created	N	2010-06-28 18:43:23	1	2010-08-25 22:33:45	1	2010-06-28 18:43:23	1
670	165	ndx_fk_sif_modified	N	2010-06-28 18:43:23	1	2010-08-25 22:33:45	1	2010-06-28 18:43:23	1
671	165	ndx_fk_sif_owned	N	2010-06-28 18:43:24	1	2010-08-25 22:33:45	1	2010-06-28 18:43:24	1
672	165	ndx_fk_sif_si	N	2010-06-28 18:43:24	1	2010-08-25 22:33:45	1	2010-06-28 18:43:24	1
673	165	ndx_fk_sif_stf	N	2010-06-28 18:43:24	1	2010-08-25 22:33:45	1	2010-06-28 18:43:24	1
674	165	ndx_uniq_sif	Y	2010-06-28 18:43:24	1	2010-08-25 22:33:45	1	2010-06-28 18:43:24	1
675	166	ndx_fk_sl_created	N	2010-06-28 18:43:24	1	2010-11-04 19:40:58	48	2010-06-28 18:43:24	1
676	166	ndx_fk_sl_modified	N	2010-06-28 18:43:24	1	2010-11-04 19:40:59	48	2010-06-28 18:43:24	1
677	166	ndx_fk_sl_owned	N	2010-06-28 18:43:24	1	2010-11-04 19:40:59	48	2010-06-28 18:43:24	1
679	166	ndx_uniq_sl_tag	Y	2010-06-28 18:43:24	1	2010-11-04 19:40:59	48	2010-06-28 18:43:24	1
680	167	ndx_fk_sp_created	N	2010-06-28 18:43:24	1	2010-08-25 22:33:45	1	2010-06-28 18:43:24	1
681	167	ndx_fk_sp_modified	N	2010-06-28 18:43:24	1	2010-08-25 22:33:45	1	2010-06-28 18:43:24	1
682	167	ndx_fk_sp_owned	N	2010-06-28 18:43:24	1	2010-08-25 22:33:45	1	2010-06-28 18:43:24	1
683	168	ndx_uniq_spf	Y	2010-06-28 18:43:24	1	2010-09-16 02:49:17	1	2010-06-28 18:43:24	1
684	169	ndx_uniq_spl	Y	2010-06-28 18:43:24	1	2010-08-25 22:33:46	1	2010-06-28 18:43:24	1
685	170	ndx_fk_st_created	N	2010-06-28 18:43:24	1	2010-08-25 22:33:46	1	2010-06-28 18:43:24	1
686	170	ndx_fk_st_modified	N	2010-06-28 18:43:24	1	2010-08-25 22:33:46	1	2010-06-28 18:43:24	1
687	170	ndx_fk_st_owned	N	2010-06-28 18:43:24	1	2010-08-25 22:33:46	1	2010-06-28 18:43:24	1
688	170	ndx_uniq_st	Y	2010-06-28 18:43:24	1	2010-08-25 22:33:46	1	2010-06-28 18:43:24	1
689	171	ndx_fk_stf_cdgrp	N	2010-06-28 18:43:24	1	2010-08-25 22:33:46	1	2010-06-28 18:43:24	1
690	171	ndx_fk_stf_created	N	2010-06-28 18:43:24	1	2010-08-25 22:33:46	1	2010-06-28 18:43:24	1
691	171	ndx_fk_stf_modified	N	2010-06-28 18:43:24	1	2010-08-25 22:33:46	1	2010-06-28 18:43:24	1
692	171	ndx_fk_stf_owned	N	2010-06-28 18:43:24	1	2010-08-25 22:33:46	1	2010-06-28 18:43:24	1
693	171	ndx_fk_stf_st	N	2010-06-28 18:43:24	1	2010-08-25 22:33:46	1	2010-06-28 18:43:24	1
694	171	ndx_uniq_stf	Y	2010-06-28 18:43:24	1	2010-08-25 22:33:46	1	2010-06-28 18:43:24	1
695	173	ndx_uniq_str	Y	2010-06-28 18:43:24	1	2010-08-25 22:33:46	1	2010-06-28 18:43:24	1
696	174	ndx_fk_su_co	N	2010-06-28 18:43:24	1	2014-03-07 18:20:06	48	2010-06-28 18:43:24	1
697	174	ndx_fk_su_created	N	2010-06-28 18:43:24	1	2014-03-07 18:20:06	48	2010-06-28 18:43:24	1
698	174	ndx_fk_su_modified	N	2010-06-28 18:43:24	1	2014-03-07 18:20:06	48	2010-06-28 18:43:24	1
699	174	ndx_fk_su_owned	N	2010-06-28 18:43:24	1	2014-03-07 18:20:06	48	2010-06-28 18:43:24	1
700	174	ndx_uniq_su_name	Y	2010-06-28 18:43:24	1	2014-03-07 18:20:06	48	2010-06-28 18:43:24	1
701	175	ndx_fk_sup_created	N	2010-06-28 18:43:24	1	2010-08-25 22:33:46	1	2010-06-28 18:43:24	1
702	175	ndx_fk_sup_modified	N	2010-06-28 18:43:24	1	2010-08-25 22:33:46	1	2010-06-28 18:43:24	1
703	175	ndx_fk_sup_owned	N	2010-06-28 18:43:24	1	2010-08-25 22:33:46	1	2010-06-28 18:43:24	1
704	175	ndx_fk_sup_sp	N	2010-06-28 18:43:24	1	2010-08-25 22:33:46	1	2010-06-28 18:43:24	1
705	175	ndx_fk_sup_su	N	2010-06-28 18:43:24	1	2010-08-25 22:33:46	1	2010-06-28 18:43:24	1
706	175	ndx_uniq_sup	Y	2010-06-28 18:43:24	1	2010-08-25 22:33:46	1	2010-06-28 18:43:24	1
707	176	ndx_fk_tafm_created	N	2010-06-28 18:43:24	1	2010-08-25 22:33:46	1	2010-06-28 18:43:24	1
708	176	ndx_fk_tafm_f	N	2010-06-28 18:43:24	1	2010-08-25 22:33:46	1	2010-06-28 18:43:24	1
709	176	ndx_fk_tafm_g	N	2010-06-28 18:43:24	1	2010-08-25 22:33:46	1	2010-06-28 18:43:24	1
710	176	ndx_fk_tafm_modified	N	2010-06-28 18:43:24	1	2010-08-25 22:33:46	1	2010-06-28 18:43:24	1
711	176	ndx_fk_tafm_owned	N	2010-06-28 18:43:24	1	2010-08-25 22:33:46	1	2010-06-28 18:43:24	1
712	176	ndx_uniq_tafm	Y	2010-06-28 18:43:24	1	2010-08-25 22:33:46	1	2010-06-28 18:43:24	1
713	177	ndx_fk_tat_created	N	2010-06-28 18:43:24	1	2012-08-29 18:38:50	48	2010-06-28 18:43:24	1
714	177	ndx_fk_tat_modified	N	2010-06-28 18:43:24	1	2012-08-29 18:38:50	48	2010-06-28 18:43:24	1
715	177	ndx_fk_tat_owned	N	2010-06-28 18:43:24	1	2012-08-29 18:38:50	48	2010-06-28 18:43:24	1
716	177	ndx_fk_tat_tf	N	2010-06-28 18:43:24	1	2012-08-29 18:38:50	48	2010-06-28 18:43:24	1
717	177	ndx_fk_tat_tg	N	2010-06-28 18:43:24	1	2012-08-29 18:38:50	48	2010-06-28 18:43:24	1
718	177	ndx_fk_tat_ts	N	2010-06-28 18:43:24	1	2012-08-29 18:38:50	48	2010-06-28 18:43:24	1
719	177	ndx_uniq_tat	Y	2010-06-28 18:43:24	1	2012-08-29 18:38:50	48	2010-06-28 18:43:24	1
720	178	ndx_fk_tcm_cr	N	2010-06-28 18:43:25	1	2013-01-24 20:28:25	48	2010-06-28 18:43:25	1
721	178	ndx_fk_tcm_created	N	2010-06-28 18:43:25	1	2013-01-24 20:28:25	48	2010-06-28 18:43:25	1
722	178	ndx_fk_tcm_modfied	N	2010-06-28 18:43:25	1	2013-01-24 20:28:25	48	2010-06-28 18:43:25	1
723	178	ndx_fk_tcm_owned	N	2010-06-28 18:43:25	1	2013-01-24 20:28:25	48	2010-06-28 18:43:25	1
724	178	ndx_fk_tcm_ts	N	2010-06-28 18:43:25	1	2013-01-24 20:28:25	48	2010-06-28 18:43:25	1
725	178	ndx_uniq_tcm	Y	2010-06-28 18:43:25	1	2013-01-24 20:28:25	48	2010-06-28 18:43:25	1
726	179	ndx_fk_tgm_created	N	2010-06-28 18:43:25	1	2014-07-22 15:32:03	48	2010-06-28 18:43:25	1
727	179	ndx_fk_tgm_g	N	2010-06-28 18:43:25	1	2014-07-22 15:32:03	48	2010-06-28 18:43:25	1
728	179	ndx_fk_tgm_modified	N	2010-06-28 18:43:25	1	2014-07-22 15:32:03	48	2010-06-28 18:43:25	1
729	179	ndx_fk_tgm_owned	N	2010-06-28 18:43:25	1	2014-07-22 15:32:03	48	2010-06-28 18:43:25	1
730	179	ndx_fk_tgm_ts	N	2010-06-28 18:43:25	1	2014-07-22 15:32:03	48	2010-06-28 18:43:25	1
731	179	ndx_uniq_tgm	Y	2010-06-28 18:43:25	1	2014-07-22 15:32:03	48	2010-06-28 18:43:25	1
732	180	ndx_fk_tn_created	N	2010-06-28 18:43:25	1	2010-08-25 22:33:47	1	2010-06-28 18:43:25	1
733	180	ndx_fk_tn_g	N	2010-06-28 18:43:25	1	2010-08-25 22:33:47	1	2010-06-28 18:43:25	1
734	180	ndx_fk_tn_modified	N	2010-06-28 18:43:25	1	2010-08-25 22:33:47	1	2010-06-28 18:43:25	1
735	180	ndx_fk_tn_owned	N	2010-06-28 18:43:25	1	2010-08-25 22:33:47	1	2010-06-28 18:43:25	1
736	180	ndx_fk_tn_ts	N	2010-06-28 18:43:25	1	2010-08-25 22:33:47	1	2010-06-28 18:43:25	1
737	180	ndx_uniq_tn	Y	2010-06-28 18:43:25	1	2010-08-25 22:33:47	1	2010-06-28 18:43:25	1
738	181	ndx_fk_ts_c	N	2010-06-28 18:43:25	1	2011-06-03 16:39:25	48	2010-06-28 18:43:25	1
739	181	ndx_fk_ts_created	N	2010-06-28 18:43:25	1	2011-06-03 16:39:25	48	2010-06-28 18:43:25	1
740	181	ndx_fk_ts_cur_t	N	2010-06-28 18:43:25	1	2011-06-03 16:39:25	48	2010-06-28 18:43:25	1
741	181	ndx_fk_ts_modified	N	2010-06-28 18:43:25	1	2011-06-03 16:39:25	48	2010-06-28 18:43:25	1
742	181	ndx_fk_ts_owned	N	2010-06-28 18:43:25	1	2011-06-03 16:39:25	48	2010-06-28 18:43:25	1
743	181	ndx_fk_ts_tg	N	2010-06-28 18:43:25	1	2011-06-03 16:39:25	48	2010-06-28 18:43:25	1
746	181	ndx_uniq_ts	Y	2010-06-28 18:43:25	1	2011-06-03 16:39:25	48	2010-06-28 18:43:25	1
747	183	ndx_uniq_wor	Y	2010-06-28 18:43:25	1	2010-08-25 22:33:48	1	2010-06-28 18:43:25	1
748	184	ndx_uniq_wora	Y	2010-06-28 18:43:25	1	2013-09-16 22:34:36	48	2010-06-28 18:43:25	1
750	186	ndx_uniq_worat	Y	2010-06-28 18:43:25	1	2014-03-03 17:15:41	48	2010-06-28 18:43:25	1
751	187	ndx_uniq_wori	Y	2010-06-28 18:43:25	1	2017-08-16 05:05:25	48	2010-06-28 18:43:25	1
752	188	ndx_uniq_wu	Y	2010-06-28 18:43:25	1	2010-08-25 22:33:48	1	2010-06-28 18:43:25	1
753	189	ndx_uniq_wuc	Y	2010-06-28 18:43:25	1	2010-08-25 22:33:48	1	2010-06-28 18:43:25	1
754	190	ndx_uniq_wuci	Y	2010-06-28 18:43:26	1	2012-05-14 21:33:56	48	2010-06-28 18:43:26	1
755	191	ndx_uniq_wup	Y	2010-06-28 18:43:26	1	2010-08-25 22:33:49	1	2010-06-28 18:43:26	1
756	192	ndx_uniq_wusa	Y	2010-06-28 18:43:26	1	2010-08-25 22:33:49	1	2010-06-28 18:43:26	1
757	2	ndx_uniq_aa	Y	2010-06-28 18:48:56	1	2011-05-26 20:54:02	48	2010-06-28 18:48:56	1
759	19	ndx_uniq_cit	Y	2010-06-28 19:20:00	1	2016-06-05 23:55:17	48	2010-06-28 19:20:00	1
760	11	ndx_uniq_pd	Y	2010-06-28 19:22:18	1	2010-10-21 14:14:01	48	2010-06-28 19:22:18	1
761	12	ndx_uniq_qr	Y	2010-06-28 19:35:46	1	2010-08-25 22:33:37	1	2010-06-28 19:35:46	1
763	38	ndx_uniq_geo	Y	2010-06-28 19:38:15	1	2018-11-14 20:57:10	48	2010-06-28 19:38:15	1
764	13	ndx_uniq_sr	Y	2010-06-28 19:40:39	1	2017-07-25 01:11:52	48	2010-06-28 19:40:39	1
765	14	ndx_uniq_sm	Y	2010-06-28 19:42:38	1	2010-08-25 22:33:37	1	2010-06-28 19:42:38	1
766	22	ndx_uniq_cv	Y	2010-06-28 19:44:16	1	2010-08-25 22:33:38	1	2010-06-28 19:44:16	1
767	24	ndx_uniq_co	Y	2010-06-28 19:48:02	1	2016-06-06 00:21:48	48	2010-06-28 19:48:02	1
768	26	ndx_uniq_cm	Y	2010-06-28 19:50:04	1	2010-08-25 22:33:39	1	2010-06-28 19:50:04	1
769	41	ndx_uniq_ia	Y	2010-06-28 19:52:36	1	2016-06-05 23:59:00	48	2010-06-28 19:52:36	1
771	45	ndx_uniq_im	Y	2010-06-28 19:54:17	1	2014-07-16 22:04:11	48	2010-06-28 19:54:17	1
772	46	ndx_fk_iqs_cur	N	2010-06-28 19:55:25	1	2013-01-24 20:54:29	48	2010-06-28 19:55:25	1
773	46	ndx_fk_iqs_me	N	2010-06-28 19:55:25	1	2013-01-24 20:54:29	48	2010-06-28 19:55:25	1
775	47	ndx_fk_iv_ivr	N	2010-06-28 19:56:33	1	2017-07-24 19:12:12	48	2010-06-28 19:56:33	1
776	48	ndx_uniq_l	Y	2010-06-28 20:07:23	1	2019-06-18 15:08:02	48	2010-06-28 20:07:23	1
777	51	ndx_uniq_mm	Y	2010-06-28 20:08:12	1	2014-03-07 18:14:30	48	2010-06-28 20:08:12	1
778	27	ndx_uniq_crop	Y	2010-06-28 20:08:32	1	2011-06-09 16:05:26	48	2010-06-28 20:08:32	1
779	29	ndx_uniq_ctc	Y	2010-06-28 20:10:25	1	2010-08-25 22:33:39	1	2010-06-28 20:10:25	1
782	104	ndx_fk_gm_cr	N	2010-06-28 20:14:05	1	2014-07-16 21:55:57	48	2010-06-28 20:14:05	1
783	54	ndx_fk_ori_sc	N	2010-06-28 20:21:46	1	2017-08-16 05:06:33	48	2010-06-28 20:21:46	1
784	53	ndx_fk_ora_c	N	2010-06-28 20:23:37	1	2014-07-15 20:45:22	48	2010-06-28 20:23:37	1
785	53	ndx_uniq_ora	Y	2010-06-28 20:23:37	1	2014-07-15 20:45:22	48	2010-06-28 20:23:37	1
787	71	ndx_fk_s_created	N	2010-06-28 20:25:41	1	2019-06-18 14:09:00	48	2010-06-28 20:25:41	1
788	71	ndx_fk_s_modified	N	2010-06-28 20:25:41	1	2019-06-18 14:09:00	48	2010-06-28 20:25:41	1
789	71	ndx_fk_s_owned	N	2010-06-28 20:25:41	1	2019-06-18 14:09:00	48	2010-06-28 20:25:41	1
790	71	ndx_uniq_s	Y	2010-06-28 20:25:41	1	2019-06-18 14:09:00	48	2010-06-28 20:25:41	1
791	77	ndx_uniq_tf	Y	2010-06-28 20:28:40	1	2014-03-07 18:16:29	48	2010-06-28 20:28:40	1
792	78	fk_tg_cur_tg	N	2010-06-28 20:29:42	1	2016-06-06 00:30:03	48	2010-06-28 20:29:42	1
793	73	ndx_uniq_ta	Y	2010-06-28 20:34:40	1	2010-08-25 22:33:47	1	2010-06-28 20:34:40	1
794	75	ndx_fk_tcn_tg	N	2010-06-28 20:35:15	1	2019-06-17 22:09:59	48	2010-06-28 20:35:15	1
795	75	ndx_fk_tcn_ts	N	2010-06-28 20:35:15	1	2019-06-17 22:09:59	48	2010-06-28 20:35:15	1
796	75	ndx_uniq_tcn	Y	2010-06-28 20:35:15	1	2019-06-17 22:09:59	48	2010-06-28 20:35:15	1
797	83	ndx_fk_tus_ts	N	2010-06-28 20:37:37	1	2014-07-22 14:28:24	48	2010-06-28 20:37:37	1
798	83	ndx_uniq_tu	Y	2010-06-28 20:37:37	1	2014-07-22 14:28:24	48	2010-06-28 20:37:37	1
799	172	ndk_uniq_stfl	Y	2010-07-06 12:36:22	1	2010-08-25 22:33:46	1	2010-07-06 12:36:22	1
800	193	ndx_uniq_stl	Y	2010-07-06 16:29:38	1	2010-08-25 22:33:46	1	2010-07-06 16:29:38	1
802	181	ndx_fk_ts_s	N	2010-08-18 19:55:59	1	2011-06-03 16:39:25	48	2010-08-18 19:55:59	1
803	181	ndx_fk_ts_s2	N	2010-08-18 19:55:59	1	2011-06-03 16:39:25	48	2010-08-18 19:55:59	1
805	17	ndx_uniq_ar	Y	2010-09-29 02:15:03	1	\N	1	2010-09-29 02:15:03	1
806	102	ndx_uniq_as	Y	2010-09-29 02:15:26	1	2014-12-19 18:32:03	48	2010-09-29 02:15:26	1
807	195	ndx_uniq_sdtl	Y	2010-09-29 02:16:06	1	\N	1	2010-09-29 02:16:06	1
808	31	ndx_uniq_cto	Y	2010-10-21 14:37:22	48	\N	\N	2010-10-21 14:37:22	48
809	194	ndx_uniq_ctod	Y	2010-10-21 14:14:29	48	2013-01-24 20:42:34	48	2010-10-21 14:14:29	48
810	196	ndx_uniq_f	Y	2010-12-15 05:38:16	48	2011-01-07 19:14:30	48	2010-12-15 05:38:16	48
816	198	ndx_uniq_ff	Y	2010-12-15 05:38:16	48	2011-01-07 19:14:30	48	2010-12-15 05:38:16	48
817	199	ndx_uniq_fff	Y	2010-12-15 05:38:17	48	2011-01-07 19:14:30	48	2010-12-15 05:38:17	48
818	200	ndx_uniq_fft	Y	2010-12-15 05:38:17	48	2011-01-07 19:14:30	48	2010-12-15 05:38:17	48
819	201	ndx_uniq_fi	Y	2010-12-15 05:38:17	48	2011-01-07 19:14:30	48	2010-12-15 05:38:17	48
820	202	ndx_uniq_fr	Y	2010-12-15 05:38:17	48	2011-01-07 19:14:30	48	2010-12-15 05:38:17	48
827	205	ndx_uniq_fresf	Y	2010-12-15 05:38:17	48	2011-01-07 20:19:31	48	2010-12-15 05:38:17	48
836	207	ndx_fk_e_created	N	2010-12-16 08:29:44	48	2011-01-07 19:14:30	48	2010-12-16 08:29:44	48
837	207	ndx_fk_e_modified	N	2010-12-16 08:29:44	48	2011-01-07 19:14:30	48	2010-12-16 08:29:44	48
838	207	ndx_fk_e_owned	N	2010-12-16 08:29:45	48	2011-01-07 19:14:30	48	2010-12-16 08:29:45	48
839	208	ndx_fk_ea_created	N	2010-12-16 08:29:52	48	2011-01-07 19:14:30	48	2010-12-16 08:29:52	48
840	208	ndx_fk_ea_e	N	2010-12-16 08:29:53	48	2011-01-07 19:14:30	48	2010-12-16 08:29:53	48
841	208	ndx_fk_ea_modified	N	2010-12-16 08:29:53	48	2011-01-07 19:14:30	48	2010-12-16 08:29:53	48
842	208	ndx_fk_ea_owned	N	2010-12-16 08:29:54	48	2011-01-07 19:14:30	48	2010-12-16 08:29:54	48
843	208	ndx_uniq_ea	Y	2010-12-16 08:29:54	48	2011-01-07 19:14:30	48	2010-12-16 08:29:54	48
844	196	ndx_fk_f_created	N	2010-12-16 16:41:22	48	2011-01-07 19:14:30	48	2010-12-16 16:41:22	48
845	196	ndx_fk_f_modified	N	2010-12-16 16:41:22	48	2011-01-07 19:14:30	48	2010-12-16 16:41:22	48
846	196	ndx_fk_f_owned	N	2010-12-16 16:41:22	48	2011-01-07 19:14:30	48	2010-12-16 16:41:22	48
850	198	ndx_fk_ff_created	N	2010-12-16 16:41:22	48	2011-01-07 19:14:30	48	2010-12-16 16:41:22	48
851	198	ndx_fk_ff_modified	N	2010-12-16 16:41:22	48	2011-01-07 19:14:30	48	2010-12-16 16:41:22	48
852	198	ndx_fk_ff_owned	N	2010-12-16 16:41:22	48	2011-01-07 19:14:30	48	2010-12-16 16:41:22	48
853	199	ndx_fk_fff_created	N	2010-12-16 16:41:23	48	2011-01-07 19:14:30	48	2010-12-16 16:41:23	48
854	199	ndx_fk_fff_modified	N	2010-12-16 16:41:23	48	2011-01-07 19:14:30	48	2010-12-16 16:41:23	48
855	199	ndx_fk_fff_owned	N	2010-12-16 16:41:23	48	2011-01-07 19:14:30	48	2010-12-16 16:41:23	48
856	200	ndx_fk_fft_created	N	2010-12-16 16:41:23	48	2011-01-07 19:14:30	48	2010-12-16 16:41:23	48
857	200	ndx_fk_fft_modified	N	2010-12-16 16:41:23	48	2011-01-07 19:14:30	48	2010-12-16 16:41:23	48
858	200	ndx_fk_fft_owned	N	2010-12-16 16:41:23	48	2011-01-07 19:14:30	48	2010-12-16 16:41:23	48
859	201	ndx_fk_fi_created	N	2010-12-16 16:41:23	48	2011-01-07 19:14:30	48	2010-12-16 16:41:23	48
860	201	ndx_fk_fi_modified	N	2010-12-16 16:41:23	48	2011-01-07 19:14:30	48	2010-12-16 16:41:23	48
861	201	ndx_fk_fi_owned	N	2010-12-16 16:41:23	48	2011-01-07 19:14:30	48	2010-12-16 16:41:23	48
862	202	ndx_fk_fr_created	N	2010-12-16 16:41:23	48	2011-01-07 19:14:30	48	2010-12-16 16:41:23	48
863	202	ndx_fk_fr_modified	N	2010-12-16 16:41:23	48	2011-01-07 19:14:30	48	2010-12-16 16:41:23	48
864	202	ndx_fk_fr_owned	N	2010-12-16 16:41:23	48	2011-01-07 19:14:30	48	2010-12-16 16:41:23	48
865	203	ndx_fk_fres_created	N	2010-12-16 16:41:23	48	2011-01-07 19:14:30	48	2010-12-16 16:41:23	48
866	203	ndx_fk_fres_modified	N	2010-12-16 16:41:23	48	2011-01-07 19:14:30	48	2010-12-16 16:41:23	48
867	203	ndx_fk_fres_owned	N	2010-12-16 16:41:23	48	2011-01-07 19:14:30	48	2010-12-16 16:41:23	48
868	204	ndx_fk_fresa_created	N	2010-12-16 16:41:23	48	2011-01-07 19:14:30	48	2010-12-16 16:41:23	48
869	204	ndx_fk_fresa_modified	N	2010-12-16 16:41:23	48	2011-01-07 19:14:30	48	2010-12-16 16:41:23	48
870	204	ndx_fk_fresa_owned	N	2010-12-16 16:41:23	48	2011-01-07 19:14:30	48	2010-12-16 16:41:23	48
871	205	ndx_fk_fresf_created	N	2010-12-16 16:41:23	48	2011-01-07 20:19:31	48	2010-12-16 16:41:23	48
872	205	ndx_fk_fresf_modified	N	2010-12-16 16:41:23	48	2011-01-07 20:19:31	48	2010-12-16 16:41:23	48
873	205	ndx_fk_fresf_owned	N	2010-12-16 16:41:23	48	2011-01-07 20:19:31	48	2010-12-16 16:41:23	48
874	206	ndx_fk_fresto_created	N	2010-12-16 16:41:23	48	2011-01-07 20:24:51	48	2010-12-16 16:41:23	48
875	206	ndx_fk_fresto_modified	N	2010-12-16 16:41:23	48	2011-01-07 20:24:51	48	2010-12-16 16:41:23	48
876	206	ndx_fk_fresto_owned	N	2010-12-16 16:41:23	48	2011-01-07 20:24:51	48	2010-12-16 16:41:23	48
877	24	ndx_fk_c_wc	N	2010-12-17 05:45:49	48	2016-06-06 00:21:48	48	2010-12-17 05:45:49	48
879	200	ndx_fk_fft_ct	N	2010-12-17 09:53:33	48	2011-01-07 19:14:30	48	2010-12-17 09:53:33	48
883	204	ndx_fk_fresa	N	2010-12-20 15:48:53	48	2011-01-07 19:14:30	48	2010-12-20 15:48:53	48
884	204	ndx_uniq_fresa	Y	2010-12-20 15:48:53	48	2011-01-07 19:14:30	48	2010-12-20 15:48:53	48
885	206	ndx_fk_fresto_ct	N	2010-12-20 15:48:54	48	2011-01-07 20:24:51	48	2010-12-20 15:48:54	48
886	206	ndx_fk_fresto_ctc	N	2010-12-20 15:48:54	48	2011-01-07 20:24:51	48	2010-12-20 15:48:54	48
887	206	ndx_fk_fresto_i	N	2010-12-20 15:48:54	48	2011-01-07 20:24:51	48	2010-12-20 15:48:54	48
888	206	ndx_fk_fresto_m	N	2010-12-20 15:48:54	48	2011-01-07 20:24:51	48	2010-12-20 15:48:54	48
889	206	ndx_uniq_fresto	Y	2010-12-20 15:48:54	48	2011-01-07 20:24:51	48	2010-12-20 15:48:54	48
890	52	ndx_fk_oreq_f	N	2010-12-23 08:10:14	48	\N	\N	2010-12-23 08:10:14	48
894	203	ndx_fk_fres_i	N	2010-12-23 08:11:09	48	2011-01-07 19:14:30	48	2010-12-23 08:11:09	48
895	205	fk_fresf_fff	N	2010-12-23 08:11:09	48	2011-01-07 20:19:31	48	2010-12-23 08:11:09	48
896	203	ndf_fk_fres_fresg	N	2010-12-30 06:35:35	48	2011-01-07 19:14:30	48	2010-12-30 06:35:35	48
897	209	ndx_fk_fa_created	N	2010-12-30 06:40:45	48	2011-01-07 19:14:30	48	2010-12-30 06:40:45	48
898	209	ndx_fk_fa_modified	N	2010-12-30 06:40:45	48	2011-01-07 19:14:30	48	2010-12-30 06:40:45	48
899	209	ndx_fk_fa_owned	N	2010-12-30 06:40:45	48	2011-01-07 19:14:30	48	2010-12-30 06:40:45	48
900	209	ndx_fk_frepa	N	2010-12-30 06:40:45	48	2011-01-07 19:14:30	48	2010-12-30 06:40:45	48
901	209	ndx_uniq_fa	Y	2010-12-30 06:40:45	48	2011-01-07 19:14:30	48	2010-12-30 06:40:45	48
902	210	ndx_fk_frg_created	N	2010-12-30 06:40:45	48	2011-01-07 19:14:31	48	2010-12-30 06:40:45	48
903	210	ndx_fk_frg_modified	N	2010-12-30 06:40:45	48	2011-01-07 19:14:31	48	2010-12-30 06:40:45	48
904	210	ndx_fk_frg_owned	N	2010-12-30 06:40:45	48	2011-01-07 19:14:31	48	2010-12-30 06:40:45	48
905	210	ndx_frg_c	N	2010-12-30 06:40:45	48	2011-01-07 19:14:31	48	2010-12-30 06:40:45	48
906	210	ndx_uniq_fres	Y	2010-12-30 06:40:45	48	2011-01-07 19:14:31	48	2010-12-30 06:40:45	48
907	1	ndx_a_part1	N	2011-06-03 16:33:27	48	2018-11-28 22:58:21	48	2011-06-03 16:33:27	48
908	1	ndx_a_part2	N	2011-06-03 16:33:27	48	2018-11-28 22:58:21	48	2011-06-03 16:33:27	48
909	1	ndx_a_part3	N	2011-06-03 16:33:27	48	2018-11-28 22:58:21	48	2011-06-03 16:33:27	48
911	38	ndx_g_adm1	N	2011-06-03 16:36:11	48	2018-11-14 20:57:10	48	2011-06-03 16:36:11	48
912	38	ndx_g_adm2	N	2011-06-03 16:36:12	48	2018-11-14 20:57:10	48	2011-06-03 16:36:12	48
913	38	ndx_g_adm3	N	2011-06-03 16:36:12	48	2018-11-14 20:57:10	48	2011-06-03 16:36:12	48
914	38	ndx_g_adm4	N	2011-06-03 16:36:12	48	2018-11-14 20:57:10	48	2011-06-03 16:36:12	48
915	38	ndx_g_country_code	N	2011-06-03 16:36:12	48	2018-11-14 20:57:10	48	2011-06-03 16:36:12	48
916	40	ndx_inv_part3	N	2011-06-03 16:36:42	48	2013-01-24 16:57:49	48	2011-06-03 16:36:42	48
917	77	ndx_tf_alt_name	N	2011-06-03 16:38:39	48	2014-03-07 18:16:29	48	2011-06-03 16:38:39	48
918	77	ndx_tf_name	N	2011-06-03 16:38:39	48	2014-03-07 18:16:29	48	2011-06-03 16:38:39	48
919	78	ndx_tg_name	N	2011-06-03 16:38:59	48	2016-06-06 00:30:03	48	2011-06-03 16:38:59	48
920	181	ndx_ts_name	N	2011-06-03 16:39:25	48	\N	\N	2011-06-03 16:39:25	48
921	181	ndx_ts_nomen	N	2011-06-03 16:39:25	48	\N	\N	2011-06-03 16:39:25	48
922	181	ndx_ts_s_name	N	2011-06-03 16:39:25	48	\N	\N	2011-06-03 16:39:25	48
939	3	ndx_fk_aian_c	N	2012-08-29 18:27:05	48	\N	\N	2012-08-29 18:27:05	48
940	3	ndx_fk_aian_created	N	2012-08-29 18:27:05	48	\N	\N	2012-08-29 18:27:05	48
941	3	ndx_fk_aian_i	N	2012-08-29 18:27:05	48	\N	\N	2012-08-29 18:27:05	48
942	3	ndx_fk_aian_modified	N	2012-08-29 18:27:05	48	\N	\N	2012-08-29 18:27:05	48
943	3	ndx_fk_aian_or	N	2012-08-29 18:27:05	48	\N	\N	2012-08-29 18:27:05	48
944	3	ndx_fk_aian_owned	N	2012-08-29 18:27:05	48	\N	\N	2012-08-29 18:27:05	48
945	3	ndx_fk_aian_t_new	N	2012-08-29 18:27:05	48	\N	\N	2012-08-29 18:27:05	48
946	3	ndx_fk_aian_t_old	N	2012-08-29 18:27:05	48	\N	\N	2012-08-29 18:27:05	48
947	3	ndx_uniq_aian	Y	2012-08-29 18:27:05	48	\N	\N	2012-08-29 18:27:05	48
948	138	ndx_fk_aiat_created	N	2012-08-29 18:28:10	48	2017-07-25 01:10:25	48	2012-08-29 18:28:10	48
949	138	ndx_fk_aiat_iid	N	2012-08-29 18:28:10	48	2017-07-25 01:10:25	48	2012-08-29 18:28:10	48
950	138	ndx_fk_aiat_modified	N	2012-08-29 18:28:10	48	2017-07-25 01:10:25	48	2012-08-29 18:28:10	48
951	138	ndx_fk_aiat_owned	N	2012-08-29 18:28:10	48	2017-07-25 01:10:25	48	2012-08-29 18:28:10	48
952	138	ndx_uniq_aiat	Y	2012-08-29 18:28:10	48	2017-07-25 01:10:25	48	2012-08-29 18:28:10	48
953	43	ndx_fk_aigm_ag	N	2012-08-29 18:30:23	48	\N	\N	2012-08-29 18:30:23	48
954	43	ndx_fk_aigm_created	N	2012-08-29 18:30:23	48	\N	\N	2012-08-29 18:30:23	48
955	43	ndx_fk_aigm_i	N	2012-08-29 18:30:23	48	\N	\N	2012-08-29 18:30:23	48
956	43	ndx_fk_aigm_modified	N	2012-08-29 18:30:23	48	\N	\N	2012-08-29 18:30:23	48
957	43	ndx_fk_aigm_owned	N	2012-08-29 18:30:23	48	\N	\N	2012-08-29 18:30:23	48
958	43	ndx_uniq_aigm	Y	2012-08-29 18:30:23	48	\N	\N	2012-08-29 18:30:23	48
959	42	ndx_fk_aig_created	N	2012-08-29 18:30:45	48	2018-12-10 19:19:01	48	2012-08-29 18:30:45	48
960	42	ndx_fk_aig_modified	N	2012-08-29 18:30:45	48	2018-12-10 19:19:01	48	2012-08-29 18:30:45	48
961	42	ndx_fk_aig_owned	N	2012-08-29 18:30:45	48	2018-12-10 19:19:01	48	2012-08-29 18:30:45	48
962	42	ndx_uniq_aig	Y	2012-08-29 18:30:45	48	2018-12-10 19:19:01	48	2012-08-29 18:30:45	48
963	139	ndx_fk_ain_c	N	2012-08-29 18:31:24	48	2014-12-20 00:56:31	48	2012-08-29 18:31:24	48
964	139	ndx_fk_ain_created	N	2012-08-29 18:31:24	48	2014-12-20 00:56:31	48	2012-08-29 18:31:24	48
965	139	ndx_fk_ain_i	N	2012-08-29 18:31:24	48	2014-12-20 00:56:31	48	2012-08-29 18:31:24	48
966	139	ndx_fk_ain_modified	N	2012-08-29 18:31:25	48	2014-12-20 00:56:31	48	2012-08-29 18:31:25	48
967	139	ndx_fk_ain_ng	N	2012-08-29 18:31:25	48	2014-12-20 00:56:31	48	2012-08-29 18:31:25	48
968	139	ndx_fk_ain_owned	N	2012-08-29 18:31:25	48	2014-12-20 00:56:31	48	2012-08-29 18:31:25	48
969	139	ndx_uniq_ain	Y	2012-08-29 18:31:25	48	2014-12-20 00:56:31	48	2012-08-29 18:31:25	48
970	15	ndx_fk_aiv_c	N	2012-08-29 18:32:02	48	2019-03-13 20:10:40	48	2012-08-29 18:32:02	48
971	15	ndx_fk_aiv_created	N	2012-08-29 18:32:02	48	2019-03-13 20:10:40	48	2012-08-29 18:32:02	48
972	15	ndx_fk_aiv_i	N	2012-08-29 18:32:02	48	2019-03-13 20:10:40	48	2012-08-29 18:32:02	48
973	15	ndx_fk_aiv_modified	N	2012-08-29 18:32:02	48	2019-03-13 20:10:40	48	2012-08-29 18:32:02	48
974	15	ndx_fk_aiv_owned	N	2012-08-29 18:32:02	48	2019-03-13 20:10:40	48	2012-08-29 18:32:02	48
975	15	ndx_uniq_aiv	Y	2012-08-29 18:32:02	48	2019-03-13 20:10:40	48	2012-08-29 18:32:02	48
976	13	ndx_fk_as_a	N	2013-01-24 15:45:04	48	2017-07-25 01:11:52	48	2013-01-24 15:45:04	48
977	13	ndx_fk_as_created	N	2013-01-24 15:45:04	48	2017-07-25 01:11:52	48	2013-01-24 15:45:04	48
978	13	ndx_fk_as_g	N	2013-01-24 15:45:04	48	2017-07-25 01:11:52	48	2013-01-24 15:45:04	48
979	13	ndx_fk_as_modified	N	2013-01-24 15:45:04	48	2017-07-25 01:11:52	48	2013-01-24 15:45:04	48
980	13	ndx_fk_as_owned	N	2013-01-24 15:45:04	48	2017-07-25 01:11:52	48	2013-01-24 15:45:04	48
981	138	ndx_fk_aiat_c	N	2013-01-24 15:49:09	48	2017-07-25 01:10:25	48	2013-01-24 15:49:09	48
982	131	ndx_fk_ca_co	N	2013-01-24 15:57:04	48	2013-01-24 16:30:48	48	2013-01-24 15:57:04	48
983	132	ndx_fk_cta_c	N	2013-01-24 16:33:55	48	\N	\N	2013-01-24 16:33:55	48
984	133	ndx_fk_ctca_c	N	2013-01-24 16:37:56	48	\N	\N	2013-01-24 16:37:56	48
985	40	ndx_fk_i_m1	N	2013-01-24 16:57:49	48	\N	\N	2013-01-24 16:57:49	48
986	40	ndx_fk_i_m2	N	2013-01-24 16:57:49	48	\N	\N	2013-01-24 16:57:49	48
987	217	ndx_fk_ex_c	N	2013-01-24 17:55:28	48	\N	\N	2013-01-24 17:55:28	48
988	217	ndx_fk_ex_created	N	2013-01-24 17:55:28	48	\N	\N	2013-01-24 17:55:28	48
989	217	ndx_fk_ex_modified	N	2013-01-24 17:55:28	48	\N	\N	2013-01-24 17:55:28	48
990	217	ndx_fk_ex_owned	N	2013-01-24 17:55:28	48	\N	\N	2013-01-24 17:55:28	48
991	217	ndx_uniq_ex	Y	2013-01-24 17:55:28	48	\N	\N	2013-01-24 17:55:28	48
992	218	ndx_fk_exm_c	N	2013-01-24 17:55:28	48	\N	\N	2013-01-24 17:55:28	48
993	218	ndx_fk_exm_created	N	2013-01-24 17:55:28	48	\N	\N	2013-01-24 17:55:28	48
994	218	ndx_fk_exm_ex	N	2013-01-24 17:55:28	48	\N	\N	2013-01-24 17:55:28	48
995	218	ndx_fk_exm_modified	N	2013-01-24 17:55:28	48	\N	\N	2013-01-24 17:55:28	48
996	218	ndx_fk_exm_owned	N	2013-01-24 17:55:28	48	\N	\N	2013-01-24 17:55:28	48
997	218	ndx_uniq_exm	Y	2013-01-24 17:55:28	48	\N	\N	2013-01-24 17:55:28	48
998	219	ndx_fk_gsi_created	N	2013-01-24 17:55:28	48	\N	\N	2013-01-24 17:55:28	48
999	219	ndx_fk_gsi_i	Y	2013-01-24 17:55:28	48	\N	\N	2013-01-24 17:55:28	48
1000	219	ndx_fk_gsi_modified	N	2013-01-24 17:55:28	48	\N	\N	2013-01-24 17:55:28	48
1001	219	ndx_fk_gsi_owned	N	2013-01-24 17:55:28	48	\N	\N	2013-01-24 17:55:28	48
1002	220	ndx_fk_gspisi_created	N	2013-01-24 17:55:28	48	2013-04-30 16:59:01	48	2013-01-24 17:55:28	48
1003	220	ndx_fk_gspisi_i	Y	2013-01-24 17:55:28	48	2013-04-30 16:59:01	48	2013-01-24 17:55:28	48
1004	220	ndx_fk_gspisi_modified	N	2013-01-24 17:55:28	48	2013-04-30 16:59:01	48	2013-01-24 17:55:28	48
1005	220	ndx_fk_gspisi_owned	N	2013-01-24 17:55:28	48	2013-04-30 16:59:01	48	2013-01-24 17:55:28	48
1006	221	ndx_fk_nc7si_created	N	2013-01-24 17:55:28	48	\N	\N	2013-01-24 17:55:28	48
1007	221	ndx_fk_nc7si_i	Y	2013-01-24 17:55:28	48	\N	\N	2013-01-24 17:55:28	48
1008	221	ndx_fk_nc7si_modified	N	2013-01-24 17:55:28	48	\N	\N	2013-01-24 17:55:28	48
1009	221	ndx_fk_nc7si_owned	N	2013-01-24 17:55:28	48	\N	\N	2013-01-24 17:55:28	48
1010	222	ndx_fk_ne9si_created	N	2013-01-24 17:55:28	48	\N	\N	2013-01-24 17:55:28	48
1011	222	ndx_fk_ne9si_i	Y	2013-01-24 17:55:28	48	\N	\N	2013-01-24 17:55:28	48
1012	222	ndx_fk_ne9si_modified	N	2013-01-24 17:55:28	48	\N	\N	2013-01-24 17:55:28	48
1013	222	ndx_fk_ne9si_owned	N	2013-01-24 17:55:28	48	\N	\N	2013-01-24 17:55:28	48
1014	223	ndx_fk_nsslsi_created	N	2013-01-24 17:55:28	48	2014-03-07 18:17:43	48	2013-01-24 17:55:28	48
1015	223	ndx_fk_nsslsi_i	Y	2013-01-24 17:55:28	48	2014-03-07 18:17:43	48	2013-01-24 17:55:28	48
1016	223	ndx_fk_nsslsi_modified	N	2013-01-24 17:55:28	48	2014-03-07 18:17:43	48	2013-01-24 17:55:28	48
1017	223	ndx_fk_nsslsi_owned	N	2013-01-24 17:55:28	48	2014-03-07 18:17:43	48	2013-01-24 17:55:28	48
1018	224	ndx_fk_opgcsi_created	N	2013-01-24 17:55:29	48	\N	\N	2013-01-24 17:55:29	48
1019	224	ndx_fk_opgcsi_i	Y	2013-01-24 17:55:29	48	\N	\N	2013-01-24 17:55:29	48
1020	224	ndx_fk_opgcsi_modified	N	2013-01-24 17:55:29	48	\N	\N	2013-01-24 17:55:29	48
1021	224	ndx_fk_opgcsi_owned	N	2013-01-24 17:55:29	48	\N	\N	2013-01-24 17:55:29	48
1022	225	ndx_fk_orpl_created	N	2013-01-24 17:55:29	48	2014-03-07 18:13:35	48	2013-01-24 17:55:29	48
1023	225	ndx_fk_orpl_inspected_c	N	2013-01-24 17:55:29	48	2014-03-07 18:13:35	48	2013-01-24 17:55:29	48
1024	225	ndx_fk_orpl_modified	N	2013-01-24 17:55:29	48	2014-03-07 18:13:35	48	2013-01-24 17:55:29	48
1025	225	ndx_fk_orpl_or	N	2013-01-24 17:55:29	48	2014-03-07 18:13:35	48	2013-01-24 17:55:29	48
1026	225	ndx_fk_orpl_owned	N	2013-01-24 17:55:29	48	2014-03-07 18:13:35	48	2013-01-24 17:55:29	48
1027	225	ndx_uniq_orpl	Y	2013-01-24 17:55:29	48	2014-03-07 18:13:35	48	2013-01-24 17:55:29	48
1028	226	ndx_fk_parlsi_created	N	2013-01-24 17:55:29	48	\N	\N	2013-01-24 17:55:29	48
1029	226	ndx_fk_parlsi_i	Y	2013-01-24 17:55:29	48	\N	\N	2013-01-24 17:55:29	48
1030	226	ndx_fk_parlsi_modified	N	2013-01-24 17:55:29	48	\N	\N	2013-01-24 17:55:29	48
1031	226	ndx_fk_parlsi_owned	N	2013-01-24 17:55:29	48	\N	\N	2013-01-24 17:55:29	48
1032	227	ndx_fk_s9si_created	N	2013-01-24 17:55:29	48	2013-04-30 16:58:34	48	2013-01-24 17:55:29	48
1033	227	ndx_fk_s9si_i	Y	2013-01-24 17:55:29	48	2013-04-30 16:58:34	48	2013-01-24 17:55:29	48
1034	227	ndx_fk_s9si_modified	N	2013-01-24 17:55:29	48	2013-04-30 16:58:34	48	2013-01-24 17:55:29	48
1035	227	ndx_fk_s9si_owned	N	2013-01-24 17:55:29	48	2013-04-30 16:58:34	48	2013-01-24 17:55:29	48
1036	228	ndx_fk_sodo_as	N	2013-01-24 17:55:29	48	\N	\N	2013-01-24 17:55:29	48
1037	228	ndx_fk_sodo_created	N	2013-01-24 17:55:29	48	\N	\N	2013-01-24 17:55:29	48
1038	228	ndx_fk_sodo_modified	N	2013-01-24 17:55:29	48	\N	\N	2013-01-24 17:55:29	48
1039	228	ndx_fk_sodo_owned	N	2013-01-24 17:55:29	48	\N	\N	2013-01-24 17:55:29	48
1040	228	ndx_fk_sodo_sd	N	2013-01-24 17:55:29	48	\N	\N	2013-01-24 17:55:29	48
1041	228	ndx_fk_sodo_sodc	N	2013-01-24 17:55:29	48	\N	\N	2013-01-24 17:55:29	48
1042	228	ndx_uniq_sodo	Y	2013-01-24 17:55:29	48	\N	\N	2013-01-24 17:55:29	48
1043	229	ndx_fk_sd_created	N	2013-01-24 17:55:29	48	\N	\N	2013-01-24 17:55:29	48
1044	229	ndx_fk_sd_modified	N	2013-01-24 17:55:29	48	\N	\N	2013-01-24 17:55:29	48
1045	229	ndx_fk_sd_owned	N	2013-01-24 17:55:29	48	\N	\N	2013-01-24 17:55:29	48
1046	229	ndx_uniq_sd	Y	2013-01-24 17:55:29	48	\N	\N	2013-01-24 17:55:29	48
1047	230	ndx_fk_sodc_created	N	2013-01-24 17:55:29	48	\N	\N	2013-01-24 17:55:29	48
1048	230	ndx_fk_sodc_modified	N	2013-01-24 17:55:29	48	\N	\N	2013-01-24 17:55:29	48
1049	230	ndx_fk_sodc_owned	N	2013-01-24 17:55:29	48	\N	\N	2013-01-24 17:55:29	48
1050	230	ndx_fk_sodc_sd	N	2013-01-24 17:55:29	48	\N	\N	2013-01-24 17:55:29	48
1051	230	ndx_uniq_sodc	Y	2013-01-24 17:55:29	48	\N	\N	2013-01-24 17:55:29	48
1052	231	ndx_fk_sodcl_created	N	2013-01-24 17:55:29	48	\N	\N	2013-01-24 17:55:29	48
1053	231	ndx_fk_sodcl_modified	N	2013-01-24 17:55:29	48	\N	\N	2013-01-24 17:55:29	48
1054	231	ndx_fk_sodcl_owned	N	2013-01-24 17:55:29	48	\N	\N	2013-01-24 17:55:29	48
1055	231	ndx_fk_sodcl_sl	N	2013-01-24 17:55:29	48	\N	\N	2013-01-24 17:55:29	48
1056	231	ndx_fk_sodcl_sodc	N	2013-01-24 17:55:29	48	\N	\N	2013-01-24 17:55:29	48
1057	231	ndx_uniq_sodcl	Y	2013-01-24 17:55:29	48	\N	\N	2013-01-24 17:55:29	48
1058	232	ndx_fk_sodl_created	N	2013-01-24 17:55:29	48	\N	\N	2013-01-24 17:55:29	48
1059	232	ndx_fk_sodl_modified	N	2013-01-24 17:55:29	48	\N	\N	2013-01-24 17:55:29	48
1060	232	ndx_fk_sodl_owned	N	2013-01-24 17:55:29	48	\N	\N	2013-01-24 17:55:29	48
1061	232	ndx_fk_sodl_sd	N	2013-01-24 17:55:29	48	\N	\N	2013-01-24 17:55:29	48
1062	232	ndx_fk_sodl_sl	N	2013-01-24 17:55:30	48	\N	\N	2013-01-24 17:55:30	48
1063	232	ndx_uniq_sodl	Y	2013-01-24 17:55:30	48	\N	\N	2013-01-24 17:55:30	48
1064	233	ndx_fk_w6si_created	N	2013-01-24 17:55:30	48	2013-04-30 16:58:06	48	2013-01-24 17:55:30	48
1065	233	ndx_fk_w6si_i	Y	2013-01-24 17:55:30	48	2013-04-30 16:58:06	48	2013-01-24 17:55:30	48
1066	233	ndx_fk_w6si_modified	N	2013-01-24 17:55:30	48	2013-04-30 16:58:06	48	2013-01-24 17:55:30	48
1067	233	ndx_fk_w6si_owned	N	2013-01-24 17:55:30	48	2013-04-30 16:58:06	48	2013-01-24 17:55:30	48
1068	19	ndx_fk_ci_a	N	2013-01-24 20:30:22	48	2016-06-05 23:55:17	48	2013-01-24 20:30:22	48
1069	19	ndx_fk_ci_aipr	N	2013-01-24 20:30:22	48	2016-06-05 23:55:17	48	2013-01-24 20:30:22	48
1070	19	ndx_fk_ci_ap	N	2013-01-24 20:30:22	48	2016-06-05 23:55:17	48	2013-01-24 20:30:22	48
1071	19	ndx_fk_ci_gm	N	2013-01-24 20:30:22	48	2016-06-05 23:55:17	48	2013-01-24 20:30:22	48
1072	19	ndx_fk_ci_m	N	2013-01-24 20:30:22	48	2016-06-05 23:55:17	48	2013-01-24 20:30:22	48
1075	19	ndx_fk_ci_tf	N	2013-01-24 20:30:22	48	2016-06-05 23:55:17	48	2013-01-24 20:30:22	48
1076	19	ndx_fk_ci_tg	N	2013-01-24 20:30:22	48	2016-06-05 23:55:17	48	2013-01-24 20:30:22	48
1078	19	ndx_fk_ci_ts	N	2013-01-24 20:30:22	48	2016-06-05 23:55:17	48	2013-01-24 20:30:22	48
1080	194	ndx_fk_ctod_created	N	2013-01-24 20:42:34	48	\N	\N	2013-01-24 20:42:34	48
1081	194	ndx_fk_ctod_ct	N	2013-01-24 20:42:34	48	\N	\N	2013-01-24 20:42:34	48
1082	194	ndx_fk_ctod_ctc	N	2013-01-24 20:42:34	48	\N	\N	2013-01-24 20:42:34	48
1083	194	ndx_fk_ctod_cto	N	2013-01-24 20:42:34	48	\N	\N	2013-01-24 20:42:34	48
1084	194	ndx_fk_ctod_i	N	2013-01-24 20:42:34	48	\N	\N	2013-01-24 20:42:34	48
1085	194	ndx_fk_ctod_m	N	2013-01-24 20:42:34	48	\N	\N	2013-01-24 20:42:34	48
1086	194	ndx_fk_ctod_modified	N	2013-01-24 20:42:34	48	\N	\N	2013-01-24 20:42:34	48
1087	194	ndx_fk_ctod_owned	N	2013-01-24 20:42:34	48	\N	\N	2013-01-24 20:42:34	48
1088	149	ndx_uniq_sdt	Y	2013-01-31 18:36:51	48	\N	\N	2013-01-31 18:36:51	48
1089	233	ndx_fk_w6ivsi_i	N	2013-04-30 16:56:05	48	2013-04-30 16:58:06	48	2013-04-30 16:56:05	48
1090	220	ndx_fk_gspiivsi_i	N	2013-04-30 16:59:01	48	\N	\N	2013-04-30 16:59:01	48
1091	234	ndx_fk_ivrm_created	N	2014-03-13 20:58:45	48	\N	\N	2014-03-13 20:58:45	48
1092	234	ndx_fk_ivrm_ivr	N	2014-03-13 20:58:45	48	\N	\N	2014-03-13 20:58:45	48
1093	234	ndx_fk_ivrm_modified	N	2014-03-13 20:58:45	48	\N	\N	2014-03-13 20:58:45	48
1094	234	ndx_fk_ivrm_owned	N	2014-03-13 20:58:45	48	\N	\N	2014-03-13 20:58:45	48
1095	234	ndx_fk_ivrm_ts	N	2014-03-13 20:58:45	48	\N	\N	2014-03-13 20:58:45	48
1096	234	ndx_uniq_ivrm	Y	2014-03-13 20:58:45	48	\N	\N	2014-03-13 20:58:45	48
1097	47	ndx_uniq_iv	Y	2017-07-24 19:12:12	48	\N	\N	2017-07-24 19:12:12	48
1098	54	ndx_fk_ori_wori	N	2017-08-16 05:06:33	48	\N	\N	2017-08-16 05:06:33	48
1099	235	ndx_fk_aigat_aig	N	2018-07-23 21:05:48	48	\N	\N	2018-07-23 21:05:48	48
1100	235	ndx_fk_aigat_c	N	2018-07-23 21:05:48	48	\N	\N	2018-07-23 21:05:48	48
1101	235	ndx_fk_aigat_created	N	2018-07-23 21:05:48	48	\N	\N	2018-07-23 21:05:48	48
1102	235	ndx_fk_aigat_modified	N	2018-07-23 21:05:48	48	\N	\N	2018-07-23 21:05:48	48
1103	235	ndx_fk_aigat_owned	N	2018-07-23 21:05:48	48	\N	\N	2018-07-23 21:05:48	48
1104	235	ndx_uniq_aigat	Y	2018-07-23 21:05:48	48	\N	\N	2018-07-23 21:05:48	48
1105	236	ndx_fk_mat_c	N	2018-07-25 18:07:06	48	\N	\N	2018-07-25 18:07:06	48
1106	236	ndx_fk_mat_created	N	2018-07-25 18:07:06	48	\N	\N	2018-07-25 18:07:06	48
1107	236	ndx_fk_mat_m	N	2018-07-25 18:07:06	48	\N	\N	2018-07-25 18:07:06	48
1108	236	ndx_fk_mat_modified	N	2018-07-25 18:07:06	48	\N	\N	2018-07-25 18:07:06	48
1109	236	ndx_fk_mat_owned	N	2018-07-25 18:07:06	48	\N	\N	2018-07-25 18:07:06	48
1110	236	ndx_uniq_mat	Y	2018-07-25 18:07:06	48	\N	\N	2018-07-25 18:07:06	48
1111	1	ndx_uniq_doi	Y	2018-11-28 22:58:21	48	\N	\N	2018-11-28 22:58:21	48
1112	237	ndx_fk_tcwrp_cit	N	2018-12-04 20:43:09	48	\N	\N	2018-12-04 20:43:09	48
1113	237	ndx_fk_tcwrp_created	N	2018-12-04 20:43:09	48	\N	\N	2018-12-04 20:43:09	48
1114	237	ndx_fk_tcwrp_modified	N	2018-12-04 20:43:09	48	\N	\N	2018-12-04 20:43:09	48
1115	237	ndx_fk_tcwrp_owned	N	2018-12-04 20:43:09	48	\N	\N	2018-12-04 20:43:09	48
1116	237	ndx_fk_tcwrp_ts	N	2018-12-04 20:43:09	48	\N	\N	2018-12-04 20:43:09	48
1117	237	ndx_uniq_tcwrp	Y	2018-12-04 20:43:09	48	\N	\N	2018-12-04 20:43:09	48
1118	42	ndx_fk_aig_m	N	2018-12-10 19:19:01	48	\N	\N	2018-12-10 19:19:01	48
1119	238	ndx_fk_oria_c	N	2018-12-10 22:05:41	48	\N	\N	2018-12-10 22:05:41	48
1120	238	ndx_fk_oria_created	N	2018-12-10 22:05:41	48	\N	\N	2018-12-10 22:05:41	48
1121	238	ndx_fk_oria_modified	N	2018-12-10 22:05:41	48	\N	\N	2018-12-10 22:05:41	48
1122	238	ndx_fk_oria_ori	N	2018-12-10 22:05:41	48	\N	\N	2018-12-10 22:05:41	48
1123	238	ndx_fk_oria_owned	N	2018-12-10 22:05:41	48	\N	\N	2018-12-10 22:05:41	48
1124	238	ndx_uniq_oria	Y	2018-12-10 22:05:41	48	\N	\N	2018-12-10 22:05:41	48
1125	239	ndx_fk_tcwr_c	N	2019-06-18 18:11:34	48	\N	\N	2019-06-18 18:11:34	48
1126	239	ndx_fk_tcwr_created	N	2019-06-18 18:11:34	48	\N	\N	2019-06-18 18:11:34	48
1127	239	ndx_fk_tcwr_modified	N	2019-06-18 18:11:34	48	\N	\N	2019-06-18 18:11:34	48
1128	239	ndx_fk_tcwr_owned	N	2019-06-18 18:11:34	48	\N	\N	2019-06-18 18:11:34	48
1129	239	ndx_fk_tcwr_ts	N	2019-06-18 18:11:34	48	\N	\N	2019-06-18 18:11:34	48
1130	239	ndx_uniq_tcwr	Y	2019-06-18 18:11:34	48	\N	\N	2019-06-18 18:11:34	48
1131	241	ndx_fk_tcc_created	N	2019-11-06 21:31:44	48	\N	\N	2019-11-06 21:31:44	48
1132	241	ndx_fk_tcc_modified	N	2019-11-06 21:31:44	48	\N	\N	2019-11-06 21:31:44	48
1133	241	ndx_fk_tcc_owned	N	2019-11-06 21:31:44	48	\N	\N	2019-11-06 21:31:44	48
1134	241	ndx_uniq_tcc	Y	2019-11-06 21:31:44	48	\N	\N	2019-11-06 21:31:44	48
1135	242	ndx_fk_tcwrm_cit	N	2019-11-06 21:31:45	48	\N	\N	2019-11-06 21:31:45	48
1136	242	ndx_fk_tcwrm_created	N	2019-11-06 21:31:45	48	\N	\N	2019-11-06 21:31:45	48
1137	242	ndx_fk_tcwrm_modified	N	2019-11-06 21:31:45	48	\N	\N	2019-11-06 21:31:45	48
1138	242	ndx_fk_tcwrm_owned	N	2019-11-06 21:31:45	48	\N	\N	2019-11-06 21:31:45	48
1139	242	ndx_fk_tcwrm_tc	N	2019-11-06 21:31:45	48	\N	\N	2019-11-06 21:31:45	48
1140	242	ndx_fk_tcwrm_ts	N	2019-11-06 21:31:45	48	\N	\N	2019-11-06 21:31:45	48
1141	242	ndx_uniq_tcwrm	Y	2019-11-06 21:31:45	48	\N	\N	2019-11-06 21:31:45	48
1142	243	ndx_fk_tcwrt_cit	N	2019-11-06 21:31:45	48	\N	\N	2019-11-06 21:31:45	48
1143	243	ndx_fk_tcwrt_created	N	2019-11-06 21:31:45	48	\N	\N	2019-11-06 21:31:45	48
1144	243	ndx_fk_tcwrt_modified	N	2019-11-06 21:31:45	48	\N	\N	2019-11-06 21:31:45	48
1145	243	ndx_fk_tcwrt_owned	N	2019-11-06 21:31:45	48	\N	\N	2019-11-06 21:31:45	48
1146	243	ndx_fk_tcwrt_tcc	N	2019-11-06 21:31:45	48	\N	\N	2019-11-06 21:31:45	48
1147	243	ndx_uniq_tcwrt	Y	2019-11-06 21:31:45	48	\N	\N	2019-11-06 21:31:45	48
1148	244	ndx_fk_tr_created	N	2019-11-14 22:14:21	48	\N	\N	2019-11-14 22:14:21	48
1149	244	ndx_fk_tr_g	N	2019-11-14 22:14:21	48	\N	\N	2019-11-14 22:14:21	48
1150	244	ndx_fk_tr_modified	N	2019-11-14 22:14:21	48	\N	\N	2019-11-14 22:14:21	48
1151	244	ndx_fk_tr_owned	N	2019-11-14 22:14:21	48	\N	\N	2019-11-14 22:14:21	48
1152	244	ndx_uniq_tr	Y	2019-11-14 22:14:21	48	\N	\N	2019-11-14 22:14:21	48
1153	245	ndx_fk_trm_created	N	2019-11-14 22:14:21	48	\N	\N	2019-11-14 22:14:21	48
1154	245	ndx_fk_trm_modified	N	2019-11-14 22:14:21	48	\N	\N	2019-11-14 22:14:21	48
1155	245	ndx_fk_trm_owned	N	2019-11-14 22:14:21	48	\N	\N	2019-11-14 22:14:21	48
1156	245	ndx_trm_taxonomy_family	N	2019-11-14 22:14:21	48	\N	\N	2019-11-14 22:14:21	48
1157	245	ndx_trm_taxonomy_genus	N	2019-11-14 22:14:21	48	\N	\N	2019-11-14 22:14:21	48
1158	245	ndx_trm_taxonomy_regulation	N	2019-11-14 22:14:21	48	\N	\N	2019-11-14 22:14:21	48
1159	245	ndx_trm_taxonomy_species	N	2019-11-14 22:14:21	48	\N	\N	2019-11-14 22:14:21	48
1160	245	ndx_uniq_trm	Y	2019-11-14 22:14:21	48	\N	\N	2019-11-14 22:14:21	48
