﻿sys_group_user_map_id	sys_group_id	sys_user_id	created_date	created_by	modified_date	modified_by	owned_date	owned_by
1	1	1	2010-03-16 23:05:32	1	\N	1	2010-03-16 23:05:32	1
2	2	1	2010-03-16 23:06:07	1	\N	1	2010-03-16 23:06:07	1
4	2	24	2010-03-16 23:06:07	1	\N	1	2010-03-16 23:06:07	1
56	3	1	2010-03-17 00:11:57	1	\N	1	2010-03-17 00:11:57	1
63	6	1	2013-01-14 23:11:12	48	\N	\N	2013-01-14 23:11:12	48
