{
  "id": "11",
  "titulo": "Calcula la suma dels N primers",
  "resuelto": "false",
  "numeroIntentos":"0",
  "numeroSeccion": "3",
  "listaIntentos" : [],
  "enunciado": "===========Descripció=====\nEscriu un programa que donat un nombre enter s’imprimeixi la suma de tots els enters fins a arribar a aquest.\n===========Entrada=====\nPer l’entrada rebreu un nombre enter.\n===========Sortida=====\nHeu d’imprimir un nombre enter que representi la suma de tots els nombres fins a arribar al d’entrada (inclòs).\n",
  "juegosPruebaPublicos": [
    {
      "inputs": ["3"],
      "outputs": ["6"],
      "tipo": "V"
    },
    {
      "inputs": ["5"],
      "outputs": ["15"],
      "tipo": "V"
    }
  ],
  "juegosPruebaPrivados": [
    {
      "inputs": ["10"],
      "outputs": ["55"],
      "tipo":"O"
    }
  ]
}