{
  "id": "12",
  "titulo": "Eleva'l",
  "resuelto": "false",
  "numeroIntentos":"0",
  "numeroSeccion": "3",
  "listaIntentos" : [],
  "enunciado": "===========Descripció=====\nEscriu un programa que donat dos nombres enters imprimeixi el resultat d’elevar el primer pel segon.\n===========Entrada=====\nPer l’entrada rebreu dos nombres enters.\n===========Sortida=====\nLa sortida ha de ser el resultat d’elevar el primer pel segon.\n",
  "juegosPruebaPublicos": [
    {
      "inputs": ["2","3"],
      "outputs": ["8"],
      "tipo": "V"
    },
    {
      "inputs": ["3","3"],
      "outputs": ["27"],
      "tipo": "V"
    }
  ],
  "juegosPruebaPrivados": [
    {
      "inputs": ["5","5"],
      "outputs": ["25"],
      "tipo":"O"
    }
  ]
}