{
  "id": "20",
  "titulo": "Palíndrom",
  "resuelto": "false",
  "numeroIntentos":"0",
  "numeroSeccion": "4",
  "listaIntentos" : [],
  "enunciado": "===========Descripció=====\nFeu un programa que indiqui si una paraula és un palíndrom o no. Recordeu que una paraula és un palíndrom si es llegeix igual\nd’esquerra a dreta que de dreta a esquerra.\n===========Entrada=====\nL’entrada consisteix en un String.\n===========Sortida=====\nPer la sortida heu d’imprimir si la paraula és un palíndrom o no.\n",
  "juegosPruebaPublicos": [
    {
      "inputs": ["seves"],
      "outputs": ["si"],
      "tipo": "V"
    },
    {
      "inputs": ["array"],
      "outputs": ["no"],
      "tipo": "V"
    }
  ],
  "juegosPruebaPrivados": [
    {
      "inputs": ["acalaca"],
      "outputs": ["si"],
      "tipo":"O"
    }
  ]
}