[gd_scene load_steps=4 format=3 uid="uid://ctfjyh3j8n0bw"]

[ext_resource type="Script" path="res://assets/scripts/obstacle_path.gd" id="1_f5pw5"]
[ext_resource type="PackedScene" uid="uid://cou47llb6hgxg" path="res://assets/nodes/Obstacles/obstacle.tscn" id="2_qf187"]

[sub_resource type="Curve3D" id="Curve3D_dbge2"]
_data = {
"points": PackedVector3Array(0, 0, 0, 0, 0, 0, -0.0253997, 0, -0.126996, 0, 0, 0, 0, 0, 0, -0.0452042, 0, -0.116581, 0, 0, 0, 0, 0, 0, -0.0229435, 0, -5.63724, 0, 0, 0, 0, 0, 0, -0.0253997, 0, -0.126996),
"tilts": PackedFloat32Array(0, 0, 0, 0)
}
point_count = 4

[node name="MovingObstacle" type="Path3D"]
transform = Transform3D(1, 0, 0, 0, 1, 0, 0, 0, 1, -3.45435, 0, 2.69236)
curve = SubResource("Curve3D_dbge2")

[node name="PathFollow3D" type="PathFollow3D" parent="."]
transform = Transform3D(-0.465451, 0, 0.885072, 0, 1, 0, -0.885072, 0, -0.465451, -0.0253997, 0, -0.126996)
script = ExtResource("1_f5pw5")

[node name="Obstacle" parent="PathFollow3D" instance=ExtResource("2_qf187")]
transform = Transform3D(-0.884216, 0, 0.467078, 0, 1, 0, -0.467078, 0, -0.884216, 0, 1.026, 0)
