%YAML 1.1
%TAG !u! tag:unity3d.com,2011:
--- !u!29 &1
OcclusionCullingSettings:
  m_ObjectHideFlags: 0
  serializedVersion: 2
  m_OcclusionBakeSettings:
    smallestOccluder: 5
    smallestHole: 0.25
    backfaceThreshold: 100
  m_SceneGUID: 00000000000000000000000000000000
  m_OcclusionCullingData: {fileID: 0}
--- !u!104 &2
RenderSettings:
  m_ObjectHideFlags: 0
  serializedVersion: 9
  m_Fog: 0
  m_FogColor: {r: 0.5, g: 0.5, b: 0.5, a: 1}
  m_FogMode: 3
  m_FogDensity: 0.01
  m_LinearFogStart: 0
  m_LinearFogEnd: 300
  m_AmbientSkyColor: {r: 0.212, g: 0.227, b: 0.259, a: 1}
  m_AmbientEquatorColor: {r: 0.114, g: 0.125, b: 0.133, a: 1}
  m_AmbientGroundColor: {r: 0.047, g: 0.043, b: 0.035, a: 1}
  m_AmbientIntensity: 1
  m_AmbientMode: 0
  m_SubtractiveShadowColor: {r: 0.42, g: 0.478, b: 0.627, a: 1}
  m_SkyboxMaterial: {fileID: 10304, guid: 0000000000000000f000000000000000, type: 0}
  m_HaloStrength: 0.5
  m_FlareStrength: 1
  m_FlareFadeSpeed: 3
  m_HaloTexture: {fileID: 0}
  m_SpotCookie: {fileID: 10001, guid: 0000000000000000e000000000000000, type: 0}
  m_DefaultReflectionMode: 0
  m_DefaultReflectionResolution: 128
  m_ReflectionBounces: 1
  m_ReflectionIntensity: 1
  m_CustomReflection: {fileID: 0}
  m_Sun: {fileID: 0}
  m_IndirectSpecularColor: {r: 0.18028378, g: 0.22571412, b: 0.30692285, a: 1}
  m_UseRadianceAmbientProbe: 0
--- !u!157 &3
LightmapSettings:
  m_ObjectHideFlags: 0
  serializedVersion: 12
  m_GIWorkflowMode: 1
  m_GISettings:
    serializedVersion: 2
    m_BounceScale: 1
    m_IndirectOutputScale: 1
    m_AlbedoBoost: 1
    m_EnvironmentLightingMode: 0
    m_EnableBakedLightmaps: 1
    m_EnableRealtimeLightmaps: 0
  m_LightmapEditorSettings:
    serializedVersion: 12
    m_Resolution: 2
    m_BakeResolution: 40
    m_AtlasSize: 1024
    m_AO: 0
    m_AOMaxDistance: 1
    m_CompAOExponent: 1
    m_CompAOExponentDirect: 0
    m_ExtractAmbientOcclusion: 0
    m_Padding: 2
    m_LightmapParameters: {fileID: 0}
    m_LightmapsBakeMode: 1
    m_TextureCompression: 1
    m_FinalGather: 0
    m_FinalGatherFiltering: 1
    m_FinalGatherRayCount: 256
    m_ReflectionCompression: 2
    m_MixedBakeMode: 2
    m_BakeBackend: 1
    m_PVRSampling: 1
    m_PVRDirectSampleCount: 32
    m_PVRSampleCount: 512
    m_PVRBounces: 2
    m_PVREnvironmentSampleCount: 256
    m_PVREnvironmentReferencePointCount: 2048
    m_PVRFilteringMode: 1
    m_PVRDenoiserTypeDirect: 1
    m_PVRDenoiserTypeIndirect: 1
    m_PVRDenoiserTypeAO: 1
    m_PVRFilterTypeDirect: 0
    m_PVRFilterTypeIndirect: 0
    m_PVRFilterTypeAO: 0
    m_PVREnvironmentMIS: 1
    m_PVRCulling: 1
    m_PVRFilteringGaussRadiusDirect: 1
    m_PVRFilteringGaussRadiusIndirect: 5
    m_PVRFilteringGaussRadiusAO: 2
    m_PVRFilteringAtrousPositionSigmaDirect: 0.5
    m_PVRFilteringAtrousPositionSigmaIndirect: 2
    m_PVRFilteringAtrousPositionSigmaAO: 1
    m_ExportTrainingData: 0
    m_TrainingDataDestination: TrainingData
    m_LightProbeSampleCountMultiplier: 4
  m_LightingDataAsset: {fileID: 0}
  m_LightingSettings: {fileID: 0}
--- !u!196 &4
NavMeshSettings:
  serializedVersion: 2
  m_ObjectHideFlags: 0
  m_BuildSettings:
    serializedVersion: 2
    agentTypeID: 0
    agentRadius: 0.5
    agentHeight: 2
    agentSlope: 45
    agentClimb: 0.4
    ledgeDropHeight: 0
    maxJumpAcrossDistance: 0
    minRegionArea: 2
    manualCellSize: 0
    cellSize: 0.16666667
    manualTileSize: 0
    tileSize: 256
    accuratePlacement: 0
    maxJobWorkers: 0
    preserveTilesOutsideBounds: 0
    debug:
      m_Flags: 0
  m_NavMeshData: {fileID: 0}
--- !u!1 &100827860
GameObject:
  m_ObjectHideFlags: 0
  m_CorrespondingSourceObject: {fileID: 0}
  m_PrefabInstance: {fileID: 0}
  m_PrefabAsset: {fileID: 0}
  serializedVersion: 6
  m_Component:
  - component: {fileID: 100827864}
  - component: {fileID: 100827863}
  - component: {fileID: 100827862}
  - component: {fileID: 100827861}
  - component: {fileID: 100827865}
  m_Layer: 3
  m_Name: Cube (1)
  m_TagString: Untagged
  m_Icon: {fileID: 0}
  m_NavMeshLayer: 0
  m_StaticEditorFlags: 0
  m_IsActive: 1
--- !u!65 &100827861
BoxCollider:
  m_ObjectHideFlags: 0
  m_CorrespondingSourceObject: {fileID: 0}
  m_PrefabInstance: {fileID: 0}
  m_PrefabAsset: {fileID: 0}
  m_GameObject: {fileID: 100827860}
  m_Material: {fileID: 0}
  m_IsTrigger: 0
  m_Enabled: 1
  serializedVersion: 2
  m_Size: {x: 1, y: 1, z: 1}
  m_Center: {x: 0, y: 0, z: 0}
--- !u!23 &100827862
MeshRenderer:
  m_ObjectHideFlags: 0
  m_CorrespondingSourceObject: {fileID: 0}
  m_PrefabInstance: {fileID: 0}
  m_PrefabAsset: {fileID: 0}
  m_GameObject: {fileID: 100827860}
  m_Enabled: 1
  m_CastShadows: 1
  m_ReceiveShadows: 1
  m_DynamicOccludee: 1
  m_StaticShadowCaster: 0
  m_MotionVectors: 1
  m_LightProbeUsage: 1
  m_ReflectionProbeUsage: 1
  m_RayTracingMode: 2
  m_RayTraceProcedural: 0
  m_RenderingLayerMask: 1
  m_RendererPriority: 0
  m_Materials:
  - {fileID: 10303, guid: 0000000000000000f000000000000000, type: 0}
  m_StaticBatchInfo:
    firstSubMesh: 0
    subMeshCount: 0
  m_StaticBatchRoot: {fileID: 0}
  m_ProbeAnchor: {fileID: 0}
  m_LightProbeVolumeOverride: {fileID: 0}
  m_ScaleInLightmap: 1
  m_ReceiveGI: 1
  m_PreserveUVs: 0
  m_IgnoreNormalsForChartDetection: 0
  m_ImportantGI: 0
  m_StitchLightmapSeams: 1
  m_SelectedEditorRenderState: 3
  m_MinimumChartSize: 4
  m_AutoUVMaxDistance: 0.5
  m_AutoUVMaxAngle: 89
  m_LightmapParameters: {fileID: 0}
  m_SortingLayerID: 0
  m_SortingLayer: 0
  m_SortingOrder: 0
  m_AdditionalVertexStreams: {fileID: 0}
--- !u!33 &100827863
MeshFilter:
  m_ObjectHideFlags: 0
  m_CorrespondingSourceObject: {fileID: 0}
  m_PrefabInstance: {fileID: 0}
  m_PrefabAsset: {fileID: 0}
  m_GameObject: {fileID: 100827860}
  m_Mesh: {fileID: 10202, guid: 0000000000000000e000000000000000, type: 0}
--- !u!4 &100827864
Transform:
  m_ObjectHideFlags: 0
  m_CorrespondingSourceObject: {fileID: 0}
  m_PrefabInstance: {fileID: 0}
  m_PrefabAsset: {fileID: 0}
  m_GameObject: {fileID: 100827860}
  m_LocalRotation: {x: 0, y: 0, z: 0, w: 1}
  m_LocalPosition: {x: -1.5006, y: -1.9188, z: 2.3947506}
  m_LocalScale: {x: 35.699394, y: 5.2829776, z: 57.046185}
  m_ConstrainProportionsScale: 0
  m_Children: []
  m_Father: {fileID: 0}
  m_RootOrder: 4
  m_LocalEulerAnglesHint: {x: 0, y: 0, z: 0}
--- !u!54 &100827865
Rigidbody:
  m_ObjectHideFlags: 0
  m_CorrespondingSourceObject: {fileID: 0}
  m_PrefabInstance: {fileID: 0}
  m_PrefabAsset: {fileID: 0}
  m_GameObject: {fileID: 100827860}
  serializedVersion: 2
  m_Mass: 1
  m_Drag: 0
  m_AngularDrag: 0.05
  m_UseGravity: 0
  m_IsKinematic: 0
  m_Interpolate: 0
  m_Constraints: 126
  m_CollisionDetection: 0
--- !u!4 &750291734 stripped
Transform:
  m_CorrespondingSourceObject: {fileID: 3343694482655920308, guid: 079278f03f7194942bfd7b4e5dd6c6e7, type: 3}
  m_PrefabInstance: {fileID: 6679202041903983472}
  m_PrefabAsset: {fileID: 0}
--- !u!1 &774665671 stripped
GameObject:
  m_CorrespondingSourceObject: {fileID: 3832045218321221079, guid: 63480fabd431c194aac5554d93a27e81, type: 3}
  m_PrefabInstance: {fileID: 3832045218021584912}
  m_PrefabAsset: {fileID: 0}
--- !u!20 &1691442232 stripped
Camera:
  m_CorrespondingSourceObject: {fileID: 7748682312059786270, guid: 4be3de897a20aa346b3ed374341a5455, type: 3}
  m_PrefabInstance: {fileID: 7748682312526350374}
  m_PrefabAsset: {fileID: 0}
--- !u!1 &1794306032
GameObject:
  m_ObjectHideFlags: 0
  m_CorrespondingSourceObject: {fileID: 0}
  m_PrefabInstance: {fileID: 0}
  m_PrefabAsset: {fileID: 0}
  serializedVersion: 6
  m_Component:
  - component: {fileID: 1794306034}
  - component: {fileID: 1794306033}
  m_Layer: 0
  m_Name: Directional Light
  m_TagString: Untagged
  m_Icon: {fileID: 0}
  m_NavMeshLayer: 0
  m_StaticEditorFlags: 0
  m_IsActive: 1
--- !u!108 &1794306033
Light:
  m_ObjectHideFlags: 0
  m_CorrespondingSourceObject: {fileID: 0}
  m_PrefabInstance: {fileID: 0}
  m_PrefabAsset: {fileID: 0}
  m_GameObject: {fileID: 1794306032}
  m_Enabled: 1
  serializedVersion: 10
  m_Type: 1
  m_Shape: 0
  m_Color: {r: 1, g: 0.95686275, b: 0.8392157, a: 1}
  m_Intensity: 1
  m_Range: 10
  m_SpotAngle: 30
  m_InnerSpotAngle: 21.80208
  m_CookieSize: 10
  m_Shadows:
    m_Type: 2
    m_Resolution: -1
    m_CustomResolution: -1
    m_Strength: 1
    m_Bias: 0.05
    m_NormalBias: 0.4
    m_NearPlane: 0.2
    m_CullingMatrixOverride:
      e00: 1
      e01: 0
      e02: 0
      e03: 0
      e10: 0
      e11: 1
      e12: 0
      e13: 0
      e20: 0
      e21: 0
      e22: 1
      e23: 0
      e30: 0
      e31: 0
      e32: 0
      e33: 1
    m_UseCullingMatrixOverride: 0
  m_Cookie: {fileID: 0}
  m_DrawHalo: 0
  m_Flare: {fileID: 0}
  m_RenderMode: 0
  m_CullingMask:
    serializedVersion: 2
    m_Bits: 4294967295
  m_RenderingLayerMask: 1
  m_Lightmapping: 4
  m_LightShadowCasterMode: 0
  m_AreaSize: {x: 1, y: 1}
  m_BounceIntensity: 1
  m_ColorTemperature: 6570
  m_UseColorTemperature: 0
  m_BoundingSphereOverride: {x: 0, y: 0, z: 0, w: 0}
  m_UseBoundingSphereOverride: 0
  m_UseViewFrustumForShadowCasterCull: 1
  m_ShadowRadius: 0
  m_ShadowAngle: 0
--- !u!4 &1794306034
Transform:
  m_ObjectHideFlags: 0
  m_CorrespondingSourceObject: {fileID: 0}
  m_PrefabInstance: {fileID: 0}
  m_PrefabAsset: {fileID: 0}
  m_GameObject: {fileID: 1794306032}
  m_LocalRotation: {x: 0.40821788, y: -0.23456968, z: 0.10938163, w: 0.8754261}
  m_LocalPosition: {x: 0, y: 3, z: 0}
  m_LocalScale: {x: 1, y: 1, z: 1}
  m_ConstrainProportionsScale: 0
  m_Children: []
  m_Father: {fileID: 0}
  m_RootOrder: 2
  m_LocalEulerAnglesHint: {x: 50, y: -30, z: 0}
--- !u!1 &1876137708
GameObject:
  m_ObjectHideFlags: 0
  m_CorrespondingSourceObject: {fileID: 0}
  m_PrefabInstance: {fileID: 0}
  m_PrefabAsset: {fileID: 0}
  serializedVersion: 6
  m_Component:
  - component: {fileID: 1876137712}
  - component: {fileID: 1876137711}
  - component: {fileID: 1876137710}
  - component: {fileID: 1876137709}
  - component: {fileID: 1876137713}
  m_Layer: 3
  m_Name: Cube
  m_TagString: Untagged
  m_Icon: {fileID: 0}
  m_NavMeshLayer: 0
  m_StaticEditorFlags: 0
  m_IsActive: 1
--- !u!65 &1876137709
BoxCollider:
  m_ObjectHideFlags: 0
  m_CorrespondingSourceObject: {fileID: 0}
  m_PrefabInstance: {fileID: 0}
  m_PrefabAsset: {fileID: 0}
  m_GameObject: {fileID: 1876137708}
  m_Material: {fileID: 0}
  m_IsTrigger: 0
  m_Enabled: 1
  serializedVersion: 2
  m_Size: {x: 1, y: 1, z: 1}
  m_Center: {x: 0, y: 0, z: 0}
--- !u!23 &1876137710
MeshRenderer:
  m_ObjectHideFlags: 0
  m_CorrespondingSourceObject: {fileID: 0}
  m_PrefabInstance: {fileID: 0}
  m_PrefabAsset: {fileID: 0}
  m_GameObject: {fileID: 1876137708}
  m_Enabled: 1
  m_CastShadows: 1
  m_ReceiveShadows: 1
  m_DynamicOccludee: 1
  m_StaticShadowCaster: 0
  m_MotionVectors: 1
  m_LightProbeUsage: 1
  m_ReflectionProbeUsage: 1
  m_RayTracingMode: 2
  m_RayTraceProcedural: 0
  m_RenderingLayerMask: 1
  m_RendererPriority: 0
  m_Materials:
  - {fileID: 10303, guid: 0000000000000000f000000000000000, type: 0}
  m_StaticBatchInfo:
    firstSubMesh: 0
    subMeshCount: 0
  m_StaticBatchRoot: {fileID: 0}
  m_ProbeAnchor: {fileID: 0}
  m_LightProbeVolumeOverride: {fileID: 0}
  m_ScaleInLightmap: 1
  m_ReceiveGI: 1
  m_PreserveUVs: 0
  m_IgnoreNormalsForChartDetection: 0
  m_ImportantGI: 0
  m_StitchLightmapSeams: 1
  m_SelectedEditorRenderState: 3
  m_MinimumChartSize: 4
  m_AutoUVMaxDistance: 0.5
  m_AutoUVMaxAngle: 89
  m_LightmapParameters: {fileID: 0}
  m_SortingLayerID: 0
  m_SortingLayer: 0
  m_SortingOrder: 0
  m_AdditionalVertexStreams: {fileID: 0}
--- !u!33 &1876137711
MeshFilter:
  m_ObjectHideFlags: 0
  m_CorrespondingSourceObject: {fileID: 0}
  m_PrefabInstance: {fileID: 0}
  m_PrefabAsset: {fileID: 0}
  m_GameObject: {fileID: 1876137708}
  m_Mesh: {fileID: 10202, guid: 0000000000000000e000000000000000, type: 0}
--- !u!4 &1876137712
Transform:
  m_ObjectHideFlags: 0
  m_CorrespondingSourceObject: {fileID: 0}
  m_PrefabInstance: {fileID: 0}
  m_PrefabAsset: {fileID: 0}
  m_GameObject: {fileID: 1876137708}
  m_LocalRotation: {x: 0, y: 0, z: 0, w: 1}
  m_LocalPosition: {x: 1.9, y: 1.239, z: 0.14}
  m_LocalScale: {x: 1, y: 1, z: 1}
  m_ConstrainProportionsScale: 0
  m_Children: []
  m_Father: {fileID: 0}
  m_RootOrder: 3
  m_LocalEulerAnglesHint: {x: 0, y: 0, z: 0}
--- !u!54 &1876137713
Rigidbody:
  m_ObjectHideFlags: 0
  m_CorrespondingSourceObject: {fileID: 0}
  m_PrefabInstance: {fileID: 0}
  m_PrefabAsset: {fileID: 0}
  m_GameObject: {fileID: 1876137708}
  serializedVersion: 2
  m_Mass: 1
  m_Drag: 0
  m_AngularDrag: 0.05
  m_UseGravity: 0
  m_IsKinematic: 0
  m_Interpolate: 0
  m_Constraints: 126
  m_CollisionDetection: 0
--- !u!1001 &3832045218021584912
PrefabInstance:
  m_ObjectHideFlags: 0
  serializedVersion: 2
  m_Modification:
    m_TransformParent: {fileID: 0}
    m_Modifications:
    - target: {fileID: 3832045218076544493, guid: 63480fabd431c194aac5554d93a27e81, type: 3}
      propertyPath: m_LocalPosition.x
      value: 0
      objectReference: {fileID: 0}
    - target: {fileID: 3832045218076544493, guid: 63480fabd431c194aac5554d93a27e81, type: 3}
      propertyPath: m_LocalPosition.y
      value: 0
      objectReference: {fileID: 0}
    - target: {fileID: 3832045218076544493, guid: 63480fabd431c194aac5554d93a27e81, type: 3}
      propertyPath: m_LocalPosition.z
      value: 0
      objectReference: {fileID: 0}
    - target: {fileID: 3832045218076544493, guid: 63480fabd431c194aac5554d93a27e81, type: 3}
      propertyPath: m_LocalRotation.w
      value: 0.973249
      objectReference: {fileID: 0}
    - target: {fileID: 3832045218076544493, guid: 63480fabd431c194aac5554d93a27e81, type: 3}
      propertyPath: m_LocalRotation.x
      value: 0.22975293
      objectReference: {fileID: 0}
    - target: {fileID: 3832045218076544493, guid: 63480fabd431c194aac5554d93a27e81, type: 3}
      propertyPath: m_LocalRotation.y
      value: 0.000000016746094
      objectReference: {fileID: 0}
    - target: {fileID: 3832045218076544493, guid: 63480fabd431c194aac5554d93a27e81, type: 3}
      propertyPath: m_LocalRotation.z
      value: -0.0000000039532173
      objectReference: {fileID: 0}
    - target: {fileID: 3832045218321221079, guid: 63480fabd431c194aac5554d93a27e81, type: 3}
      propertyPath: m_Name
      value: PlayerCamera
      objectReference: {fileID: 0}
    - target: {fileID: 3832045218321221081, guid: 63480fabd431c194aac5554d93a27e81, type: 3}
      propertyPath: m_RootOrder
      value: 5
      objectReference: {fileID: 0}
    - target: {fileID: 3832045218321221081, guid: 63480fabd431c194aac5554d93a27e81, type: 3}
      propertyPath: m_LocalPosition.x
      value: -0.000000030799868
      objectReference: {fileID: 0}
    - target: {fileID: 3832045218321221081, guid: 63480fabd431c194aac5554d93a27e81, type: 3}
      propertyPath: m_LocalPosition.y
      value: 4.074
      objectReference: {fileID: 0}
    - target: {fileID: 3832045218321221081, guid: 63480fabd431c194aac5554d93a27e81, type: 3}
      propertyPath: m_LocalPosition.z
      value: -7.2
      objectReference: {fileID: 0}
    - target: {fileID: 3832045218321221081, guid: 63480fabd431c194aac5554d93a27e81, type: 3}
      propertyPath: m_LocalRotation.w
      value: 1
      objectReference: {fileID: 0}
    - target: {fileID: 3832045218321221081, guid: 63480fabd431c194aac5554d93a27e81, type: 3}
      propertyPath: m_LocalRotation.x
      value: -0
      objectReference: {fileID: 0}
    - target: {fileID: 3832045218321221081, guid: 63480fabd431c194aac5554d93a27e81, type: 3}
      propertyPath: m_LocalRotation.y
      value: -0
      objectReference: {fileID: 0}
    - target: {fileID: 3832045218321221081, guid: 63480fabd431c194aac5554d93a27e81, type: 3}
      propertyPath: m_LocalRotation.z
      value: -0
      objectReference: {fileID: 0}
    - target: {fileID: 3832045218321221081, guid: 63480fabd431c194aac5554d93a27e81, type: 3}
      propertyPath: m_LocalEulerAnglesHint.x
      value: 0
      objectReference: {fileID: 0}
    - target: {fileID: 3832045218321221081, guid: 63480fabd431c194aac5554d93a27e81, type: 3}
      propertyPath: m_LocalEulerAnglesHint.y
      value: 0
      objectReference: {fileID: 0}
    - target: {fileID: 3832045218321221081, guid: 63480fabd431c194aac5554d93a27e81, type: 3}
      propertyPath: m_LocalEulerAnglesHint.z
      value: 0
      objectReference: {fileID: 0}
    - target: {fileID: 3832045218321221083, guid: 63480fabd431c194aac5554d93a27e81, type: 3}
      propertyPath: m_Follow
      value: 
      objectReference: {fileID: 750291734}
    - target: {fileID: 3832045218321221083, guid: 63480fabd431c194aac5554d93a27e81, type: 3}
      propertyPath: m_LookAt
      value: 
      objectReference: {fileID: 750291734}
    - target: {fileID: 3832045218321221083, guid: 63480fabd431c194aac5554d93a27e81, type: 3}
      propertyPath: m_Transitions.m_BlendHint
      value: 0
      objectReference: {fileID: 0}
    - target: {fileID: 3832045218321221083, guid: 63480fabd431c194aac5554d93a27e81, type: 3}
      propertyPath: m_YAxisRecentering.m_enabled
      value: 0
      objectReference: {fileID: 0}
    - target: {fileID: 3832045218609502504, guid: 63480fabd431c194aac5554d93a27e81, type: 3}
      propertyPath: m_LocalPosition.x
      value: 0
      objectReference: {fileID: 0}
    - target: {fileID: 3832045218609502504, guid: 63480fabd431c194aac5554d93a27e81, type: 3}
      propertyPath: m_LocalPosition.z
      value: 0
      objectReference: {fileID: 0}
    - target: {fileID: 3832045218609502504, guid: 63480fabd431c194aac5554d93a27e81, type: 3}
      propertyPath: m_LocalRotation.w
      value: 0.99508464
      objectReference: {fileID: 0}
    - target: {fileID: 3832045218609502504, guid: 63480fabd431c194aac5554d93a27e81, type: 3}
      propertyPath: m_LocalRotation.x
      value: 0.099028245
      objectReference: {fileID: 0}
    - target: {fileID: 3832045218609502504, guid: 63480fabd431c194aac5554d93a27e81, type: 3}
      propertyPath: m_LocalRotation.y
      value: 1e-45
      objectReference: {fileID: 0}
    - target: {fileID: 3832045218609502504, guid: 63480fabd431c194aac5554d93a27e81, type: 3}
      propertyPath: m_LocalRotation.z
      value: -0
      objectReference: {fileID: 0}
    - target: {fileID: 3832045219405434183, guid: 63480fabd431c194aac5554d93a27e81, type: 3}
      propertyPath: m_LocalPosition.x
      value: 0
      objectReference: {fileID: 0}
    - target: {fileID: 3832045219405434183, guid: 63480fabd431c194aac5554d93a27e81, type: 3}
      propertyPath: m_LocalPosition.y
      value: 0
      objectReference: {fileID: 0}
    - target: {fileID: 3832045219405434183, guid: 63480fabd431c194aac5554d93a27e81, type: 3}
      propertyPath: m_LocalPosition.z
      value: 0
      objectReference: {fileID: 0}
    - target: {fileID: 3832045219405434183, guid: 63480fabd431c194aac5554d93a27e81, type: 3}
      propertyPath: m_LocalRotation.w
      value: 0.98287594
      objectReference: {fileID: 0}
    - target: {fileID: 3832045219405434183, guid: 63480fabd431c194aac5554d93a27e81, type: 3}
      propertyPath: m_LocalRotation.x
      value: 0.18426846
      objectReference: {fileID: 0}
    - target: {fileID: 3832045219405434183, guid: 63480fabd431c194aac5554d93a27e81, type: 3}
      propertyPath: m_LocalRotation.y
      value: -0
      objectReference: {fileID: 0}
    - target: {fileID: 3832045219405434183, guid: 63480fabd431c194aac5554d93a27e81, type: 3}
      propertyPath: m_LocalRotation.z
      value: -0
      objectReference: {fileID: 0}
    m_RemovedComponents: []
  m_SourcePrefab: {fileID: 100100000, guid: 63480fabd431c194aac5554d93a27e81, type: 3}
--- !u!1001 &6679202041903983472
PrefabInstance:
  m_ObjectHideFlags: 0
  serializedVersion: 2
  m_Modification:
    m_TransformParent: {fileID: 0}
    m_Modifications:
    - target: {fileID: 1090311403, guid: 079278f03f7194942bfd7b4e5dd6c6e7, type: 3}
      propertyPath: _playerCamera
      value: 
      objectReference: {fileID: 774665671}
    - target: {fileID: 1090311404, guid: 079278f03f7194942bfd7b4e5dd6c6e7, type: 3}
      propertyPath: m_Camera
      value: 
      objectReference: {fileID: 1691442232}
    - target: {fileID: 3343694482655920308, guid: 079278f03f7194942bfd7b4e5dd6c6e7, type: 3}
      propertyPath: m_RootOrder
      value: 1
      objectReference: {fileID: 0}
    - target: {fileID: 3343694482655920308, guid: 079278f03f7194942bfd7b4e5dd6c6e7, type: 3}
      propertyPath: m_LocalPosition.x
      value: -0.000000030799868
      objectReference: {fileID: 0}
    - target: {fileID: 3343694482655920308, guid: 079278f03f7194942bfd7b4e5dd6c6e7, type: 3}
      propertyPath: m_LocalPosition.y
      value: 2.074
      objectReference: {fileID: 0}
    - target: {fileID: 3343694482655920308, guid: 079278f03f7194942bfd7b4e5dd6c6e7, type: 3}
      propertyPath: m_LocalPosition.z
      value: -3.2
      objectReference: {fileID: 0}
    - target: {fileID: 3343694482655920308, guid: 079278f03f7194942bfd7b4e5dd6c6e7, type: 3}
      propertyPath: m_LocalRotation.w
      value: 1
      objectReference: {fileID: 0}
    - target: {fileID: 3343694482655920308, guid: 079278f03f7194942bfd7b4e5dd6c6e7, type: 3}
      propertyPath: m_LocalRotation.x
      value: 0
      objectReference: {fileID: 0}
    - target: {fileID: 3343694482655920308, guid: 079278f03f7194942bfd7b4e5dd6c6e7, type: 3}
      propertyPath: m_LocalRotation.y
      value: 0
      objectReference: {fileID: 0}
    - target: {fileID: 3343694482655920308, guid: 079278f03f7194942bfd7b4e5dd6c6e7, type: 3}
      propertyPath: m_LocalRotation.z
      value: 0
      objectReference: {fileID: 0}
    - target: {fileID: 3343694482655920308, guid: 079278f03f7194942bfd7b4e5dd6c6e7, type: 3}
      propertyPath: m_LocalEulerAnglesHint.x
      value: 0
      objectReference: {fileID: 0}
    - target: {fileID: 3343694482655920308, guid: 079278f03f7194942bfd7b4e5dd6c6e7, type: 3}
      propertyPath: m_LocalEulerAnglesHint.y
      value: 0
      objectReference: {fileID: 0}
    - target: {fileID: 3343694482655920308, guid: 079278f03f7194942bfd7b4e5dd6c6e7, type: 3}
      propertyPath: m_LocalEulerAnglesHint.z
      value: 0
      objectReference: {fileID: 0}
    - target: {fileID: 3343694482656013360, guid: 079278f03f7194942bfd7b4e5dd6c6e7, type: 3}
      propertyPath: m_Name
      value: Player
      objectReference: {fileID: 0}
    m_RemovedComponents: []
  m_SourcePrefab: {fileID: 100100000, guid: 079278f03f7194942bfd7b4e5dd6c6e7, type: 3}
--- !u!1001 &7748682312526350374
PrefabInstance:
  m_ObjectHideFlags: 0
  serializedVersion: 2
  m_Modification:
    m_TransformParent: {fileID: 0}
    m_Modifications:
    - target: {fileID: 7748682312059786256, guid: 4be3de897a20aa346b3ed374341a5455, type: 3}
      propertyPath: m_Name
      value: Main Camera
      objectReference: {fileID: 0}
    - target: {fileID: 7748682312059786270, guid: 4be3de897a20aa346b3ed374341a5455, type: 3}
      propertyPath: field of view
      value: 50
      objectReference: {fileID: 0}
    - target: {fileID: 7748682312059786270, guid: 4be3de897a20aa346b3ed374341a5455, type: 3}
      propertyPath: near clip plane
      value: 0.1
      objectReference: {fileID: 0}
    - target: {fileID: 7748682312059786271, guid: 4be3de897a20aa346b3ed374341a5455, type: 3}
      propertyPath: m_RootOrder
      value: 0
      objectReference: {fileID: 0}
    - target: {fileID: 7748682312059786271, guid: 4be3de897a20aa346b3ed374341a5455, type: 3}
      propertyPath: m_LocalPosition.x
      value: -0.000000030799868
      objectReference: {fileID: 0}
    - target: {fileID: 7748682312059786271, guid: 4be3de897a20aa346b3ed374341a5455, type: 3}
      propertyPath: m_LocalPosition.y
      value: 4.074
      objectReference: {fileID: 0}
    - target: {fileID: 7748682312059786271, guid: 4be3de897a20aa346b3ed374341a5455, type: 3}
      propertyPath: m_LocalPosition.z
      value: -7.2
      objectReference: {fileID: 0}
    - target: {fileID: 7748682312059786271, guid: 4be3de897a20aa346b3ed374341a5455, type: 3}
      propertyPath: m_LocalRotation.w
      value: 0.99508464
      objectReference: {fileID: 0}
    - target: {fileID: 7748682312059786271, guid: 4be3de897a20aa346b3ed374341a5455, type: 3}
      propertyPath: m_LocalRotation.x
      value: 0.099028245
      objectReference: {fileID: 0}
    - target: {fileID: 7748682312059786271, guid: 4be3de897a20aa346b3ed374341a5455, type: 3}
      propertyPath: m_LocalRotation.y
      value: 0
      objectReference: {fileID: 0}
    - target: {fileID: 7748682312059786271, guid: 4be3de897a20aa346b3ed374341a5455, type: 3}
      propertyPath: m_LocalRotation.z
      value: 0
      objectReference: {fileID: 0}
    - target: {fileID: 7748682312059786271, guid: 4be3de897a20aa346b3ed374341a5455, type: 3}
      propertyPath: m_LocalEulerAnglesHint.x
      value: 0
      objectReference: {fileID: 0}
    - target: {fileID: 7748682312059786271, guid: 4be3de897a20aa346b3ed374341a5455, type: 3}
      propertyPath: m_LocalEulerAnglesHint.y
      value: 0
      objectReference: {fileID: 0}
    - target: {fileID: 7748682312059786271, guid: 4be3de897a20aa346b3ed374341a5455, type: 3}
      propertyPath: m_LocalEulerAnglesHint.z
      value: 0
      objectReference: {fileID: 0}
    m_RemovedComponents: []
  m_SourcePrefab: {fileID: 100100000, guid: 4be3de897a20aa346b3ed374341a5455, type: 3}
