%YAML 1.1
%TAG !u! tag:unity3d.com,2011:
--- !u!74 &7400000
AnimationClip:
  m_ObjectHideFlags: 0
  m_CorrespondingSourceObject: {fileID: 0}
  m_PrefabInstance: {fileID: 0}
  m_PrefabAsset: {fileID: 0}
  m_Name: RifleApunt
  serializedVersion: 6
  m_Legacy: 0
  m_Compressed: 0
  m_UseHighQualityCurve: 1
  m_RotationCurves:
  - curve:
      serializedVersion: 2
      m_Curve:
      - serializedVersion: 3
        time: 0
        value: {x: -0.111204274, y: 0.3402089, z: 0.027112715, w: 0.93335766}
        inSlope: {x: 0, y: 0, z: 0, w: 0}
        outSlope: {x: 0, y: 0, z: 0, w: 0}
        tangentMode: 0
        weightedMode: 0
        inWeight: {x: 0.33333334, y: 0.33333334, z: 0.33333334, w: 0.33333334}
        outWeight: {x: 0.33333334, y: 0.33333334, z: 0.33333334, w: 0.33333334}
      - serializedVersion: 3
        time: 3.1000001
        value: {x: -0.111204274, y: 0.3402089, z: 0.027112715, w: 0.93335766}
        inSlope: {x: 0, y: 0, z: 0, w: 0}
        outSlope: {x: 0, y: 0, z: 0, w: 0}
        tangentMode: 0
        weightedMode: 0
        inWeight: {x: 0.33333334, y: 0.33333334, z: 0.33333334, w: 0.33333334}
        outWeight: {x: 0.33333334, y: 0.33333334, z: 0.33333334, w: 0.33333334}
      m_PreInfinity: 2
      m_PostInfinity: 2
      m_RotationOrder: 4
    path: Root
  - curve:
      serializedVersion: 2
      m_Curve:
      - serializedVersion: 3
        time: 0
        value: {x: 0.46113664, y: -0.5360532, z: -0.46113664, w: 0.5360532}
        inSlope: {x: 0, y: 0, z: 0, w: 0}
        outSlope: {x: 0, y: 0, z: 0, w: 0}
        tangentMode: 0
        weightedMode: 0
        inWeight: {x: 0.33333334, y: 0.33333334, z: 0.33333334, w: 0.33333334}
        outWeight: {x: 0.33333334, y: 0.33333334, z: 0.33333334, w: 0.33333334}
      - serializedVersion: 3
        time: 0.033333335
        value: {x: 0.46113664, y: -0.5360532, z: -0.46113664, w: 0.5360532}
        inSlope: {x: 0, y: 0, z: 0, w: 0}
        outSlope: {x: 0, y: 0, z: 0, w: 0}
        tangentMode: 0
        weightedMode: 0
        inWeight: {x: 0.33333334, y: 0.33333334, z: 0.33333334, w: 0.33333334}
        outWeight: {x: 0.33333334, y: 0.33333334, z: 0.33333334, w: 0.33333334}
      m_PreInfinity: 2
      m_PostInfinity: 2
      m_RotationOrder: 4
    path: Root/Pelvis
  - curve:
      serializedVersion: 2
      m_Curve:
      - serializedVersion: 3
        time: 0
        value: {x: 0.9856495, y: -0.16879614, z: -0.0016556003, w: 0.00033750886}
        inSlope: {x: 0.00029146668, y: 0.001669675, z: 0.0028512124, w: 0.000458408}
        outSlope: {x: 0.00029146668, y: 0.001669675, z: 0.0028512124, w: 0.000458408}
        tangentMode: 0
        weightedMode: 0
        inWeight: {x: 0.33333334, y: 0.33333334, z: 0.33333334, w: 0.33333334}
        outWeight: {x: 0.33333334, y: 0.33333334, z: 0.33333334, w: 0.33333334}
      - serializedVersion: 3
        time: 1.6333334
        value: {x: 0.98811215, y: -0.15371837, z: 0.0021513728, w: 0.00070688775}
        inSlope: {x: 0.0000008940697, y: 0.0000011175871, z: -0.00073956745, w: 0.00062680105}
        outSlope: {x: 0.0000008940697, y: 0.0000011175871, z: -0.00073956745, w: 0.00062680105}
        tangentMode: 0
        weightedMode: 0
        inWeight: {x: 0.33333334, y: 0.33333334, z: 0.33333334, w: 0.33333334}
        outWeight: {x: 0.33333334, y: 0.33333334, z: 0.33333334, w: 0.33333334}
      - serializedVersion: 3
        time: 3.1000001
        value: {x: 0.98565805, y: -0.16874781, z: -0.0015260127, w: 0.00031397623}
        inSlope: {x: -0.00038981476, y: -0.0022780916, z: -0.00067404535, w: -0.00007822244}
        outSlope: {x: -0.00038981476, y: -0.0022780916, z: -0.00067404535, w: -0.00007822244}
        tangentMode: 0
        weightedMode: 0
        inWeight: {x: 0.33333334, y: 0.33333334, z: 0.33333334, w: 0.33333334}
        outWeight: {x: 0.33333334, y: 0.33333334, z: 0.33333334, w: 0.33333334}
      m_PreInfinity: 2
      m_PostInfinity: 2
      m_RotationOrder: 4
    path: Root/Pelvis/spine_01
  - curve:
      serializedVersion: 2
      m_Curve:
      - serializedVersion: 3
        time: 0
        value: {x: 0.9989622, y: 0.045065243, z: 0.0066021895, w: -0.0001908107}
        inSlope: {x: -0.00084936613, y: 0.01870807, z: -0.0000034924594, w: -0.00012364922}
        outSlope: {x: -0.00084936613, y: 0.01870807, z: -0.0000034924594, w: -0.00012364922}
        tangentMode: 0
        weightedMode: 0
        inWeight: {x: 0.33333334, y: 0.33333334, z: 0.33333334, w: 0.33333334}
        outWeight: {x: 0.33333334, y: 0.33333334, z: 0.33333334, w: 0.33333334}
      - serializedVersion: 3
        time: 1.6333334
        value: {x: 0.9993286, y: 0.036288034, z: 0.005042892, w: -0.00030450185}
        inSlope: {x: 0.00012695801, y: -0.0035204026, z: 0.00016545893, w: -0.0000021915203}
        outSlope: {x: 0.00012695801, y: -0.0035204026, z: 0.00016545893, w: -0.0000021915203}
        tangentMode: 0
        weightedMode: 0
        inWeight: {x: 0.33333334, y: 0.33333334, z: 0.33333334, w: 0.33333334}
        outWeight: {x: 0.33333334, y: 0.33333334, z: 0.33333334, w: 0.33333334}
      - serializedVersion: 3
        time: 3.1000001
        value: {x: 0.99899143, y: 0.044408407, z: 0.006635247, w: -0.00016327685}
        inSlope: {x: -0.0006490952, y: 0.014684438, z: -0.00006509951, w: -0.00012676243}
        outSlope: {x: -0.0006490952, y: 0.014684438, z: -0.00006509951, w: -0.00012676243}
        tangentMode: 0
        weightedMode: 0
        inWeight: {x: 0.33333334, y: 0.33333334, z: 0.33333334, w: 0.33333334}
        outWeight: {x: 0.33333334, y: 0.33333334, z: 0.33333334, w: 0.33333334}
      m_PreInfinity: 2
      m_PostInfinity: 2
      m_RotationOrder: 4
    path: Root/Pelvis/spine_01/spine_02
  - curve:
      serializedVersion: 2
      m_Curve:
      - serializedVersion: 3
        time: 0
        value: {x: 0.9677522, y: -0.25181976, z: -0.0065000383, w: 0.0005145083}
        inSlope: {x: 0.0006562471, y: 0.0025230644, z: 0.0000029057262, w: 0.00001735054}
        outSlope: {x: 0.0006562471, y: 0.0025230644, z: 0.0000029057262, w: 0.00001735054}
        tangentMode: 0
        weightedMode: 0
        inWeight: {x: 0.33333334, y: 0.33333334, z: 0.33333334, w: 0.33333334}
        outWeight: {x: 0.33333334, y: 0.33333334, z: 0.33333334, w: 0.33333334}
      - serializedVersion: 3
        time: 1.6333334
        value: {x: 0.9688108, y: -0.2477512, z: -0.0049971235, w: 0.00004301922}
        inSlope: {x: 0.0015234961, y: 0.00595898, z: -0.0001227461, w: 0.000036398287}
        outSlope: {x: 0.0015234961, y: 0.00595898, z: -0.0001227461, w: 0.000036398287}
        tangentMode: 0
        weightedMode: 0
        inWeight: {x: 0.33333334, y: 0.33333334, z: 0.33333334, w: 0.33333334}
        outWeight: {x: 0.33333334, y: 0.33333334, z: 0.33333334, w: 0.33333334}
      - serializedVersion: 3
        time: 3.1000001
        value: {x: 0.9678684, y: -0.25137204, z: -0.006527017, w: 0.00054745085}
        inSlope: {x: -0.0023424649, y: -0.0090229595, z: 0.000048419508, w: -0.00010474246}
        outSlope: {x: -0.0023424649, y: -0.0090229595, z: 0.000048419508, w: -0.00010474246}
        tangentMode: 0
        weightedMode: 0
        inWeight: {x: 0.33333334, y: 0.33333334, z: 0.33333334, w: 0.33333334}
        outWeight: {x: 0.33333334, y: 0.33333334, z: 0.33333334, w: 0.33333334}
      m_PreInfinity: 2
      m_PostInfinity: 2
      m_RotationOrder: 4
    path: Root/Pelvis/spine_01/spine_02/spine_03
  - curve:
      serializedVersion: 2
      m_Curve:
      - serializedVersion: 3
        time: 0
        value: {x: 0.065641776, y: -0.00021044331, z: 0.045348722, w: 0.9968122}
        inSlope: {x: -0.0022977588, y: 0.000008272327, z: 0.001621954, w: 0.000078678124}
        outSlope: {x: -0.0022977588, y: 0.000008272327, z: 0.001621954, w: 0.000078678124}
        tangentMode: 0
        weightedMode: 0
        inWeight: {x: 0.33333334, y: 0.33333334, z: 0.33333334, w: 0.33333334}
        outWeight: {x: 0.33333334, y: 0.33333334, z: 0.33333334, w: 0.33333334}
      - serializedVersion: 3
        time: 1.6333334
        value: {x: 0.06563791, y: 0.00007141881, z: 0.05008609, w: 0.99658567}
        inSlope: {x: -0.000032633572, y: -0.00028338312, z: -0.0040654503, w: 0.0002065303}
        outSlope: {x: -0.000032633572, y: -0.00028338312, z: -0.0040654503, w: 0.0002065303}
        tangentMode: 0
        weightedMode: 0
        inWeight: {x: 0.33333334, y: 0.33333334, z: 0.33333334, w: 0.33333334}
        outWeight: {x: 0.33333334, y: 0.33333334, z: 0.33333334, w: 0.33333334}
      - serializedVersion: 3
        time: 3.1000001
        value: {x: 0.06560744, y: -0.0002442863, z: 0.04531722, w: 0.9968159}
        inSlope: {x: 0.000004246835, y: 0.000004176986, z: 0.000032521817, w: -0.000001788141}
        outSlope: {x: 0.000004246835, y: 0.000004176986, z: 0.000032521817, w: -0.000001788141}
        tangentMode: 0
        weightedMode: 0
        inWeight: {x: 0.33333334, y: 0.33333334, z: 0.33333334, w: 0.33333334}
        outWeight: {x: 0.33333334, y: 0.33333334, z: 0.33333334, w: 0.33333334}
      m_PreInfinity: 2
      m_PostInfinity: 2
      m_RotationOrder: 4
    path: Root/Pelvis/spine_01/spine_02/spine_03/neck_01
  - curve:
      serializedVersion: 2
      m_Curve:
      - serializedVersion: 3
        time: 0
        value: {x: 0.49142548, y: -0.569145, z: 0.4279038, w: 0.5014711}
        inSlope: {x: 0.001516342, y: 0.0034600494, z: 0.0040081143, w: -0.0009799004}
        outSlope: {x: 0.001516342, y: 0.0034600494, z: 0.0040081143, w: -0.0009799004}
        tangentMode: 0
        weightedMode: 0
        inWeight: {x: 0.33333334, y: 0.33333334, z: 0.33333334, w: 0.33333334}
        outWeight: {x: 0.33333334, y: 0.33333334, z: 0.33333334, w: 0.33333334}
      - serializedVersion: 3
        time: 1.6333334
        value: {x: 0.49412498, y: -0.56679225, z: 0.43034014, w: 0.49939406}
        inSlope: {x: -0.0024890923, y: -0.0020697732, z: -0.0020742435, w: 0.001900347}
        outSlope: {x: -0.0024890923, y: -0.0020697732, z: -0.0020742435, w: 0.001900347}
        tangentMode: 0
        weightedMode: 0
        inWeight: {x: 0.33333334, y: 0.33333334, z: 0.33333334, w: 0.33333334}
        outWeight: {x: 0.33333334, y: 0.33333334, z: 0.33333334, w: 0.33333334}
      - serializedVersion: 3
        time: 3.1000001
        value: {x: 0.49135548, y: -0.5691794, z: 0.42789334, w: 0.5015096}
        inSlope: {x: 0.0009611258, y: 0.0008261212, z: 0.00084757886, w: -0.0007277734}
        outSlope: {x: 0.0009611258, y: 0.0008261212, z: 0.00084757886, w: -0.0007277734}
        tangentMode: 0
        weightedMode: 0
        inWeight: {x: 0.33333334, y: 0.33333334, z: 0.33333334, w: 0.33333334}
        outWeight: {x: 0.33333334, y: 0.33333334, z: 0.33333334, w: 0.33333334}
      m_PreInfinity: 2
      m_PostInfinity: 2
      m_RotationOrder: 4
    path: Root/Pelvis/spine_01/spine_02/spine_03/neck_01/head
  - curve:
      serializedVersion: 2
      m_Curve:
      - serializedVersion: 3
        time: 0
        value: {x: 0.34302154, y: -0.7609143, z: 0.21285176, w: 0.5079762}
        inSlope: {x: 0.00039786097, y: 0.012409686, z: 0.0017903744, w: 0.017554164}
        outSlope: {x: 0.00039786097, y: 0.012409686, z: 0.0017903744, w: 0.017554164}
        tangentMode: 0
        weightedMode: 0
        inWeight: {x: 0.33333334, y: 0.33333334, z: 0.33333334, w: 0.33333334}
        outWeight: {x: 0.33333334, y: 0.33333334, z: 0.33333334, w: 0.33333334}
      - serializedVersion: 3
        time: 1.4333334
        value: {x: 0.34608096, y: -0.7618154, z: 0.20856492, w: 0.50632584}
        inSlope: {x: 0.006443566, y: 0.00022351759, z: -0.007832728, w: -0.0008404263}
        outSlope: {x: 0.006443566, y: 0.00022351759, z: -0.007832728, w: -0.0008404263}
        tangentMode: 0
        weightedMode: 0
        inWeight: {x: 0.33333334, y: 0.33333334, z: 0.33333334, w: 0.33333334}
        outWeight: {x: 0.33333334, y: 0.33333334, z: 0.33333334, w: 0.33333334}
      - serializedVersion: 3
        time: 3.0666668
        value: {x: 0.34328622, y: -0.7605632, z: 0.21258552, w: 0.5084344}
        inSlope: {x: 0.0002695623, y: 0.0016942637, z: 0.00080220477, w: 0.002016129}
        outSlope: {x: 0.0002695623, y: 0.0016942637, z: 0.00080220477, w: 0.002016129}
        tangentMode: 0
        weightedMode: 0
        inWeight: {x: 0.33333334, y: 0.33333334, z: 0.33333334, w: 0.33333334}
        outWeight: {x: 0.33333334, y: 0.33333334, z: 0.33333334, w: 0.33333334}
      - serializedVersion: 3
        time: 3.1000001
        value: {x: 0.34335718, y: -0.76048064, z: 0.21253334, w: 0.5085318}
        inSlope: {x: 0.002128782, y: 0.0024765753, z: -0.0015655175, w: 0.0029218225}
        outSlope: {x: 0.002128782, y: 0.0024765753, z: -0.0015655175, w: 0.0029218225}
        tangentMode: 0
        weightedMode: 0
        inWeight: {x: 0.33333334, y: 0.33333334, z: 0.33333334, w: 0.33333334}
        outWeight: {x: 0.33333334, y: 0.33333334, z: 0.33333334, w: 0.33333334}
      m_PreInfinity: 2
      m_PostInfinity: 2
      m_RotationOrder: 4
    path: Root/Pelvis/spine_01/spine_02/spine_03/clavicle_l
  - curve:
      serializedVersion: 2
      m_Curve:
      - serializedVersion: 3
        time: 0
        value: {x: -0.15542932, y: 0.42089978, z: 0.5101297, w: 0.73379344}
        inSlope: {x: -0.01264125, y: -0.021662412, z: -0.0063228603, w: 0.014122724}
        outSlope: {x: -0.01264125, y: -0.021662412, z: -0.0063228603, w: 0.014122724}
        tangentMode: 0
        weightedMode: 0
        inWeight: {x: 0.33333334, y: 0.33333334, z: 0.33333334, w: 0.33333334}
        outWeight: {x: 0.33333334, y: 0.33333334, z: 0.33333334, w: 0.33333334}
      - serializedVersion: 3
        time: 0.8333334
        value: {x: -0.14570692, y: 0.41590697, z: 0.5124265, w: 0.7370279}
        inSlope: {x: 0.035422593, y: -0.0014877318, z: 0.0105544925, w: 0.00050246716}
        outSlope: {x: 0.035422593, y: -0.0014877318, z: 0.0105544925, w: 0.00050246716}
        tangentMode: 0
        weightedMode: 0
        inWeight: {x: 0.33333334, y: 0.33333334, z: 0.33333334, w: 0.33333334}
        outWeight: {x: 0.33333334, y: 0.33333334, z: 0.33333334, w: 0.33333334}
      - serializedVersion: 3
        time: 2.4666667
        value: {x: -0.13894603, y: 0.41699383, z: 0.5147803, w: 0.7360784}
        inSlope: {x: -0.025499914, y: 0.0055713896, z: -0.007227638, w: -0.0029155596}
        outSlope: {x: -0.025499914, y: 0.0055713896, z: -0.007227638, w: -0.0029155596}
        tangentMode: 0
        weightedMode: 0
        inWeight: {x: 0.33333334, y: 0.33333334, z: 0.33333334, w: 0.33333334}
        outWeight: {x: 0.33333334, y: 0.33333334, z: 0.33333334, w: 0.33333334}
      - serializedVersion: 3
        time: 3.1000001
        value: {x: -0.15460561, y: 0.42010522, z: 0.5103059, w: 0.7343001}
        inSlope: {x: -0.016875582, y: 0.0035145911, z: -0.004842286, w: -0.002194049}
        outSlope: {x: -0.016875582, y: 0.0035145911, z: -0.004842286, w: -0.002194049}
        tangentMode: 0
        weightedMode: 0
        inWeight: {x: 0.33333334, y: 0.33333334, z: 0.33333334, w: 0.33333334}
        outWeight: {x: 0.33333334, y: 0.33333334, z: 0.33333334, w: 0.33333334}
      m_PreInfinity: 2
      m_PostInfinity: 2
      m_RotationOrder: 4
    path: Root/Pelvis/spine_01/spine_02/spine_03/clavicle_l/UpperArm_L
  - curve:
      serializedVersion: 2
      m_Curve:
      - serializedVersion: 3
        time: 0
        value: {x: 0.0002502269, y: 0.5360151, z: 0.0012327895, w: 0.8442075}
        inSlope: {x: -0.000044968034, y: 0.01701057, z: -0.000045849007, w: -0.01081109}
        outSlope: {x: -0.000044968034, y: 0.01701057, z: -0.000045849007, w: -0.01081109}
        tangentMode: 0
        weightedMode: 0
        inWeight: {x: 0.33333334, y: 0.33333334, z: 0.33333334, w: 0.33333334}
        outWeight: {x: 0.33333334, y: 0.33333334, z: 0.33333334, w: 0.33333334}
      - serializedVersion: 3
        time: 1.6333334
        value: {x: 0.00027315854, y: 0.5288647, z: 0.001250057, w: 0.8487052}
        inSlope: {x: -0.00003101831, y: 0.010918389, z: -0.00002777381, w: -0.0068020886}
        outSlope: {x: -0.00003101831, y: 0.010918389, z: -0.00002777381, w: -0.0068020886}
        tangentMode: 0
        weightedMode: 0
        inWeight: {x: 0.33333334, y: 0.33333334, z: 0.33333334, w: 0.33333334}
        outWeight: {x: 0.33333334, y: 0.33333334, z: 0.33333334, w: 0.33333334}
      - serializedVersion: 3
        time: 3.1000001
        value: {x: 0.00024992184, y: 0.5362037, z: 0.0012322481, w: 0.8440877}
        inSlope: {x: -0.0000127090725, y: 0.0036066805, z: -0.0000035029404, w: -0.0022906086}
        outSlope: {x: -0.0000127090725, y: 0.0036066805, z: -0.0000035029404, w: -0.0022906086}
        tangentMode: 0
        weightedMode: 0
        inWeight: {x: 0.33333334, y: 0.33333334, z: 0.33333334, w: 0.33333334}
        outWeight: {x: 0.33333334, y: 0.33333334, z: 0.33333334, w: 0.33333334}
      m_PreInfinity: 2
      m_PostInfinity: 2
      m_RotationOrder: 4
    path: Root/Pelvis/spine_01/spine_02/spine_03/clavicle_l/UpperArm_L/lowerarm_l
  - curve:
      serializedVersion: 2
      m_Curve:
      - serializedVersion: 3
        time: 0
        value: {x: -0.77472174, y: -0.17157713, z: -0.25146648, w: 0.554195}
        inSlope: {x: -0.007485151, y: -0.0018654763, z: -0.009104311, w: -0.01518309}
        outSlope: {x: -0.007485151, y: -0.0018654763, z: -0.009104311, w: -0.01518309}
        tangentMode: 0
        weightedMode: 0
        inWeight: {x: 0.33333334, y: 0.33333334, z: 0.33333334, w: 0.33333334}
        outWeight: {x: 0.33333334, y: 0.33333334, z: 0.33333334, w: 0.33333334}
      - serializedVersion: 3
        time: 1.5333334
        value: {x: -0.7823754, y: -0.16313417, z: -0.24710964, w: 0.54791677}
        inSlope: {x: 0.0014904155, y: -0.0012999786, z: -0.0013837976, w: 0.0011175881}
        outSlope: {x: 0.0014904155, y: -0.0012999786, z: -0.0013837976, w: 0.0011175881}
        tangentMode: 0
        weightedMode: 0
        inWeight: {x: 0.33333334, y: 0.33333334, z: 0.33333334, w: 0.33333334}
        outWeight: {x: 0.33333334, y: 0.33333334, z: 0.33333334, w: 0.33333334}
      - serializedVersion: 3
        time: 3.1000001
        value: {x: -0.77502215, y: -0.17142633, z: -0.251539, w: 0.5537886}
        inSlope: {x: -0.005167728, y: 0.0014649346, z: -0.003332201, w: -0.008289821}
        outSlope: {x: -0.005167728, y: 0.0014649346, z: -0.003332201, w: -0.008289821}
        tangentMode: 0
        weightedMode: 0
        inWeight: {x: 0.33333334, y: 0.33333334, z: 0.33333334, w: 0.33333334}
        outWeight: {x: 0.33333334, y: 0.33333334, z: 0.33333334, w: 0.33333334}
      m_PreInfinity: 2
      m_PostInfinity: 2
      m_RotationOrder: 4
    path: Root/Pelvis/spine_01/spine_02/spine_03/clavicle_l/UpperArm_L/lowerarm_l/Hand_L
  - curve:
      serializedVersion: 2
      m_Curve:
      - serializedVersion: 3
        time: 0
        value: {x: 0.10436192, y: 0.036244504, z: 0.20853664, w: 0.9717548}
        inSlope: {x: 0, y: 0, z: 0, w: 0}
        outSlope: {x: 0, y: 0, z: 0, w: 0}
        tangentMode: 0
        weightedMode: 0
        inWeight: {x: 0.33333334, y: 0.33333334, z: 0.33333334, w: 0.33333334}
        outWeight: {x: 0.33333334, y: 0.33333334, z: 0.33333334, w: 0.33333334}
      - serializedVersion: 3
        time: 3.1000001
        value: {x: 0.10436192, y: 0.036244504, z: 0.20853664, w: 0.9717548}
        inSlope: {x: 0, y: 0, z: 0, w: 0}
        outSlope: {x: 0, y: 0, z: 0, w: 0}
        tangentMode: 0
        weightedMode: 0
        inWeight: {x: 0.33333334, y: 0.33333334, z: 0.33333334, w: 0.33333334}
        outWeight: {x: 0.33333334, y: 0.33333334, z: 0.33333334, w: 0.33333334}
      m_PreInfinity: 2
      m_PostInfinity: 2
      m_RotationOrder: 4
    path: Root/Pelvis/spine_01/spine_02/spine_03/clavicle_l/UpperArm_L/lowerarm_l/Hand_L/thumb_01_l
  - curve:
      serializedVersion: 2
      m_Curve:
      - serializedVersion: 3
        time: 0
        value: {x: 0.12901343, y: -0.053025953, z: 0.0370708, w: 0.98952997}
        inSlope: {x: 0, y: 0, z: 0, w: 0}
        outSlope: {x: 0, y: 0, z: 0, w: 0}
        tangentMode: 0
        weightedMode: 0
        inWeight: {x: 0.33333334, y: 0.33333334, z: 0.33333334, w: 0.33333334}
        outWeight: {x: 0.33333334, y: 0.33333334, z: 0.33333334, w: 0.33333334}
      - serializedVersion: 3
        time: 3.1000001
        value: {x: 0.12901343, y: -0.053025953, z: 0.0370708, w: 0.98952997}
        inSlope: {x: 0, y: 0, z: 0, w: 0}
        outSlope: {x: 0, y: 0, z: 0, w: 0}
        tangentMode: 0
        weightedMode: 0
        inWeight: {x: 0.33333334, y: 0.33333334, z: 0.33333334, w: 0.33333334}
        outWeight: {x: 0.33333334, y: 0.33333334, z: 0.33333334, w: 0.33333334}
      m_PreInfinity: 2
      m_PostInfinity: 2
      m_RotationOrder: 4
    path: Root/Pelvis/spine_01/spine_02/spine_03/clavicle_l/UpperArm_L/lowerarm_l/Hand_L/thumb_01_l/thumb_02_l
  - curve:
      serializedVersion: 2
      m_Curve:
      - serializedVersion: 3
        time: 0
        value: {x: -0.061270487, y: -0.15379485, z: 0.3161873, w: 0.9341406}
        inSlope: {x: 0, y: 0, z: 0, w: 0}
        outSlope: {x: 0, y: 0, z: 0, w: 0}
        tangentMode: 0
        weightedMode: 0
        inWeight: {x: 0.33333334, y: 0.33333334, z: 0.33333334, w: 0.33333334}
        outWeight: {x: 0.33333334, y: 0.33333334, z: 0.33333334, w: 0.33333334}
      - serializedVersion: 3
        time: 3.1000001
        value: {x: -0.061270487, y: -0.15379485, z: 0.3161873, w: 0.9341406}
        inSlope: {x: 0, y: 0, z: 0, w: 0}
        outSlope: {x: 0, y: 0, z: 0, w: 0}
        tangentMode: 0
        weightedMode: 0
        inWeight: {x: 0.33333334, y: 0.33333334, z: 0.33333334, w: 0.33333334}
        outWeight: {x: 0.33333334, y: 0.33333334, z: 0.33333334, w: 0.33333334}
      m_PreInfinity: 2
      m_PostInfinity: 2
      m_RotationOrder: 4
    path: Root/Pelvis/spine_01/spine_02/spine_03/clavicle_l/UpperArm_L/lowerarm_l/Hand_L/indexFinger_01_l
  - curve:
      serializedVersion: 2
      m_Curve:
      - serializedVersion: 3
        time: 0
        value: {x: -0.0010030402, y: -0.0064693824, z: 0.5020427, w: 0.86481804}
        inSlope: {x: 0, y: 0, z: 0, w: 0}
        outSlope: {x: 0, y: 0, z: 0, w: 0}
        tangentMode: 0
        weightedMode: 0
        inWeight: {x: 0.33333334, y: 0.33333334, z: 0.33333334, w: 0.33333334}
        outWeight: {x: 0.33333334, y: 0.33333334, z: 0.33333334, w: 0.33333334}
      - serializedVersion: 3
        time: 3.1000001
        value: {x: -0.0010030402, y: -0.0064693824, z: 0.5020427, w: 0.86481804}
        inSlope: {x: 0, y: 0, z: 0, w: 0}
        outSlope: {x: 0, y: 0, z: 0, w: 0}
        tangentMode: 0
        weightedMode: 0
        inWeight: {x: 0.33333334, y: 0.33333334, z: 0.33333334, w: 0.33333334}
        outWeight: {x: 0.33333334, y: 0.33333334, z: 0.33333334, w: 0.33333334}
      m_PreInfinity: 2
      m_PostInfinity: 2
      m_RotationOrder: 4
    path: Root/Pelvis/spine_01/spine_02/spine_03/clavicle_l/UpperArm_L/lowerarm_l/Hand_L/indexFinger_01_l/indexFinger_02_l
  - curve:
      serializedVersion: 2
      m_Curve:
      - serializedVersion: 3
        time: 0
        value: {x: -0.006771139, y: -0.004406936, z: 0.21010515, w: 0.97764546}
        inSlope: {x: 0, y: 0, z: 0, w: 0}
        outSlope: {x: 0, y: 0, z: 0, w: 0}
        tangentMode: 0
        weightedMode: 0
        inWeight: {x: 0.33333334, y: 0.33333334, z: 0.33333334, w: 0.33333334}
        outWeight: {x: 0.33333334, y: 0.33333334, z: 0.33333334, w: 0.33333334}
      - serializedVersion: 3
        time: 3.1000001
        value: {x: -0.006771139, y: -0.004406936, z: 0.21010515, w: 0.97764546}
        inSlope: {x: 0, y: 0, z: 0, w: 0}
        outSlope: {x: 0, y: 0, z: 0, w: 0}
        tangentMode: 0
        weightedMode: 0
        inWeight: {x: 0.33333334, y: 0.33333334, z: 0.33333334, w: 0.33333334}
        outWeight: {x: 0.33333334, y: 0.33333334, z: 0.33333334, w: 0.33333334}
      m_PreInfinity: 2
      m_PostInfinity: 2
      m_RotationOrder: 4
    path: Root/Pelvis/spine_01/spine_02/spine_03/clavicle_l/UpperArm_L/lowerarm_l/Hand_L/indexFinger_01_l/indexFinger_02_l/indexFinger_03_l
  - curve:
      serializedVersion: 2
      m_Curve:
      - serializedVersion: 3
        time: 0
        value: {x: -0.08242289, y: -0.14483277, z: 0.4409431, w: 0.8819292}
        inSlope: {x: 0, y: 0, z: 0, w: 0}
        outSlope: {x: 0, y: 0, z: 0, w: 0}
        tangentMode: 0
        weightedMode: 0
        inWeight: {x: 0.33333334, y: 0.33333334, z: 0.33333334, w: 0.33333334}
        outWeight: {x: 0.33333334, y: 0.33333334, z: 0.33333334, w: 0.33333334}
      - serializedVersion: 3
        time: 3.1000001
        value: {x: -0.08242289, y: -0.14483277, z: 0.4409431, w: 0.8819292}
        inSlope: {x: 0, y: 0, z: 0, w: 0}
        outSlope: {x: 0, y: 0, z: 0, w: 0}
        tangentMode: 0
        weightedMode: 0
        inWeight: {x: 0.33333334, y: 0.33333334, z: 0.33333334, w: 0.33333334}
        outWeight: {x: 0.33333334, y: 0.33333334, z: 0.33333334, w: 0.33333334}
      m_PreInfinity: 2
      m_PostInfinity: 2
      m_RotationOrder: 4
    path: Root/Pelvis/spine_01/spine_02/spine_03/clavicle_l/UpperArm_L/lowerarm_l/Hand_L/finger_01_l
  - curve:
      serializedVersion: 2
      m_Curve:
      - serializedVersion: 3
        time: 0
        value: {x: 0.0022228379, y: 0.00042509972, z: 0.53856874, w: 0.84257853}
        inSlope: {x: 0, y: 0, z: 0, w: 0}
        outSlope: {x: 0, y: 0, z: 0, w: 0}
        tangentMode: 0
        weightedMode: 0
        inWeight: {x: 0.33333334, y: 0.33333334, z: 0.33333334, w: 0.33333334}
        outWeight: {x: 0.33333334, y: 0.33333334, z: 0.33333334, w: 0.33333334}
      - serializedVersion: 3
        time: 3.1000001
        value: {x: 0.0022228379, y: 0.00042509972, z: 0.53856874, w: 0.84257853}
        inSlope: {x: 0, y: 0, z: 0, w: 0}
        outSlope: {x: 0, y: 0, z: 0, w: 0}
        tangentMode: 0
        weightedMode: 0
        inWeight: {x: 0.33333334, y: 0.33333334, z: 0.33333334, w: 0.33333334}
        outWeight: {x: 0.33333334, y: 0.33333334, z: 0.33333334, w: 0.33333334}
      m_PreInfinity: 2
      m_PostInfinity: 2
      m_RotationOrder: 4
    path: Root/Pelvis/spine_01/spine_02/spine_03/clavicle_l/UpperArm_L/lowerarm_l/Hand_L/finger_01_l/finger_02_l
  - curve:
      serializedVersion: 2
      m_Curve:
      - serializedVersion: 3
        time: 0
        value: {x: -0.01805157, y: -0.0023125517, z: 0.15572624, w: 0.98763263}
        inSlope: {x: 0, y: 0, z: 0, w: 0}
        outSlope: {x: 0, y: 0, z: 0, w: 0}
        tangentMode: 0
        weightedMode: 0
        inWeight: {x: 0.33333334, y: 0.33333334, z: 0.33333334, w: 0.33333334}
        outWeight: {x: 0.33333334, y: 0.33333334, z: 0.33333334, w: 0.33333334}
      - serializedVersion: 3
        time: 3.1000001
        value: {x: -0.01805157, y: -0.0023125517, z: 0.15572624, w: 0.98763263}
        inSlope: {x: 0, y: 0, z: 0, w: 0}
        outSlope: {x: 0, y: 0, z: 0, w: 0}
        tangentMode: 0
        weightedMode: 0
        inWeight: {x: 0.33333334, y: 0.33333334, z: 0.33333334, w: 0.33333334}
        outWeight: {x: 0.33333334, y: 0.33333334, z: 0.33333334, w: 0.33333334}
      m_PreInfinity: 2
      m_PostInfinity: 2
      m_RotationOrder: 4
    path: Root/Pelvis/spine_01/spine_02/spine_03/clavicle_l/UpperArm_L/lowerarm_l/Hand_L/finger_01_l/finger_02_l/finger_03_l
  - curve:
      serializedVersion: 2
      m_Curve:
      - serializedVersion: 3
        time: 0
        value: {x: 0.80599475, y: 0.38033926, z: 0.44169757, w: -0.10304273}
        inSlope: {x: 0, y: 0, z: 0, w: 0}
        outSlope: {x: 0, y: 0, z: 0, w: 0}
        tangentMode: 0
        weightedMode: 0
        inWeight: {x: 0.33333334, y: 0.33333334, z: 0.33333334, w: 0.33333334}
        outWeight: {x: 0.33333334, y: 0.33333334, z: 0.33333334, w: 0.33333334}
      - serializedVersion: 3
        time: 3.1000001
        value: {x: 0.80599475, y: 0.38033926, z: 0.44169757, w: -0.10304273}
        inSlope: {x: 0, y: 0, z: 0, w: 0}
        outSlope: {x: 0, y: 0, z: 0, w: 0}
        tangentMode: 0
        weightedMode: 0
        inWeight: {x: 0.33333334, y: 0.33333334, z: 0.33333334, w: 0.33333334}
        outWeight: {x: 0.33333334, y: 0.33333334, z: 0.33333334, w: 0.33333334}
      m_PreInfinity: 2
      m_PostInfinity: 2
      m_RotationOrder: 4
    path: Root/Pelvis/spine_01/spine_02/spine_03/clavicle_r
  - curve:
      serializedVersion: 2
      m_Curve:
      - serializedVersion: 3
        time: 0
        value: {x: 0.23983592, y: 0.6949399, z: 0.45079365, w: 0.5062829}
        inSlope: {x: -0.007191449, y: -0.0075531, z: 0.0017175077, w: 0.012236237}
        outSlope: {x: -0.007191449, y: -0.0075531, z: 0.0017175077, w: 0.012236237}
        tangentMode: 0
        weightedMode: 0
        inWeight: {x: 0.33333334, y: 0.33333334, z: 0.33333334, w: 0.33333334}
        outWeight: {x: 0.33333334, y: 0.33333334, z: 0.33333334, w: 0.33333334}
      - serializedVersion: 3
        time: 1.3000001
        value: {x: 0.25626534, y: 0.68968624, z: 0.44684404, w: 0.50891197}
        inSlope: {x: 0.018119235, y: -0.006715364, z: -0.00448287, w: 0.0039133467}
        outSlope: {x: 0.018119235, y: -0.006715364, z: -0.00448287, w: 0.0039133467}
        tangentMode: 0
        weightedMode: 0
        inWeight: {x: 0.33333334, y: 0.33333334, z: 0.33333334, w: 0.33333334}
        outWeight: {x: 0.33333334, y: 0.33333334, z: 0.33333334, w: 0.33333334}
      - serializedVersion: 3
        time: 2.9333334
        value: {x: 0.24357645, y: 0.6935631, z: 0.44990963, w: 0.5071706}
        inSlope: {x: -0.019726478, y: 0.005764945, z: 0.0046916185, w: -0.002574018}
        outSlope: {x: -0.019726478, y: 0.005764945, z: 0.0046916185, w: -0.002574018}
        tangentMode: 0
        weightedMode: 0
        inWeight: {x: 0.33333334, y: 0.33333334, z: 0.33333334, w: 0.33333334}
        outWeight: {x: 0.33333334, y: 0.33333334, z: 0.33333334, w: 0.33333334}
      - serializedVersion: 3
        time: 3.1000001
        value: {x: 0.24066992, y: 0.6944606, z: 0.45059773, w: 0.5067192}
        inSlope: {x: -0.013429387, y: 0.0043273014, z: 0.0031667978, w: -0.0023585581}
        outSlope: {x: -0.013429387, y: 0.0043273014, z: 0.0031667978, w: -0.0023585581}
        tangentMode: 0
        weightedMode: 0
        inWeight: {x: 0.33333334, y: 0.33333334, z: 0.33333334, w: 0.33333334}
        outWeight: {x: 0.33333334, y: 0.33333334, z: 0.33333334, w: 0.33333334}
      m_PreInfinity: 2
      m_PostInfinity: 2
      m_RotationOrder: 4
    path: Root/Pelvis/spine_01/spine_02/spine_03/clavicle_r/UpperArm_R
  - curve:
      serializedVersion: 2
      m_Curve:
      - serializedVersion: 3
        time: 0
        value: {x: -0.0005323138, y: 0.7563294, z: 0.0005897356, w: 0.6541905}
        inSlope: {x: 0, y: 0, z: 0, w: 0}
        outSlope: {x: 0, y: 0, z: 0, w: 0}
        tangentMode: 0
        weightedMode: 0
        inWeight: {x: 0.33333334, y: 0.33333334, z: 0.33333334, w: 0.33333334}
        outWeight: {x: 0.33333334, y: 0.33333334, z: 0.33333334, w: 0.33333334}
      - serializedVersion: 3
        time: 3.1000001
        value: {x: -0.0005323138, y: 0.7563294, z: 0.0005897356, w: 0.6541905}
        inSlope: {x: 0, y: 0, z: 0, w: 0}
        outSlope: {x: 0, y: 0, z: 0, w: 0}
        tangentMode: 0
        weightedMode: 0
        inWeight: {x: 0.33333334, y: 0.33333334, z: 0.33333334, w: 0.33333334}
        outWeight: {x: 0.33333334, y: 0.33333334, z: 0.33333334, w: 0.33333334}
      m_PreInfinity: 2
      m_PostInfinity: 2
      m_RotationOrder: 4
    path: Root/Pelvis/spine_01/spine_02/spine_03/clavicle_r/UpperArm_R/lowerarm_r
  - curve:
      serializedVersion: 2
      m_Curve:
      - serializedVersion: 3
        time: 0
        value: {x: -0.32182103, y: -0.1059346, z: -0.20799227, w: 0.9175774}
        inSlope: {x: 0.015285908, y: -0.019581689, z: 0.016551912, w: 0.0068378444}
        outSlope: {x: 0.015285908, y: -0.019581689, z: 0.016551912, w: 0.0068378444}
        tangentMode: 0
        weightedMode: 0
        inWeight: {x: 0.33333334, y: 0.33333334, z: 0.33333334, w: 0.33333334}
        outWeight: {x: 0.33333334, y: 0.33333334, z: 0.33333334, w: 0.33333334}
      - serializedVersion: 3
        time: 1.6333334
        value: {x: -0.3266581, y: -0.11192539, z: -0.21105857, w: 0.9144515}
        inSlope: {x: -0.0043831808, y: 0.0068462333, z: -0.007133565, w: -0.0023737573}
        outSlope: {x: -0.0043831808, y: 0.0068462333, z: -0.007133565, w: -0.0023737573}
        tangentMode: 0
        weightedMode: 0
        inWeight: {x: 0.33333334, y: 0.33333334, z: 0.33333334, w: 0.33333334}
        outWeight: {x: 0.33333334, y: 0.33333334, z: 0.33333334, w: 0.33333334}
      - serializedVersion: 3
        time: 3.1000001
        value: {x: -0.3219076, y: -0.10626155, z: -0.20824015, w: 0.917453}
        inSlope: {x: 0.0074118446, y: -0.0042448235, z: 0.012373936, w: 0.004920964}
        outSlope: {x: 0.0074118446, y: -0.0042448235, z: 0.012373936, w: 0.004920964}
        tangentMode: 0
        weightedMode: 0
        inWeight: {x: 0.33333334, y: 0.33333334, z: 0.33333334, w: 0.33333334}
        outWeight: {x: 0.33333334, y: 0.33333334, z: 0.33333334, w: 0.33333334}
      m_PreInfinity: 2
      m_PostInfinity: 2
      m_RotationOrder: 4
    path: Root/Pelvis/spine_01/spine_02/spine_03/clavicle_r/UpperArm_R/lowerarm_r/Hand_R
  - curve:
      serializedVersion: 2
      m_Curve:
      - serializedVersion: 3
        time: 0
        value: {x: 0.08400681, y: 0.089514375, z: 0.32057175, w: 0.93923575}
        inSlope: {x: 0, y: 0, z: 0, w: 0}
        outSlope: {x: 0, y: 0, z: 0, w: 0}
        tangentMode: 0
        weightedMode: 0
        inWeight: {x: 0.33333334, y: 0.33333334, z: 0.33333334, w: 0.33333334}
        outWeight: {x: 0.33333334, y: 0.33333334, z: 0.33333334, w: 0.33333334}
      - serializedVersion: 3
        time: 3.1000001
        value: {x: 0.08400681, y: 0.089514375, z: 0.32057175, w: 0.93923575}
        inSlope: {x: 0, y: 0, z: 0, w: 0}
        outSlope: {x: 0, y: 0, z: 0, w: 0}
        tangentMode: 0
        weightedMode: 0
        inWeight: {x: 0.33333334, y: 0.33333334, z: 0.33333334, w: 0.33333334}
        outWeight: {x: 0.33333334, y: 0.33333334, z: 0.33333334, w: 0.33333334}
      m_PreInfinity: 2
      m_PostInfinity: 2
      m_RotationOrder: 4
    path: Root/Pelvis/spine_01/spine_02/spine_03/clavicle_r/UpperArm_R/lowerarm_r/Hand_R/thumb_01_r
  - curve:
      serializedVersion: 2
      m_Curve:
      - serializedVersion: 3
        time: 0
        value: {x: 0.14899845, y: -0.23781419, z: -0.02160883, w: 0.95957124}
        inSlope: {x: 0, y: 0, z: 0, w: 0}
        outSlope: {x: 0, y: 0, z: 0, w: 0}
        tangentMode: 0
        weightedMode: 0
        inWeight: {x: 0.33333334, y: 0.33333334, z: 0.33333334, w: 0.33333334}
        outWeight: {x: 0.33333334, y: 0.33333334, z: 0.33333334, w: 0.33333334}
      - serializedVersion: 3
        time: 3.1000001
        value: {x: 0.14899845, y: -0.23781419, z: -0.02160883, w: 0.95957124}
        inSlope: {x: 0, y: 0, z: 0, w: 0}
        outSlope: {x: 0, y: 0, z: 0, w: 0}
        tangentMode: 0
        weightedMode: 0
        inWeight: {x: 0.33333334, y: 0.33333334, z: 0.33333334, w: 0.33333334}
        outWeight: {x: 0.33333334, y: 0.33333334, z: 0.33333334, w: 0.33333334}
      m_PreInfinity: 2
      m_PostInfinity: 2
      m_RotationOrder: 4
    path: Root/Pelvis/spine_01/spine_02/spine_03/clavicle_r/UpperArm_R/lowerarm_r/Hand_R/thumb_01_r/thumb_02_r
  - curve:
      serializedVersion: 2
      m_Curve:
      - serializedVersion: 3
        time: 0
        value: {x: -0.021944651, y: -0.1325628, z: 0.10976638, w: 0.9848334}
        inSlope: {x: 0, y: 0, z: 0, w: 0}
        outSlope: {x: 0, y: 0, z: 0, w: 0}
        tangentMode: 0
        weightedMode: 0
        inWeight: {x: 0.33333334, y: 0.33333334, z: 0.33333334, w: 0.33333334}
        outWeight: {x: 0.33333334, y: 0.33333334, z: 0.33333334, w: 0.33333334}
      - serializedVersion: 3
        time: 3.1000001
        value: {x: -0.021944651, y: -0.1325628, z: 0.10976638, w: 0.9848334}
        inSlope: {x: 0, y: 0, z: 0, w: 0}
        outSlope: {x: 0, y: 0, z: 0, w: 0}
        tangentMode: 0
        weightedMode: 0
        inWeight: {x: 0.33333334, y: 0.33333334, z: 0.33333334, w: 0.33333334}
        outWeight: {x: 0.33333334, y: 0.33333334, z: 0.33333334, w: 0.33333334}
      m_PreInfinity: 2
      m_PostInfinity: 2
      m_RotationOrder: 4
    path: Root/Pelvis/spine_01/spine_02/spine_03/clavicle_r/UpperArm_R/lowerarm_r/Hand_R/indexFinger_01_r
  - curve:
      serializedVersion: 2
      m_Curve:
      - serializedVersion: 3
        time: 0
        value: {x: -0.0011126302, y: 0.0022732366, z: 0.28385332, w: 0.9588644}
        inSlope: {x: 0, y: 0, z: 0, w: 0}
        outSlope: {x: 0, y: 0, z: 0, w: 0}
        tangentMode: 0
        weightedMode: 0
        inWeight: {x: 0.33333334, y: 0.33333334, z: 0.33333334, w: 0.33333334}
        outWeight: {x: 0.33333334, y: 0.33333334, z: 0.33333334, w: 0.33333334}
      - serializedVersion: 3
        time: 0.033333335
        value: {x: -0.0011126302, y: 0.0022732366, z: 0.28385332, w: 0.9588644}
        inSlope: {x: 0, y: 0, z: 0, w: 0}
        outSlope: {x: 0, y: 0, z: 0, w: 0}
        tangentMode: 0
        weightedMode: 0
        inWeight: {x: 0.33333334, y: 0.33333334, z: 0.33333334, w: 0.33333334}
        outWeight: {x: 0.33333334, y: 0.33333334, z: 0.33333334, w: 0.33333334}
      m_PreInfinity: 2
      m_PostInfinity: 2
      m_RotationOrder: 4
    path: Root/Pelvis/spine_01/spine_02/spine_03/clavicle_r/UpperArm_R/lowerarm_r/Hand_R/indexFinger_01_r/indexFinger_02_r
  - curve:
      serializedVersion: 2
      m_Curve:
      - serializedVersion: 3
        time: 0
        value: {x: -0.006691369, y: -0.00002004828, z: 0.25765318, w: 0.9662143}
        inSlope: {x: 0, y: 0, z: 0, w: 0}
        outSlope: {x: 0, y: 0, z: 0, w: 0}
        tangentMode: 0
        weightedMode: 0
        inWeight: {x: 0.33333334, y: 0.33333334, z: 0.33333334, w: 0.33333334}
        outWeight: {x: 0.33333334, y: 0.33333334, z: 0.33333334, w: 0.33333334}
      - serializedVersion: 3
        time: 0.033333335
        value: {x: -0.006691369, y: -0.00002004828, z: 0.25765318, w: 0.9662143}
        inSlope: {x: 0, y: 0, z: 0, w: 0}
        outSlope: {x: 0, y: 0, z: 0, w: 0}
        tangentMode: 0
        weightedMode: 0
        inWeight: {x: 0.33333334, y: 0.33333334, z: 0.33333334, w: 0.33333334}
        outWeight: {x: 0.33333334, y: 0.33333334, z: 0.33333334, w: 0.33333334}
      m_PreInfinity: 2
      m_PostInfinity: 2
      m_RotationOrder: 4
    path: Root/Pelvis/spine_01/spine_02/spine_03/clavicle_r/UpperArm_R/lowerarm_r/Hand_R/indexFinger_01_r/indexFinger_02_r/indexFinger_03_r
  - curve:
      serializedVersion: 2
      m_Curve:
      - serializedVersion: 3
        time: 0
        value: {x: -0.0640243, y: -0.17013744, z: 0.43780792, w: 0.88049895}
        inSlope: {x: -0.00030018386, y: 0.00020071863, z: 0.0018158554, w: -0.00088691706}
        outSlope: {x: -0.00030018386, y: 0.00020071863, z: 0.0018158554, w: -0.00088691706}
        tangentMode: 0
        weightedMode: 0
        inWeight: {x: 0.33333334, y: 0.33333334, z: 0.33333334, w: 0.33333334}
        outWeight: {x: 0.33333334, y: 0.33333334, z: 0.33333334, w: 0.33333334}
      - serializedVersion: 3
        time: 1.6333334
        value: {x: -0.06340482, y: -0.17081034, z: 0.43528116, w: 0.88166547}
        inSlope: {x: -0.00085305504, y: 0.0012333703, z: 0.002105089, w: -0.000861884}
        outSlope: {x: -0.00085305504, y: 0.0012333703, z: 0.002105089, w: -0.000861884}
        tangentMode: 0
        weightedMode: 0
        inWeight: {x: 0.33333334, y: 0.33333334, z: 0.33333334, w: 0.33333334}
        outWeight: {x: 0.33333334, y: 0.33333334, z: 0.33333334, w: 0.33333334}
      - serializedVersion: 3
        time: 3.1000001
        value: {x: -0.06399069, y: -0.17018944, z: 0.43774328, w: 0.88052344}
        inSlope: {x: 0.00071145664, y: -0.0005006795, z: -0.004069809, w: 0.001977684}
        outSlope: {x: 0.00071145664, y: -0.0005006795, z: -0.004069809, w: 0.001977684}
        tangentMode: 0
        weightedMode: 0
        inWeight: {x: 0.33333334, y: 0.33333334, z: 0.33333334, w: 0.33333334}
        outWeight: {x: 0.33333334, y: 0.33333334, z: 0.33333334, w: 0.33333334}
      m_PreInfinity: 2
      m_PostInfinity: 2
      m_RotationOrder: 4
    path: Root/Pelvis/spine_01/spine_02/spine_03/clavicle_r/UpperArm_R/lowerarm_r/Hand_R/finger_01_r
  - curve:
      serializedVersion: 2
      m_Curve:
      - serializedVersion: 3
        time: 0
        value: {x: 0.001502668, y: 0.017818766, z: 0.8218206, w: 0.56946564}
        inSlope: {x: 0, y: 0, z: 0, w: 0}
        outSlope: {x: 0, y: 0, z: 0, w: 0}
        tangentMode: 0
        weightedMode: 0
        inWeight: {x: 0.33333334, y: 0.33333334, z: 0.33333334, w: 0.33333334}
        outWeight: {x: 0.33333334, y: 0.33333334, z: 0.33333334, w: 0.33333334}
      - serializedVersion: 3
        time: 3.1000001
        value: {x: 0.001502668, y: 0.017818766, z: 0.8218206, w: 0.56946564}
        inSlope: {x: 0, y: 0, z: 0, w: 0}
        outSlope: {x: 0, y: 0, z: 0, w: 0}
        tangentMode: 0
        weightedMode: 0
        inWeight: {x: 0.33333334, y: 0.33333334, z: 0.33333334, w: 0.33333334}
        outWeight: {x: 0.33333334, y: 0.33333334, z: 0.33333334, w: 0.33333334}
      m_PreInfinity: 2
      m_PostInfinity: 2
      m_RotationOrder: 4
    path: Root/Pelvis/spine_01/spine_02/spine_03/clavicle_r/UpperArm_R/lowerarm_r/Hand_R/finger_01_r/finger_02_r
  - curve:
      serializedVersion: 2
      m_Curve:
      - serializedVersion: 3
        time: 0
        value: {x: -0.018029131, y: 0.0009891745, z: 0.1637212, w: 0.9863414}
        inSlope: {x: 0, y: 0, z: 0, w: 0}
        outSlope: {x: 0, y: 0, z: 0, w: 0}
        tangentMode: 0
        weightedMode: 0
        inWeight: {x: 0.33333334, y: 0.33333334, z: 0.33333334, w: 0.33333334}
        outWeight: {x: 0.33333334, y: 0.33333334, z: 0.33333334, w: 0.33333334}
      - serializedVersion: 3
        time: 0.033333335
        value: {x: -0.018029131, y: 0.0009891745, z: 0.1637212, w: 0.9863414}
        inSlope: {x: 0, y: 0, z: 0, w: 0}
        outSlope: {x: 0, y: 0, z: 0, w: 0}
        tangentMode: 0
        weightedMode: 0
        inWeight: {x: 0.33333334, y: 0.33333334, z: 0.33333334, w: 0.33333334}
        outWeight: {x: 0.33333334, y: 0.33333334, z: 0.33333334, w: 0.33333334}
      m_PreInfinity: 2
      m_PostInfinity: 2
      m_RotationOrder: 4
    path: Root/Pelvis/spine_01/spine_02/spine_03/clavicle_r/UpperArm_R/lowerarm_r/Hand_R/finger_01_r/finger_02_r/finger_03_r
  - curve:
      serializedVersion: 2
      m_Curve:
      - serializedVersion: 3
        time: 0
        value: {x: 0.04761002, y: 0.73636603, z: -0.663641, w: -0.122796886}
        inSlope: {x: 0, y: 0, z: 0, w: 0}
        outSlope: {x: 0, y: 0, z: 0, w: 0}
        tangentMode: 0
        weightedMode: 0
        inWeight: {x: 0.33333334, y: 0.33333334, z: 0.33333334, w: 0.33333334}
        outWeight: {x: 0.33333334, y: 0.33333334, z: 0.33333334, w: 0.33333334}
      - serializedVersion: 3
        time: 3.1000001
        value: {x: 0.04761002, y: 0.73636603, z: -0.663641, w: -0.122796886}
        inSlope: {x: 0, y: 0, z: 0, w: 0}
        outSlope: {x: 0, y: 0, z: 0, w: 0}
        tangentMode: 0
        weightedMode: 0
        inWeight: {x: 0.33333334, y: 0.33333334, z: 0.33333334, w: 0.33333334}
        outWeight: {x: 0.33333334, y: 0.33333334, z: 0.33333334, w: 0.33333334}
      m_PreInfinity: 2
      m_PostInfinity: 2
      m_RotationOrder: 4
    path: Root/Pelvis/Thigh_R
  - curve:
      serializedVersion: 2
      m_Curve:
      - serializedVersion: 3
        time: 0
        value: {x: 0.61990756, y: 0.23456544, z: -0.1711692, w: 0.7289683}
        inSlope: {x: 0.01755774, y: 0.00015467404, z: -0.011892467, w: -0.017791986}
        outSlope: {x: 0.01755774, y: 0.00015467404, z: -0.011892467, w: -0.017791986}
        tangentMode: 0
        weightedMode: 0
        inWeight: {x: 0.33333334, y: 0.33333334, z: 0.33333334, w: 0.33333334}
        outWeight: {x: 0.33333334, y: 0.33333334, z: 0.33333334, w: 0.33333334}
      - serializedVersion: 3
        time: 1.2666668
        value: {x: 0.6239417, y: 0.2317263, z: -0.1691901, w: 0.7268937}
        inSlope: {x: 0.0174549, y: -0.010486087, z: 0.0049026283, w: -0.010494575}
        outSlope: {x: 0.0174549, y: -0.010486087, z: 0.0049026283, w: -0.010494575}
        tangentMode: 0
        weightedMode: 0
        inWeight: {x: 0.33333334, y: 0.33333334, z: 0.33333334, w: 0.33333334}
        outWeight: {x: 0.33333334, y: 0.33333334, z: 0.33333334, w: 0.33333334}
      - serializedVersion: 3
        time: 2.3333335
        value: {x: 0.6257673, y: 0.22994658, z: -0.16731559, w: 0.7263232}
        inSlope: {x: -0.009898255, y: 0.0047989236, z: -0.003306273, w: 0.0062424005}
        outSlope: {x: -0.009898255, y: 0.0047989236, z: -0.003306273, w: 0.0062424005}
        tangentMode: 0
        weightedMode: 0
        inWeight: {x: 0.33333334, y: 0.33333334, z: 0.33333334, w: 0.33333334}
        outWeight: {x: 0.33333334, y: 0.33333334, z: 0.33333334, w: 0.33333334}
      - serializedVersion: 3
        time: 3.1000001
        value: {x: 0.6210513, y: 0.23417835, z: -0.1711682, w: 0.72811896}
        inSlope: {x: 0.008064516, y: 0.004919623, z: -0.005595987, w: -0.009773979}
        outSlope: {x: 0.008064516, y: 0.004919623, z: -0.005595987, w: -0.009773979}
        tangentMode: 0
        weightedMode: 0
        inWeight: {x: 0.33333334, y: 0.33333334, z: 0.33333334, w: 0.33333334}
        outWeight: {x: 0.33333334, y: 0.33333334, z: 0.33333334, w: 0.33333334}
      m_PreInfinity: 2
      m_PostInfinity: 2
      m_RotationOrder: 4
    path: Root/Pelvis/Thigh_R/calf_r
  - curve:
      serializedVersion: 2
      m_Curve:
      - serializedVersion: 3
        time: 0
        value: {x: 0.7180648, y: 0.658427, z: 0.06753094, w: -0.21516596}
        inSlope: {x: 0.0056844945, y: 0.003506541, z: -0.020330472, w: 0.02338752}
        outSlope: {x: 0.0056844945, y: 0.003506541, z: -0.020330472, w: 0.02338752}
        tangentMode: 0
        weightedMode: 0
        inWeight: {x: 0.33333334, y: 0.33333334, z: 0.33333334, w: 0.33333334}
        outWeight: {x: 0.33333334, y: 0.33333334, z: 0.33333334, w: 0.33333334}
      - serializedVersion: 3
        time: 0.73333335
        value: {x: 0.7187524, y: 0.65786576, z: 0.06738167, w: -0.21463314}
        inSlope: {x: 0.0011846429, y: -0.0013107061, z: 0.0012496845, w: 0.00033639517}
        outSlope: {x: 0.0011846429, y: -0.0013107061, z: 0.0012496845, w: 0.00033639517}
        tangentMode: 0
        weightedMode: 0
        inWeight: {x: 0.33333334, y: 0.33333334, z: 0.33333334, w: 0.33333334}
        outWeight: {x: 0.33333334, y: 0.33333334, z: 0.33333334, w: 0.33333334}
      - serializedVersion: 3
        time: 2.3666668
        value: {x: 0.72103596, y: 0.6568934, z: 0.06520801, w: -0.21058561}
        inSlope: {x: -0.0052008084, y: 0.0013330592, z: 0.008052111, w: -0.011150625}
        outSlope: {x: -0.0052008084, y: 0.0013330592, z: 0.008052111, w: -0.011150625}
        tangentMode: 0
        weightedMode: 0
        inWeight: {x: 0.33333334, y: 0.33333334, z: 0.33333334, w: 0.33333334}
        outWeight: {x: 0.33333334, y: 0.33333334, z: 0.33333334, w: 0.33333334}
      - serializedVersion: 3
        time: 3.1000001
        value: {x: 0.71851265, y: 0.6584725, z: 0.06656067, w: -0.21382992}
        inSlope: {x: -0.001140834, y: 0.0021654388, z: -0.004360829, w: 0.0014752164}
        outSlope: {x: -0.001140834, y: 0.0021654388, z: -0.004360829, w: 0.0014752164}
        tangentMode: 0
        weightedMode: 0
        inWeight: {x: 0.33333334, y: 0.33333334, z: 0.33333334, w: 0.33333334}
        outWeight: {x: 0.33333334, y: 0.33333334, z: 0.33333334, w: 0.33333334}
      m_PreInfinity: 2
      m_PostInfinity: 2
      m_RotationOrder: 4
    path: Root/Pelvis/Thigh_R/calf_r/Foot_R
  - curve:
      serializedVersion: 2
      m_Curve:
      - serializedVersion: 3
        time: 0
        value: {x: -0.000000018441686, y: -0.0000000094511075, z: -0.27018794, w: 0.9628076}
        inSlope: {x: 0, y: 0, z: 0, w: 0}
        outSlope: {x: 0, y: 0, z: 0, w: 0}
        tangentMode: 0
        weightedMode: 0
        inWeight: {x: 0.33333334, y: 0.33333334, z: 0.33333334, w: 0.33333334}
        outWeight: {x: 0.33333334, y: 0.33333334, z: 0.33333334, w: 0.33333334}
      - serializedVersion: 3
        time: 3.1000001
        value: {x: -0.000000018441686, y: -0.0000000094511075, z: -0.27018794, w: 0.9628076}
        inSlope: {x: 0, y: 0, z: 0, w: 0}
        outSlope: {x: 0, y: 0, z: 0, w: 0}
        tangentMode: 0
        weightedMode: 0
        inWeight: {x: 0.33333334, y: 0.33333334, z: 0.33333334, w: 0.33333334}
        outWeight: {x: 0.33333334, y: 0.33333334, z: 0.33333334, w: 0.33333334}
      m_PreInfinity: 2
      m_PostInfinity: 2
      m_RotationOrder: 4
    path: Root/Pelvis/Thigh_R/calf_r/Foot_R/ball_r
  - curve:
      serializedVersion: 2
      m_Curve:
      - serializedVersion: 3
        time: 0
        value: {x: -0.36859062, y: -0.12353044, z: -0.13237453, w: 0.91178846}
        inSlope: {x: 0.0030907986, y: -0.006805211, z: -0.00858888, w: -0.0009208917}
        outSlope: {x: 0.0030907986, y: -0.006805211, z: -0.00858888, w: -0.0009208917}
        tangentMode: 0
        weightedMode: 0
        inWeight: {x: 0.33333334, y: 0.33333334, z: 0.33333334, w: 0.33333334}
        outWeight: {x: 0.33333334, y: 0.33333334, z: 0.33333334, w: 0.33333334}
      - serializedVersion: 3
        time: 1.6333334
        value: {x: -0.36714652, y: -0.1161323, z: -0.13446264, w: 0.913037}
        inSlope: {x: 0.0018686075, y: -0.007013536, z: -0.00033728813, w: -0.00018954295}
        outSlope: {x: 0.0018686075, y: -0.007013536, z: -0.00033728813, w: -0.00018954295}
        tangentMode: 0
        weightedMode: 0
        inWeight: {x: 0.33333334, y: 0.33333334, z: 0.33333334, w: 0.33333334}
        outWeight: {x: 0.33333334, y: 0.33333334, z: 0.33333334, w: 0.33333334}
      - serializedVersion: 3
        time: 3.1000001
        value: {x: -0.36839312, y: -0.12367658, z: -0.13284756, w: 0.9117797}
        inSlope: {x: -0.005480652, y: 0.0007921465, z: 0.002850744, w: -0.0016897933}
        outSlope: {x: -0.005480652, y: 0.0007921465, z: 0.002850744, w: -0.0016897933}
        tangentMode: 0
        weightedMode: 0
        inWeight: {x: 0.33333334, y: 0.33333334, z: 0.33333334, w: 0.33333334}
        outWeight: {x: 0.33333334, y: 0.33333334, z: 0.33333334, w: 0.33333334}
      m_PreInfinity: 2
      m_PostInfinity: 2
      m_RotationOrder: 4
    path: Root/Pelvis/Thigh_L
  - curve:
      serializedVersion: 2
      m_Curve:
      - serializedVersion: 3
        time: 0
        value: {x: 0.6328366, y: 0.17912562, z: -0.12844968, w: 0.7422483}
        inSlope: {x: 0.007190108, y: 0.016310066, z: 0.015049427, w: -0.007472634}
        outSlope: {x: 0.007190108, y: 0.016310066, z: 0.015049427, w: -0.007472634}
        tangentMode: 0
        weightedMode: 0
        inWeight: {x: 0.33333334, y: 0.33333334, z: 0.33333334, w: 0.33333334}
        outWeight: {x: 0.33333334, y: 0.33333334, z: 0.33333334, w: 0.33333334}
      - serializedVersion: 3
        time: 1.1666667
        value: {x: 0.6341667, y: 0.17114288, z: -0.12033835, w: 0.744353}
        inSlope: {x: -0.007814176, y: -0.006710223, z: 0.013473978, w: 0.010377477}
        outSlope: {x: -0.007814176, y: -0.006710223, z: 0.013473978, w: 0.010377477}
        tangentMode: 0
        weightedMode: 0
        inWeight: {x: 0.33333334, y: 0.33333334, z: 0.33333334, w: 0.33333334}
        outWeight: {x: 0.33333334, y: 0.33333334, z: 0.33333334, w: 0.33333334}
      - serializedVersion: 3
        time: 2.3000002
        value: {x: 0.6283109, y: 0.17564382, z: -0.12062182, w: 0.74821466}
        inSlope: {x: 0.0009682783, y: 0.008085974, z: -0.009954246, w: -0.0043156785}
        outSlope: {x: 0.0009682783, y: 0.008085974, z: -0.009954246, w: -0.0043156785}
        tangentMode: 0
        weightedMode: 0
        inWeight: {x: 0.33333334, y: 0.33333334, z: 0.33333334, w: 0.33333334}
        outWeight: {x: 0.33333334, y: 0.33333334, z: 0.33333334, w: 0.33333334}
      - serializedVersion: 3
        time: 3.1000001
        value: {x: 0.6327444, y: 0.17952791, z: -0.12761156, w: 0.7423743}
        inSlope: {x: 0.0069004362, y: 0.0011050712, z: -0.007085062, w: -0.007363565}
        outSlope: {x: 0.0069004362, y: 0.0011050712, z: -0.007085062, w: -0.007363565}
        tangentMode: 0
        weightedMode: 0
        inWeight: {x: 0.33333334, y: 0.33333334, z: 0.33333334, w: 0.33333334}
        outWeight: {x: 0.33333334, y: 0.33333334, z: 0.33333334, w: 0.33333334}
      m_PreInfinity: 2
      m_PostInfinity: 2
      m_RotationOrder: 4
    path: Root/Pelvis/Thigh_L/calf_l
  - curve:
      serializedVersion: 2
      m_Curve:
      - serializedVersion: 3
        time: 0
        value: {x: 0.85846967, y: 0.50359875, z: 0.033606473, w: -0.09104263}
        inSlope: {x: 0.0020384789, y: -0.00065445894, z: 0.0066172327, w: 0.018114967}
        outSlope: {x: 0.0020384789, y: -0.00065445894, z: 0.0066172327, w: 0.018114967}
        tangentMode: 0
        weightedMode: 0
        inWeight: {x: 0.33333334, y: 0.33333334, z: 0.33333334, w: 0.33333334}
        outWeight: {x: 0.33333334, y: 0.33333334, z: 0.33333334, w: 0.33333334}
      - serializedVersion: 3
        time: 1.6333334
        value: {x: 0.8621398, y: 0.49670312, z: 0.034843676, w: -0.09373821}
        inSlope: {x: -0.0026920463, y: 0.0042660576, z: -0.000018272578, w: -0.0021599627}
        outSlope: {x: -0.0026920463, y: 0.0042660576, z: -0.000018272578, w: -0.0021599627}
        tangentMode: 0
        weightedMode: 0
        inWeight: {x: 0.33333334, y: 0.33333334, z: 0.33333334, w: 0.33333334}
        outWeight: {x: 0.33333334, y: 0.33333334, z: 0.33333334, w: 0.33333334}
      - serializedVersion: 3
        time: 2.8000002
        value: {x: 0.8589, y: 0.50290704, z: 0.03354559, w: -0.0908293}
        inSlope: {x: -0.0013527287, y: 0.0037524141, z: -0.0043823984, w: 0.0063501364}
        outSlope: {x: -0.0013527287, y: 0.0037524141, z: -0.0043823984, w: 0.0063501364}
        tangentMode: 0
        weightedMode: 0
        inWeight: {x: 0.33333334, y: 0.33333334, z: 0.33333334, w: 0.33333334}
        outWeight: {x: 0.33333334, y: 0.33333334, z: 0.33333334, w: 0.33333334}
      - serializedVersion: 3
        time: 3.1000001
        value: {x: 0.85853106, y: 0.50350636, z: 0.03397529, w: -0.09083737}
        inSlope: {x: -0.0007188327, y: 0.0020992777, z: -0.0033133137, w: 0.0036171859}
        outSlope: {x: -0.0007188327, y: 0.0020992777, z: -0.0033133137, w: 0.0036171859}
        tangentMode: 0
        weightedMode: 0
        inWeight: {x: 0.33333334, y: 0.33333334, z: 0.33333334, w: 0.33333334}
        outWeight: {x: 0.33333334, y: 0.33333334, z: 0.33333334, w: 0.33333334}
      m_PreInfinity: 2
      m_PostInfinity: 2
      m_RotationOrder: 4
    path: Root/Pelvis/Thigh_L/calf_l/Foot_L
  - curve:
      serializedVersion: 2
      m_Curve:
      - serializedVersion: 3
        time: 0
        value: {x: -0.000000010289591, y: -0.000000072621276, z: -0.27001628, w: 0.9628558}
        inSlope: {x: 0, y: 0, z: 0, w: 0}
        outSlope: {x: 0, y: 0, z: 0, w: 0}
        tangentMode: 0
        weightedMode: 0
        inWeight: {x: 0.33333334, y: 0.33333334, z: 0.33333334, w: 0.33333334}
        outWeight: {x: 0.33333334, y: 0.33333334, z: 0.33333334, w: 0.33333334}
      - serializedVersion: 3
        time: 3.1000001
        value: {x: -0.000000010289591, y: -0.000000072621276, z: -0.27001628, w: 0.9628558}
        inSlope: {x: 0, y: 0, z: 0, w: 0}
        outSlope: {x: 0, y: 0, z: 0, w: 0}
        tangentMode: 0
        weightedMode: 0
        inWeight: {x: 0.33333334, y: 0.33333334, z: 0.33333334, w: 0.33333334}
        outWeight: {x: 0.33333334, y: 0.33333334, z: 0.33333334, w: 0.33333334}
      m_PreInfinity: 2
      m_PostInfinity: 2
      m_RotationOrder: 4
    path: Root/Pelvis/Thigh_L/calf_l/Foot_L/ball_l
  - curve:
      serializedVersion: 2
      m_Curve:
      - serializedVersion: 3
        time: 0
        value: {x: -0.7071068, y: 0, z: -0, w: 0.7071068}
        inSlope: {x: 0, y: 0, z: 0, w: 0}
        outSlope: {x: 0, y: 0, z: 0, w: 0}
        tangentMode: 0
        weightedMode: 0
        inWeight: {x: 0.33333334, y: 0.33333334, z: 0.33333334, w: 0.33333334}
        outWeight: {x: 0.33333334, y: 0.33333334, z: 0.33333334, w: 0.33333334}
      - serializedVersion: 3
        time: 0.033333335
        value: {x: -0.7071068, y: 0, z: -0, w: 0.7071068}
        inSlope: {x: 0, y: 0, z: 0, w: 0}
        outSlope: {x: 0, y: 0, z: 0, w: 0}
        tangentMode: 0
        weightedMode: 0
        inWeight: {x: 0.33333334, y: 0.33333334, z: 0.33333334, w: 0.33333334}
        outWeight: {x: 0.33333334, y: 0.33333334, z: 0.33333334, w: 0.33333334}
      m_PreInfinity: 2
      m_PostInfinity: 2
      m_RotationOrder: 4
    path: Root/ik_foot_root
  - curve:
      serializedVersion: 2
      m_Curve:
      - serializedVersion: 3
        time: 0
        value: {x: -0.7071068, y: 0, z: -0, w: 0.7071068}
        inSlope: {x: 0, y: 0, z: 0, w: 0}
        outSlope: {x: 0, y: 0, z: 0, w: 0}
        tangentMode: 0
        weightedMode: 0
        inWeight: {x: 0.33333334, y: 0.33333334, z: 0.33333334, w: 0.33333334}
        outWeight: {x: 0.33333334, y: 0.33333334, z: 0.33333334, w: 0.33333334}
      - serializedVersion: 3
        time: 0.033333335
        value: {x: -0.7071068, y: 0, z: -0, w: 0.7071068}
        inSlope: {x: 0, y: 0, z: 0, w: 0}
        outSlope: {x: 0, y: 0, z: 0, w: 0}
        tangentMode: 0
        weightedMode: 0
        inWeight: {x: 0.33333334, y: 0.33333334, z: 0.33333334, w: 0.33333334}
        outWeight: {x: 0.33333334, y: 0.33333334, z: 0.33333334, w: 0.33333334}
      m_PreInfinity: 2
      m_PostInfinity: 2
      m_RotationOrder: 4
    path: Root/ik_hand_root
  - curve:
      serializedVersion: 2
      m_Curve:
      - serializedVersion: 3
        time: 0
        value: {x: 0.7071068, y: -0, z: -0, w: 0.7071068}
        inSlope: {x: 0, y: 0, z: 0, w: 0}
        outSlope: {x: 0, y: 0, z: 0, w: 0}
        tangentMode: 0
        weightedMode: 0
        inWeight: {x: 0.33333334, y: 0.33333334, z: 0.33333334, w: 0.33333334}
        outWeight: {x: 0.33333334, y: 0.33333334, z: 0.33333334, w: 0.33333334}
      - serializedVersion: 3
        time: 0.033333335
        value: {x: 0.7071068, y: -0, z: -0, w: 0.7071068}
        inSlope: {x: 0, y: 0, z: 0, w: 0}
        outSlope: {x: 0, y: 0, z: 0, w: 0}
        tangentMode: 0
        weightedMode: 0
        inWeight: {x: 0.33333334, y: 0.33333334, z: 0.33333334, w: 0.33333334}
        outWeight: {x: 0.33333334, y: 0.33333334, z: 0.33333334, w: 0.33333334}
      m_PreInfinity: 2
      m_PostInfinity: 2
      m_RotationOrder: 4
    path: Root/ik_hand_root/ik_hand_gun
  m_CompressedRotationCurves: []
  m_EulerCurves: []
  m_PositionCurves:
  - curve:
      serializedVersion: 2
      m_Curve:
      - serializedVersion: 3
        time: 0
        value: {x: 0.11775327, y: -0.006664734, z: 0.17875263}
        inSlope: {x: -0.0022466518, y: -0.0011582696, z: -0.0023637766}
        outSlope: {x: -0.0022466518, y: -0.0011582696, z: -0.0023637766}
        tangentMode: 0
        weightedMode: 0
        inWeight: {x: 0.33333334, y: 0.33333334, z: 0.33333334}
        outWeight: {x: 0.33333334, y: 0.33333334, z: 0.33333334}
      - serializedVersion: 3
        time: 0.4
        value: {x: 0.11639074, y: -0.006517868, z: 0.17845416}
        inSlope: {x: -0.002197211, y: 0.0017567369, z: 0.00019591193}
        outSlope: {x: -0.0021949494, y: 0.0017565351, z: 0.0001925332}
        tangentMode: 0
        weightedMode: 0
        inWeight: {x: 0.33333334, y: 0.33333334, z: 0.33333334}
        outWeight: {x: 0.33333334, y: 0.33333334, z: 0.33333334}
      - serializedVersion: 3
        time: 0.6333333
        value: {x: 0.11585469, y: -0.0061572264, z: 0.17865153}
        inSlope: {x: -0.0022173491, y: 0.0009199584, z: 0.0011211677}
        outSlope: {x: -0.0022173177, y: 0.0009201449, z: 0.0011203755}
        tangentMode: 0
        weightedMode: 0
        inWeight: {x: 0.33333334, y: 0.33333334, z: 0.33333334}
        outWeight: {x: 0.33333334, y: 0.33333334, z: 0.33333334}
      - serializedVersion: 3
        time: 1.2666667
        value: {x: 0.114812724, y: -0.005216522, z: 0.17986424}
        inSlope: {x: -0.0013431151, y: 0.0018035289, z: 0.0013310579}
        outSlope: {x: -0.0013414257, y: 0.0018035239, z: 0.0013228564}
        tangentMode: 0
        weightedMode: 0
        inWeight: {x: 0.33333334, y: 0.33333334, z: 0.33333334}
        outWeight: {x: 0.33333334, y: 0.33333334, z: 0.33333334}
      - serializedVersion: 3
        time: 1.6
        value: {x: 0.11502962, y: -0.0050678253, z: 0.17895897}
        inSlope: {x: 0.0037518942, y: -0.0012404596, z: -0.0056764917}
        outSlope: {x: 0.0037524935, y: -0.0012406427, z: -0.005675239}
        tangentMode: 0
        weightedMode: 0
        inWeight: {x: 0.33333334, y: 0.33333334, z: 0.33333334}
        outWeight: {x: 0.33333334, y: 0.33333334, z: 0.33333334}
      - serializedVersion: 3
        time: 1.9
        value: {x: 0.11628444, y: -0.005330124, z: 0.17775768}
        inSlope: {x: 0.004174726, y: -0.00118543, z: -0.0013073251}
        outSlope: {x: 0.0041752574, y: -0.0011854683, z: -0.0013045731}
        tangentMode: 0
        weightedMode: 0
        inWeight: {x: 0.33333334, y: 0.33333334, z: 0.33333334}
        outWeight: {x: 0.33333334, y: 0.33333334, z: 0.33333334}
      - serializedVersion: 3
        time: 2.1666667
        value: {x: 0.1173032, y: -0.005672531, z: 0.17722204}
        inSlope: {x: 0.003181215, y: -0.0025462997, z: -0.0021535072}
        outSlope: {x: 0.0031828496, y: -0.0025462827, z: -0.0021510278}
        tangentMode: 0
        weightedMode: 0
        inWeight: {x: 0.33333334, y: 0.33333334, z: 0.33333334}
        outWeight: {x: 0.33333334, y: 0.33333334, z: 0.33333334}
      - serializedVersion: 3
        time: 2.3333333
        value: {x: 0.11778836, y: -0.006015854, z: 0.17704445}
        inSlope: {x: 0.0025158902, y: -0.0010151727, z: 0.00017899122}
        outSlope: {x: 0.0025171707, y: -0.0010151173, z: 0.0001789639}
        tangentMode: 0
        weightedMode: 0
        inWeight: {x: 0.33333334, y: 0.33333334, z: 0.33333334}
        outWeight: {x: 0.33333334, y: 0.33333334, z: 0.33333334}
      - serializedVersion: 3
        time: 2.7
        value: {x: 0.11825658, y: -0.006427231, z: 0.17771156}
        inSlope: {x: -0.00024836423, y: -0.0006867602, z: 0.0026890095}
        outSlope: {x: -0.00024682473, y: -0.00068665965, z: 0.002692143}
        tangentMode: 0
        weightedMode: 0
        inWeight: {x: 0.33333334, y: 0.33333334, z: 0.33333334}
        outWeight: {x: 0.33333334, y: 0.33333334, z: 0.33333334}
      - serializedVersion: 3
        time: 3.1
        value: {x: 0.11775172, y: -0.006648483, z: 0.17857738}
        inSlope: {x: -0.004090857, y: -0.000441721, z: 0.00008615776}
        outSlope: {x: -0.004090857, y: -0.000441721, z: 0.00008615776}
        tangentMode: 0
        weightedMode: 0
        inWeight: {x: 0.33333334, y: 0.33333334, z: 0.33333334}
        outWeight: {x: 0.33333334, y: 0.33333334, z: 0.33333334}
      m_PreInfinity: 2
      m_PostInfinity: 2
      m_RotationOrder: 4
    path: Root
  m_ScaleCurves: []
  m_FloatCurves: []
  m_PPtrCurves: []
  m_SampleRate: 30
  m_WrapMode: 0
  m_Bounds:
    m_Center: {x: 0, y: 0, z: 0}
    m_Extent: {x: 0, y: 0, z: 0}
  m_ClipBindingConstant:
    genericBindings: []
    pptrCurveMapping: []
  m_AnimationClipSettings:
    serializedVersion: 2
    m_AdditiveReferencePoseClip: {fileID: 0}
    m_AdditiveReferencePoseTime: 0
    m_StartTime: 0
    m_StopTime: 3.1000001
    m_OrientationOffsetY: 0
    m_Level: 0
    m_CycleOffset: 0
    m_HasAdditiveReferencePose: 0
    m_LoopTime: 0
    m_LoopBlend: 0
    m_LoopBlendOrientation: 0
    m_LoopBlendPositionY: 0
    m_LoopBlendPositionXZ: 0
    m_KeepOriginalOrientation: 0
    m_KeepOriginalPositionY: 1
    m_KeepOriginalPositionXZ: 0
    m_HeightFromFeet: 0
    m_Mirror: 0
  m_EditorCurves: []
  m_EulerEditorCurves: []
  m_HasGenericRootTransform: 0
  m_HasMotionFloatCurves: 0
  m_Events: []
