%YAML 1.1
%TAG !u! tag:unity3d.com,2011:
--- !u!114 &11400000
MonoBehaviour:
  m_ObjectHideFlags: 0
  m_CorrespondingSourceObject: {fileID: 0}
  m_PrefabInstance: {fileID: 0}
  m_PrefabAsset: {fileID: 0}
  m_GameObject: {fileID: 0}
  m_Enabled: 1
  m_EditorHideFlags: 0
  m_Script: {fileID: 11500000, guid: a908067d838a44c498824c6ce15bde6e, type: 3}
  m_Name: BrocolitemData
  m_EditorClassIdentifier: 
  Name: Brocoli
  Description: 
  prefab: {fileID: 0}
  Icon: {fileID: 0}
  Position: {x: 0, y: 0, z: 0}
  Rotation: {x: 0, y: 0, z: 0, w: 0}
  Clip: {fileID: 8300000, guid: 8069b3f1e2650ec4a9ab173b8b2d6e70, type: 3}
  Damage: 100
