%YAML 1.1
%TAG !u! tag:unity3d.com,2011:
--- !u!114 &11400000
MonoBehaviour:
  m_ObjectHideFlags: 0
  m_CorrespondingSourceObject: {fileID: 0}
  m_PrefabInstance: {fileID: 0}
  m_PrefabAsset: {fileID: 0}
  m_GameObject: {fileID: 0}
  m_Enabled: 1
  m_EditorHideFlags: 0
  m_Script: {fileID: 11500000, guid: ee46a71d110b650489cc93da2b4c6ae3, type: 3}
  m_Name: WeaponAttackState
  m_EditorClassIdentifier: 
  Action: {fileID: 11400000, guid: 628683c774b84bb44a3f962768b8a806, type: 2}
  ScriptableStateTransitor:
  - {fileID: 11400000, guid: 857f6886b323ab24abe787b0f707a0bf, type: 2}
