Library\Bee\artifacts\mvdfrm\UnityEditor.TestRunner.ref.dll_193EC4CE382CBFB3.mvfrm
Library\Bee\artifacts\mvdfrm\UnityEditor.UI.ref.dll_4C98D3F7040CD4F5.mvfrm
Library\Bee\artifacts\mvdfrm\UnityEngine.TestRunner.ref.dll_E55D0F7C63F01D9E.mvfrm
Library\Bee\artifacts\mvdfrm\UnityEngine.UI.ref.dll_08FEAA520A2EFD60.mvfrm
Library\Bee\artifacts\mvdfrm\UnityEditor.Graphs.dll_AF60105F70F45464.mvfrm
Library\Bee\artifacts\mvdfrm\UnityEditor.CoreModule.dll_E0002DF0DE4C7C32.mvfrm
Library\Bee\artifacts\mvdfrm\UnityEditor.DeviceSimulatorModule.dll_950BE4CC050E262F.mvfrm
Library\Bee\artifacts\mvdfrm\UnityEditor.DiagnosticsModule.dll_E7F67448907EB4BD.mvfrm
Library\Bee\artifacts\mvdfrm\UnityEditor.dll_F5D4446D60DAB6C3.mvfrm
Library\Bee\artifacts\mvdfrm\UnityEditor.GraphViewModule.dll_2312EED6814922F4.mvfrm
Library\Bee\artifacts\mvdfrm\UnityEditor.PackageManagerUIModule.dll_7E9C3142A4FC7F0E.mvfrm
Library\Bee\artifacts\mvdfrm\UnityEditor.QuickSearchModule.dll_7305F555E955B116.mvfrm
Library\Bee\artifacts\mvdfrm\UnityEditor.SceneTemplateModule.dll_B93C21D449C78E57.mvfrm
Library\Bee\artifacts\mvdfrm\UnityEditor.TextCoreFontEngineModule.dll_706191CC6CE4AD70.mvfrm
Library\Bee\artifacts\mvdfrm\UnityEditor.TextCoreTextEngineModule.dll_B849C83DFC68668E.mvfrm
Library\Bee\artifacts\mvdfrm\UnityEditor.UIBuilderModule.dll_779B9BF2F4019C28.mvfrm
Library\Bee\artifacts\mvdfrm\UnityEditor.UIElementsModule.dll_F046BFBFE087322E.mvfrm
Library\Bee\artifacts\mvdfrm\UnityEditor.UIElementsSamplesModule.dll_C544C66DE7A86C1F.mvfrm
Library\Bee\artifacts\mvdfrm\UnityEditor.UIServiceModule.dll_B08DAD55DD38EC42.mvfrm
Library\Bee\artifacts\mvdfrm\UnityEditor.UnityConnectModule.dll_4E2FE82C26ED43E8.mvfrm
Library\Bee\artifacts\mvdfrm\UnityEngine.AccessibilityModule.dll_EBE18D6B4A3DB5F4.mvfrm
Library\Bee\artifacts\mvdfrm\UnityEngine.AIModule.dll_79E7765F24C1B846.mvfrm
Library\Bee\artifacts\mvdfrm\UnityEngine.AndroidJNIModule.dll_6E8FA89329A6A104.mvfrm
Library\Bee\artifacts\mvdfrm\UnityEngine.AnimationModule.dll_F1986AFF5BA5F79A.mvfrm
Library\Bee\artifacts\mvdfrm\UnityEngine.ARModule.dll_335A3B6281DF170F.mvfrm
Library\Bee\artifacts\mvdfrm\UnityEngine.AssetBundleModule.dll_B6EF28474BBC6608.mvfrm
Library\Bee\artifacts\mvdfrm\UnityEngine.AudioModule.dll_8688175365D8E20C.mvfrm
Library\Bee\artifacts\mvdfrm\UnityEngine.ClothModule.dll_ED70744E3FF5C0F0.mvfrm
Library\Bee\artifacts\mvdfrm\UnityEngine.ClusterInputModule.dll_CDCC5D41D87516AE.mvfrm
Library\Bee\artifacts\mvdfrm\UnityEngine.ClusterRendererModule.dll_9AB8A73D74C933B3.mvfrm
Library\Bee\artifacts\mvdfrm\UnityEngine.CoreModule.dll_032101438651E75D.mvfrm
Library\Bee\artifacts\mvdfrm\UnityEngine.CrashReportingModule.dll_70717F67F7DE3715.mvfrm
Library\Bee\artifacts\mvdfrm\UnityEngine.DirectorModule.dll_FD10B63A74B2A4BA.mvfrm
Library\Bee\artifacts\mvdfrm\UnityEngine.dll_28788B45BF4E43A8.mvfrm
Library\Bee\artifacts\mvdfrm\UnityEngine.DSPGraphModule.dll_026217A3E71375DB.mvfrm
Library\Bee\artifacts\mvdfrm\UnityEngine.GameCenterModule.dll_98DCF2ADEFE791F5.mvfrm
Library\Bee\artifacts\mvdfrm\UnityEngine.GIModule.dll_1223BF6CC070A060.mvfrm
Library\Bee\artifacts\mvdfrm\UnityEngine.GridModule.dll_E0921D319EA67D54.mvfrm
Library\Bee\artifacts\mvdfrm\UnityEngine.HotReloadModule.dll_72E1290536D9131C.mvfrm
Library\Bee\artifacts\mvdfrm\UnityEngine.ImageConversionModule.dll_06AAA4EDF6EDEBA7.mvfrm
Library\Bee\artifacts\mvdfrm\UnityEngine.IMGUIModule.dll_BEE7B6BA2C0A75ED.mvfrm
Library\Bee\artifacts\mvdfrm\UnityEngine.InputLegacyModule.dll_48344365E3AE1BF9.mvfrm
Library\Bee\artifacts\mvdfrm\UnityEngine.InputModule.dll_ECFDDF03DC1106B0.mvfrm
Library\Bee\artifacts\mvdfrm\UnityEngine.JSONSerializeModule.dll_4BF916A74979167E.mvfrm
Library\Bee\artifacts\mvdfrm\UnityEngine.LocalizationModule.dll_0C1927946FF109A7.mvfrm
Library\Bee\artifacts\mvdfrm\UnityEngine.NVIDIAModule.dll_AA090D8983955969.mvfrm
Library\Bee\artifacts\mvdfrm\UnityEngine.ParticleSystemModule.dll_C383C8B465EFC2A3.mvfrm
Library\Bee\artifacts\mvdfrm\UnityEngine.PerformanceReportingModule.dll_2ABB63F658BE191C.mvfrm
Library\Bee\artifacts\mvdfrm\UnityEngine.Physics2DModule.dll_3E3E5AEFFCA2EF2F.mvfrm
Library\Bee\artifacts\mvdfrm\UnityEngine.PhysicsModule.dll_5D4A2A3044E2865D.mvfrm
Library\Bee\artifacts\mvdfrm\UnityEngine.ProfilerModule.dll_2F56EF710E0C2BC7.mvfrm
Library\Bee\artifacts\mvdfrm\UnityEngine.RuntimeInitializeOnLoadManagerInitializerModule.dll_D8D6E3D5FBC13DF8.mvfrm
Library\Bee\artifacts\mvdfrm\UnityEngine.ScreenCaptureModule.dll_65E0C42C5DE542E0.mvfrm
Library\Bee\artifacts\mvdfrm\UnityEngine.SharedInternalsModule.dll_8ABBE3C36E1BE6F7.mvfrm
Library\Bee\artifacts\mvdfrm\UnityEngine.SpriteMaskModule.dll_8209653E1157276F.mvfrm
Library\Bee\artifacts\mvdfrm\UnityEngine.SpriteShapeModule.dll_D05055A2015E9E12.mvfrm
Library\Bee\artifacts\mvdfrm\UnityEngine.StreamingModule.dll_A62D584FAB2DAED8.mvfrm
Library\Bee\artifacts\mvdfrm\UnityEngine.SubstanceModule.dll_82D86C98F680ACE6.mvfrm
Library\Bee\artifacts\mvdfrm\UnityEngine.SubsystemsModule.dll_ECB6CB9FDF9F0F82.mvfrm
Library\Bee\artifacts\mvdfrm\UnityEngine.TerrainModule.dll_7790A59F1AA0CF4B.mvfrm
Library\Bee\artifacts\mvdfrm\UnityEngine.TerrainPhysicsModule.dll_C3FE71877F32BD30.mvfrm
Library\Bee\artifacts\mvdfrm\UnityEngine.TextCoreFontEngineModule.dll_EEC10D1F7FE26C3B.mvfrm
Library\Bee\artifacts\mvdfrm\UnityEngine.TextCoreTextEngineModule.dll_36A943910F662559.mvfrm
Library\Bee\artifacts\mvdfrm\UnityEngine.TextRenderingModule.dll_8F203637151CC2D5.mvfrm
Library\Bee\artifacts\mvdfrm\UnityEngine.TilemapModule.dll_168D0D20325DB054.mvfrm
Library\Bee\artifacts\mvdfrm\UnityEngine.TLSModule.dll_8A397BA0F83C77F1.mvfrm
Library\Bee\artifacts\mvdfrm\UnityEngine.UIElementsModule.dll_F0F52D07E2CB4B79.mvfrm
Library\Bee\artifacts\mvdfrm\UnityEngine.UIElementsNativeModule.dll_C915E5D81674EF30.mvfrm
Library\Bee\artifacts\mvdfrm\UnityEngine.UIModule.dll_755B148C8108BDF2.mvfrm
Library\Bee\artifacts\mvdfrm\UnityEngine.UmbraModule.dll_015CC36BF2FF8D7F.mvfrm
Library\Bee\artifacts\mvdfrm\UnityEngine.UNETModule.dll_95C7492CD360DCD6.mvfrm
Library\Bee\artifacts\mvdfrm\UnityEngine.UnityAnalyticsCommonModule.dll_C5FA213A72A6B77A.mvfrm
Library\Bee\artifacts\mvdfrm\UnityEngine.UnityAnalyticsModule.dll_E323397E1217149F.mvfrm
Library\Bee\artifacts\mvdfrm\UnityEngine.UnityConnectModule.dll_3B8F6C3B21754493.mvfrm
Library\Bee\artifacts\mvdfrm\UnityEngine.UnityCurlModule.dll_24B50C30CBB9E987.mvfrm
Library\Bee\artifacts\mvdfrm\UnityEngine.UnityTestProtocolModule.dll_81077C6041A3C175.mvfrm
Library\Bee\artifacts\mvdfrm\UnityEngine.UnityWebRequestAssetBundleModule.dll_B26A37EFAEB716B0.mvfrm
Library\Bee\artifacts\mvdfrm\UnityEngine.UnityWebRequestAudioModule.dll_A2B7B7D4DF28E3B4.mvfrm
Library\Bee\artifacts\mvdfrm\UnityEngine.UnityWebRequestModule.dll_1849AC9801E28626.mvfrm
Library\Bee\artifacts\mvdfrm\UnityEngine.UnityWebRequestTextureModule.dll_CC7B2D75257FB809.mvfrm
Library\Bee\artifacts\mvdfrm\UnityEngine.UnityWebRequestWWWModule.dll_016B88ECFF25E1C5.mvfrm
Library\Bee\artifacts\mvdfrm\UnityEngine.VehiclesModule.dll_74D3AFB9EEDC7455.mvfrm
Library\Bee\artifacts\mvdfrm\UnityEngine.VFXModule.dll_0B18140FCEA9E15E.mvfrm
Library\Bee\artifacts\mvdfrm\UnityEngine.VideoModule.dll_AB919BBE286AFDB1.mvfrm
Library\Bee\artifacts\mvdfrm\UnityEngine.VirtualTexturingModule.dll_EDA29A46EF236FBB.mvfrm
Library\Bee\artifacts\mvdfrm\UnityEngine.VRModule.dll_C82D3B1222C3436A.mvfrm
Library\Bee\artifacts\mvdfrm\UnityEngine.WindModule.dll_796FDC6C178865C6.mvfrm
Library\Bee\artifacts\mvdfrm\UnityEngine.XRModule.dll_FAEBFE16ABFD90C8.mvfrm
Library\Bee\artifacts\mvdfrm\Unity.Android.Gradle.dll_E38D26042FD8DF1A.mvfrm
Library\Bee\artifacts\mvdfrm\Unity.Android.Types.dll_E1AA00C33B91C9C2.mvfrm
Library\Bee\artifacts\mvdfrm\UnityEditor.Android.Extensions.dll_F6EF2005212BFF9A.mvfrm
Library\Bee\artifacts\mvdfrm\UnityEditor.WebGL.Extensions.dll_922BEACCB3C5C29E.mvfrm
Library\Bee\artifacts\mvdfrm\UnityEditor.WindowsStandalone.Extensions.dll_9EA430CD1BAE5A8E.mvfrm
Library\Bee\artifacts\mvdfrm\Unity.Plastic.Newtonsoft.Json.dll_E7A56C848FA83FC9.mvfrm